UnstableConsole Output

Skipping 2,923 KB.. Full Log
.dataone.integration.ContextAwareTestCaseDataone]
20171030-17:24:12: [INFO]: created client for certificate file: cnSandboxORC1 with subject: CN=urn:node:cnSandboxORC1,DC=dataone,DC=org [org.dataone.integration.ContextAwareTestCaseDataone]
20171030-17:24:12: [INFO]: RestClient.doRequestNoBody, thread(1) call Info: GET https://mn-sandbox-orc-1.test.dataone.org/mn/v2/monitor/ping [org.dataone.client.rest.RestClient]
20171030-17:24:12: [INFO]: MN excluded from test: https://mn-sandbox-orc-1.test.dataone.org/mn [org.dataone.integration.ContextAwareTestCaseDataone]
20171030-17:24:12: [INFO]: created client for certificate file: cnSandboxORC1 with subject: CN=urn:node:cnSandboxORC1,DC=dataone,DC=org [org.dataone.integration.ContextAwareTestCaseDataone]
20171030-17:24:12: [INFO]: RestClient.doRequestNoBody, thread(1) call Info: GET http://usgs.ornl.gov/USGS_MN/mn/v2/monitor/ping [org.dataone.client.rest.RestClient]
20171030-17:24:12: [INFO]: MN excluded from test: http://usgs.ornl.gov/USGS_MN/mn [org.dataone.integration.ContextAwareTestCaseDataone]
20171030-17:24:12: [INFO]: created client for certificate file: cnSandboxORC1 with subject: CN=urn:node:cnSandboxORC1,DC=dataone,DC=org [org.dataone.integration.ContextAwareTestCaseDataone]
20171030-17:24:12: [INFO]: RestClient.doRequestNoBody, thread(1) call Info: GET https://alpha.tdar.org/dataone/v2/monitor/ping [org.dataone.client.rest.RestClient]
20171030-17:24:12: [INFO]: MN excluded from test: https://alpha.tdar.org/dataone/ [org.dataone.integration.ContextAwareTestCaseDataone]
20171030-17:24:12: [INFO]: created client for certificate file: cnSandboxORC1 with subject: CN=urn:node:cnSandboxORC1,DC=dataone,DC=org [org.dataone.integration.ContextAwareTestCaseDataone]
20171030-17:24:13: [INFO]: RestClient.doRequestNoBody, thread(1) call Info: GET https://test-prod.bco-dmo.org/d1/mn/v2/monitor/ping [org.dataone.client.rest.RestClient]
20171030-17:24:13: [INFO]: MN excluded from test: https://test-prod.bco-dmo.org/d1/mn [org.dataone.integration.ContextAwareTestCaseDataone]
20171030-17:24:13: [INFO]: created client for certificate file: cnSandboxORC1 with subject: CN=urn:node:cnSandboxORC1,DC=dataone,DC=org [org.dataone.integration.ContextAwareTestCaseDataone]
20171030-17:24:13: [INFO]: RestClient.doRequestNoBody, thread(1) call Info: GET https://ncei-node.test.dataone.org/mn/v2/monitor/ping [org.dataone.client.rest.RestClient]
20171030-17:24:13: [INFO]: MN excluded from test: https://ncei-node.test.dataone.org/mn [org.dataone.integration.ContextAwareTestCaseDataone]
20171030-17:24:13: [INFO]: created client for certificate file: cnSandboxORC1 with subject: CN=urn:node:cnSandboxORC1,DC=dataone,DC=org [org.dataone.integration.ContextAwareTestCaseDataone]
20171030-17:24:13: [INFO]: RestClient.doRequestNoBody, thread(1) call Info: GET https://edacd1mn.unm.edu/mn/v2/monitor/ping [org.dataone.client.rest.RestClient]
20171030-17:24:13: [INFO]: MN excluded from test: https://edacd1mn.unm.edu/mn [org.dataone.integration.ContextAwareTestCaseDataone]
20171030-17:24:13: [INFO]: created client for certificate file: cnSandboxORC1 with subject: CN=urn:node:cnSandboxORC1,DC=dataone,DC=org [org.dataone.integration.ContextAwareTestCaseDataone]
20171030-17:24:13: [INFO]: RestClient.doRequestNoBody, thread(1) call Info: GET https://gmnv2.test.dataone.org/mn/v2/monitor/ping [org.dataone.client.rest.RestClient]
20171030-17:24:13: [INFO]: MN excluded from test: https://gmnv2.test.dataone.org/mn [org.dataone.integration.ContextAwareTestCaseDataone]
20171030-17:24:13: [INFO]: 
***************** running test for testSynchronizationFailed() vs. node: https://mn-sandbox-ucsb-1.test.dataone.org/knb/d1/mn/v2 ***************** [org.dataone.integration.ContextAwareTestCaseDataone]
20171030-17:24:13: [INFO]: Using cached identifier for node urn:node:mnSandboxUCSB1 [org.dataone.integration.ContextAwareTestCaseDataone]
<?xml version="1.0" encoding="UTF-8"?>
<error detailCode="0" errorCode="0" identifier="TierTesting:mn-sandbox-ucsb-1:Public_READ.15" name="SynchronizationFailed">
    <description>a message</description>
</error>

20171030-17:24:13: [INFO]: RestClient.doRequestMMPBody, thread(1) call Info: POST https://mn-sandbox-ucsb-1.test.dataone.org/knb/d1/mn/v2/error; MMP message has: FilePart:message = /tmp/mmp.output.7662572281801230605.tmp (213 bytes);  [org.dataone.client.rest.RestClient]
20171030-17:24:13: [INFO]: 
***************** running test for testSynchronizationFailed() vs. node: https://mn-sandbox-ucsb-2.test.dataone.org/knb/d1/mn/v2 ***************** [org.dataone.integration.ContextAwareTestCaseDataone]
20171030-17:24:13: [INFO]: Using cached identifier for node urn:node:mnSandboxUCSB2 [org.dataone.integration.ContextAwareTestCaseDataone]
<?xml version="1.0" encoding="UTF-8"?>
<error detailCode="0" errorCode="0" identifier="TierTesting:mn-sandbox-ucsb-2:Public_READ.15" name="SynchronizationFailed">
    <description>a message</description>
</error>

20171030-17:24:13: [INFO]: RestClient.doRequestMMPBody, thread(1) call Info: POST https://mn-sandbox-ucsb-2.test.dataone.org/knb/d1/mn/v2/error; MMP message has: FilePart:message = /tmp/mmp.output.1928894481335057703.tmp (213 bytes);  [org.dataone.client.rest.RestClient]
20171030-17:24:13: [INFO]: **************************************************** [org.dataone.integration.ContextAwareTestCaseDataone]
20171030-17:24:13: [INFO]: ***  context label:   SANDBOX [org.dataone.integration.ContextAwareTestCaseDataone]
20171030-17:24:13: [INFO]: **************************************************** [org.dataone.integration.ContextAwareTestCaseDataone]
20171030-17:24:13: [INFO]: **************************************************** [org.dataone.integration.ContextAwareTestCaseDataone]
                          nodeId  key                       value
=============================================================================================================
         urn:node:mnSandboxUCSB1  objectList_hits           3
         urn:node:mnSandboxUCSB1  publicObject_cacheDate    Mon Oct 30 17:08:13 UTC 2017
         urn:node:mnSandboxUCSB1  publicObject_hits         6
         urn:node:mnSandboxUCSB1  objectList_cacheDate      Mon Oct 30 17:24:01 UTC 2017
         urn:node:mnSandboxUCSB1  publicObject              TierTesting:mn-sandbox-ucsb-1:Public_READ.15
         urn:node:mnSandboxUCSB1  objectList                org.dataone.service.types.v1.ObjectList@61d2f267
=============================================================================================================
         urn:node:mnSandboxUCSB2  objectList_hits           3
         urn:node:mnSandboxUCSB2  publicObject_cacheDate    Mon Oct 30 17:08:17 UTC 2017
         urn:node:mnSandboxUCSB2  publicObject_hits         6
         urn:node:mnSandboxUCSB2  objectList_cacheDate      Mon Oct 30 17:24:01 UTC 2017
         urn:node:mnSandboxUCSB2  publicObject              TierTesting:mn-sandbox-ucsb-2:Public_READ.15
         urn:node:mnSandboxUCSB2  objectList                org.dataone.service.types.v1.ObjectList@26d40c77
=============================================================================================================
20171030-17:24:13: [INFO]: created client for certificate file: cnSandboxORC1 with subject: CN=urn:node:cnSandboxORC1,DC=dataone,DC=org [org.dataone.integration.ContextAwareTestCaseDataone]
20171030-17:24:13: [INFO]: RestClient.doRequestNoBody, thread(1) call Info: GET https://mn-sandbox-ucsb-1.test.dataone.org/knb/d1/mn/v2/monitor/ping [org.dataone.client.rest.RestClient]
20171030-17:24:13: [INFO]: MN included in test: https://mn-sandbox-ucsb-1.test.dataone.org/knb/d1/mn [org.dataone.integration.ContextAwareTestCaseDataone]
20171030-17:24:13: [INFO]: created client for certificate file: cnSandboxORC1 with subject: CN=urn:node:cnSandboxORC1,DC=dataone,DC=org [org.dataone.integration.ContextAwareTestCaseDataone]
20171030-17:24:13: [INFO]: RestClient.doRequestNoBody, thread(1) call Info: GET https://mn-sandbox-ucsb-2.test.dataone.org/knb/d1/mn/v2/monitor/ping [org.dataone.client.rest.RestClient]
20171030-17:24:13: [INFO]: MN included in test: https://mn-sandbox-ucsb-2.test.dataone.org/knb/d1/mn [org.dataone.integration.ContextAwareTestCaseDataone]
20171030-17:24:13: [INFO]: created client for certificate file: cnSandboxORC1 with subject: CN=urn:node:cnSandboxORC1,DC=dataone,DC=org [org.dataone.integration.ContextAwareTestCaseDataone]
20171030-17:24:14: [INFO]: RestClient.doRequestNoBody, thread(1) call Info: GET https://mn-sandbox-orc-1.test.dataone.org/mn/v2/monitor/ping [org.dataone.client.rest.RestClient]
20171030-17:24:14: [INFO]: MN excluded from test: https://mn-sandbox-orc-1.test.dataone.org/mn [org.dataone.integration.ContextAwareTestCaseDataone]
20171030-17:24:14: [INFO]: created client for certificate file: cnSandboxORC1 with subject: CN=urn:node:cnSandboxORC1,DC=dataone,DC=org [org.dataone.integration.ContextAwareTestCaseDataone]
20171030-17:24:14: [INFO]: RestClient.doRequestNoBody, thread(1) call Info: GET http://usgs.ornl.gov/USGS_MN/mn/v2/monitor/ping [org.dataone.client.rest.RestClient]
20171030-17:24:14: [INFO]: MN excluded from test: http://usgs.ornl.gov/USGS_MN/mn [org.dataone.integration.ContextAwareTestCaseDataone]
20171030-17:24:14: [INFO]: created client for certificate file: cnSandboxORC1 with subject: CN=urn:node:cnSandboxORC1,DC=dataone,DC=org [org.dataone.integration.ContextAwareTestCaseDataone]
20171030-17:24:14: [INFO]: RestClient.doRequestNoBody, thread(1) call Info: GET https://alpha.tdar.org/dataone/v2/monitor/ping [org.dataone.client.rest.RestClient]
20171030-17:24:14: [INFO]: MN excluded from test: https://alpha.tdar.org/dataone/ [org.dataone.integration.ContextAwareTestCaseDataone]
20171030-17:24:14: [INFO]: created client for certificate file: cnSandboxORC1 with subject: CN=urn:node:cnSandboxORC1,DC=dataone,DC=org [org.dataone.integration.ContextAwareTestCaseDataone]
20171030-17:24:14: [INFO]: RestClient.doRequestNoBody, thread(1) call Info: GET https://test-prod.bco-dmo.org/d1/mn/v2/monitor/ping [org.dataone.client.rest.RestClient]
20171030-17:24:14: [INFO]: MN excluded from test: https://test-prod.bco-dmo.org/d1/mn [org.dataone.integration.ContextAwareTestCaseDataone]
20171030-17:24:14: [INFO]: created client for certificate file: cnSandboxORC1 with subject: CN=urn:node:cnSandboxORC1,DC=dataone,DC=org [org.dataone.integration.ContextAwareTestCaseDataone]
20171030-17:24:14: [INFO]: RestClient.doRequestNoBody, thread(1) call Info: GET https://ncei-node.test.dataone.org/mn/v2/monitor/ping [org.dataone.client.rest.RestClient]
20171030-17:24:14: [INFO]: MN excluded from test: https://ncei-node.test.dataone.org/mn [org.dataone.integration.ContextAwareTestCaseDataone]
20171030-17:24:14: [INFO]: created client for certificate file: cnSandboxORC1 with subject: CN=urn:node:cnSandboxORC1,DC=dataone,DC=org [org.dataone.integration.ContextAwareTestCaseDataone]
20171030-17:24:14: [INFO]: RestClient.doRequestNoBody, thread(1) call Info: GET https://edacd1mn.unm.edu/mn/v2/monitor/ping [org.dataone.client.rest.RestClient]
20171030-17:24:14: [INFO]: MN excluded from test: https://edacd1mn.unm.edu/mn [org.dataone.integration.ContextAwareTestCaseDataone]
20171030-17:24:14: [INFO]: created client for certificate file: cnSandboxORC1 with subject: CN=urn:node:cnSandboxORC1,DC=dataone,DC=org [org.dataone.integration.ContextAwareTestCaseDataone]
20171030-17:24:15: [INFO]: RestClient.doRequestNoBody, thread(1) call Info: GET https://gmnv2.test.dataone.org/mn/v2/monitor/ping [org.dataone.client.rest.RestClient]
20171030-17:24:15: [INFO]: MN excluded from test: https://gmnv2.test.dataone.org/mn [org.dataone.integration.ContextAwareTestCaseDataone]
20171030-17:24:15: [INFO]: created client for certificate file: cnSandboxORC1 with subject: CN=urn:node:cnSandboxORC1,DC=dataone,DC=org [org.dataone.integration.ContextAwareTestCaseDataone]
20171030-17:24:15: [INFO]: 
***************** running test for testGetReplica() vs. node: https://mn-sandbox-ucsb-1.test.dataone.org/knb/d1/mn/v2 ***************** [org.dataone.integration.ContextAwareTestCaseDataone]
20171030-17:24:15: [INFO]: Using cached identifier for node urn:node:mnSandboxUCSB1 [org.dataone.integration.ContextAwareTestCaseDataone]
20171030-17:24:15: [INFO]: RestClient.doRequestNoBody, thread(1) call Info: GET https://mn-sandbox-ucsb-1.test.dataone.org/knb/d1/mn/v2/replica/TierTesting:mn-sandbox-ucsb-1:Public_READ.15 [org.dataone.client.rest.RestClient]
20171030-17:24:15: [INFO]: created client for certificate file: cnSandboxORC1 with subject: CN=urn:node:cnSandboxORC1,DC=dataone,DC=org [org.dataone.integration.ContextAwareTestCaseDataone]
20171030-17:24:15: [INFO]: 
***************** running test for testGetReplica() vs. node: https://mn-sandbox-ucsb-2.test.dataone.org/knb/d1/mn/v2 ***************** [org.dataone.integration.ContextAwareTestCaseDataone]
20171030-17:24:15: [INFO]: Using cached identifier for node urn:node:mnSandboxUCSB2 [org.dataone.integration.ContextAwareTestCaseDataone]
20171030-17:24:15: [INFO]: RestClient.doRequestNoBody, thread(1) call Info: GET https://mn-sandbox-ucsb-2.test.dataone.org/knb/d1/mn/v2/replica/TierTesting:mn-sandbox-ucsb-2:Public_READ.15 [org.dataone.client.rest.RestClient]
20171030-17:24:15: [INFO]: **************************************************** [org.dataone.integration.ContextAwareTestCaseDataone]
20171030-17:24:15: [INFO]: ***  context label:   SANDBOX [org.dataone.integration.ContextAwareTestCaseDataone]
20171030-17:24:15: [INFO]: **************************************************** [org.dataone.integration.ContextAwareTestCaseDataone]
20171030-17:24:15: [INFO]: **************************************************** [org.dataone.integration.ContextAwareTestCaseDataone]
                          nodeId  key                       value
=============================================================================================================
         urn:node:mnSandboxUCSB1  objectList_hits           3
         urn:node:mnSandboxUCSB1  publicObject_cacheDate    Mon Oct 30 17:08:13 UTC 2017
         urn:node:mnSandboxUCSB1  publicObject_hits         7
         urn:node:mnSandboxUCSB1  objectList_cacheDate      Mon Oct 30 17:24:01 UTC 2017
         urn:node:mnSandboxUCSB1  publicObject              TierTesting:mn-sandbox-ucsb-1:Public_READ.15
         urn:node:mnSandboxUCSB1  objectList                org.dataone.service.types.v1.ObjectList@61d2f267
=============================================================================================================
         urn:node:mnSandboxUCSB2  objectList_hits           3
         urn:node:mnSandboxUCSB2  publicObject_cacheDate    Mon Oct 30 17:08:17 UTC 2017
         urn:node:mnSandboxUCSB2  publicObject_hits         7
         urn:node:mnSandboxUCSB2  objectList_cacheDate      Mon Oct 30 17:24:01 UTC 2017
         urn:node:mnSandboxUCSB2  publicObject              TierTesting:mn-sandbox-ucsb-2:Public_READ.15
         urn:node:mnSandboxUCSB2  objectList                org.dataone.service.types.v1.ObjectList@26d40c77
=============================================================================================================
20171030-17:24:15: [INFO]: created client for certificate file: cnSandboxORC1 with subject: CN=urn:node:cnSandboxORC1,DC=dataone,DC=org [org.dataone.integration.ContextAwareTestCaseDataone]
20171030-17:24:15: [INFO]: RestClient.doRequestNoBody, thread(1) call Info: GET https://mn-sandbox-ucsb-1.test.dataone.org/knb/d1/mn/v2/monitor/ping [org.dataone.client.rest.RestClient]
20171030-17:24:15: [INFO]: MN included in test: https://mn-sandbox-ucsb-1.test.dataone.org/knb/d1/mn [org.dataone.integration.ContextAwareTestCaseDataone]
20171030-17:24:15: [INFO]: created client for certificate file: cnSandboxORC1 with subject: CN=urn:node:cnSandboxORC1,DC=dataone,DC=org [org.dataone.integration.ContextAwareTestCaseDataone]
20171030-17:24:16: [INFO]: RestClient.doRequestNoBody, thread(1) call Info: GET https://mn-sandbox-ucsb-2.test.dataone.org/knb/d1/mn/v2/monitor/ping [org.dataone.client.rest.RestClient]
20171030-17:24:16: [INFO]: MN included in test: https://mn-sandbox-ucsb-2.test.dataone.org/knb/d1/mn [org.dataone.integration.ContextAwareTestCaseDataone]
20171030-17:24:16: [INFO]: created client for certificate file: cnSandboxORC1 with subject: CN=urn:node:cnSandboxORC1,DC=dataone,DC=org [org.dataone.integration.ContextAwareTestCaseDataone]
20171030-17:24:16: [INFO]: RestClient.doRequestNoBody, thread(1) call Info: GET https://mn-sandbox-orc-1.test.dataone.org/mn/v2/monitor/ping [org.dataone.client.rest.RestClient]
20171030-17:24:16: [INFO]: MN excluded from test: https://mn-sandbox-orc-1.test.dataone.org/mn [org.dataone.integration.ContextAwareTestCaseDataone]
20171030-17:24:16: [INFO]: created client for certificate file: cnSandboxORC1 with subject: CN=urn:node:cnSandboxORC1,DC=dataone,DC=org [org.dataone.integration.ContextAwareTestCaseDataone]
20171030-17:24:16: [INFO]: RestClient.doRequestNoBody, thread(1) call Info: GET http://usgs.ornl.gov/USGS_MN/mn/v2/monitor/ping [org.dataone.client.rest.RestClient]
20171030-17:24:16: [INFO]: MN excluded from test: http://usgs.ornl.gov/USGS_MN/mn [org.dataone.integration.ContextAwareTestCaseDataone]
20171030-17:24:16: [INFO]: created client for certificate file: cnSandboxORC1 with subject: CN=urn:node:cnSandboxORC1,DC=dataone,DC=org [org.dataone.integration.ContextAwareTestCaseDataone]
20171030-17:24:16: [INFO]: RestClient.doRequestNoBody, thread(1) call Info: GET https://alpha.tdar.org/dataone/v2/monitor/ping [org.dataone.client.rest.RestClient]
20171030-17:24:16: [INFO]: MN excluded from test: https://alpha.tdar.org/dataone/ [org.dataone.integration.ContextAwareTestCaseDataone]
20171030-17:24:16: [INFO]: created client for certificate file: cnSandboxORC1 with subject: CN=urn:node:cnSandboxORC1,DC=dataone,DC=org [org.dataone.integration.ContextAwareTestCaseDataone]
20171030-17:24:16: [INFO]: RestClient.doRequestNoBody, thread(1) call Info: GET https://test-prod.bco-dmo.org/d1/mn/v2/monitor/ping [org.dataone.client.rest.RestClient]
20171030-17:24:16: [INFO]: MN excluded from test: https://test-prod.bco-dmo.org/d1/mn [org.dataone.integration.ContextAwareTestCaseDataone]
20171030-17:24:16: [INFO]: created client for certificate file: cnSandboxORC1 with subject: CN=urn:node:cnSandboxORC1,DC=dataone,DC=org [org.dataone.integration.ContextAwareTestCaseDataone]
20171030-17:24:16: [INFO]: RestClient.doRequestNoBody, thread(1) call Info: GET https://ncei-node.test.dataone.org/mn/v2/monitor/ping [org.dataone.client.rest.RestClient]
20171030-17:24:16: [INFO]: MN excluded from test: https://ncei-node.test.dataone.org/mn [org.dataone.integration.ContextAwareTestCaseDataone]
20171030-17:24:16: [INFO]: created client for certificate file: cnSandboxORC1 with subject: CN=urn:node:cnSandboxORC1,DC=dataone,DC=org [org.dataone.integration.ContextAwareTestCaseDataone]
20171030-17:24:16: [INFO]: RestClient.doRequestNoBody, thread(1) call Info: GET https://edacd1mn.unm.edu/mn/v2/monitor/ping [org.dataone.client.rest.RestClient]
20171030-17:24:16: [INFO]: MN excluded from test: https://edacd1mn.unm.edu/mn [org.dataone.integration.ContextAwareTestCaseDataone]
20171030-17:24:16: [INFO]: created client for certificate file: cnSandboxORC1 with subject: CN=urn:node:cnSandboxORC1,DC=dataone,DC=org [org.dataone.integration.ContextAwareTestCaseDataone]
20171030-17:24:17: [INFO]: RestClient.doRequestNoBody, thread(1) call Info: GET https://gmnv2.test.dataone.org/mn/v2/monitor/ping [org.dataone.client.rest.RestClient]
20171030-17:24:17: [INFO]: MN excluded from test: https://gmnv2.test.dataone.org/mn [org.dataone.integration.ContextAwareTestCaseDataone]
20171030-17:24:17: [INFO]: created client for certificate file: testRightsHolder with subject: CN=testRightsHolder,DC=dataone,DC=org [org.dataone.integration.ContextAwareTestCaseDataone]
20171030-17:24:17: [INFO]: 
***************** running test for testGetReplica_AuthenticateITKUser() vs. node: https://mn-sandbox-ucsb-1.test.dataone.org/knb/d1/mn/v2 ***************** [org.dataone.integration.ContextAwareTestCaseDataone]
20171030-17:24:17: [INFO]: Using cached identifier for node urn:node:mnSandboxUCSB1 [org.dataone.integration.ContextAwareTestCaseDataone]
20171030-17:24:17: [INFO]: RestClient.doRequestNoBody, thread(1) call Info: GET https://mn-sandbox-ucsb-1.test.dataone.org/knb/d1/mn/v2/replica/TierTesting:mn-sandbox-ucsb-1:Public_READ.15 [org.dataone.client.rest.RestClient]
20171030-17:24:17: [INFO]: created client for certificate file: testRightsHolder with subject: CN=testRightsHolder,DC=dataone,DC=org [org.dataone.integration.ContextAwareTestCaseDataone]
20171030-17:24:17: [INFO]: 
***************** running test for testGetReplica_AuthenticateITKUser() vs. node: https://mn-sandbox-ucsb-2.test.dataone.org/knb/d1/mn/v2 ***************** [org.dataone.integration.ContextAwareTestCaseDataone]
20171030-17:24:17: [INFO]: Using cached identifier for node urn:node:mnSandboxUCSB2 [org.dataone.integration.ContextAwareTestCaseDataone]
20171030-17:24:17: [INFO]: RestClient.doRequestNoBody, thread(1) call Info: GET https://mn-sandbox-ucsb-2.test.dataone.org/knb/d1/mn/v2/replica/TierTesting:mn-sandbox-ucsb-2:Public_READ.15 [org.dataone.client.rest.RestClient]
20171030-17:24:17: [INFO]: **************************************************** [org.dataone.integration.ContextAwareTestCaseDataone]
20171030-17:24:17: [INFO]: ***  context label:   SANDBOX [org.dataone.integration.ContextAwareTestCaseDataone]
20171030-17:24:17: [INFO]: **************************************************** [org.dataone.integration.ContextAwareTestCaseDataone]
20171030-17:24:17: [INFO]: **************************************************** [org.dataone.integration.ContextAwareTestCaseDataone]
                          nodeId  key                       value
=============================================================================================================
         urn:node:mnSandboxUCSB1  objectList_hits           3
         urn:node:mnSandboxUCSB1  publicObject_cacheDate    Mon Oct 30 17:08:13 UTC 2017
         urn:node:mnSandboxUCSB1  publicObject_hits         8
         urn:node:mnSandboxUCSB1  objectList_cacheDate      Mon Oct 30 17:24:01 UTC 2017
         urn:node:mnSandboxUCSB1  publicObject              TierTesting:mn-sandbox-ucsb-1:Public_READ.15
         urn:node:mnSandboxUCSB1  objectList                org.dataone.service.types.v1.ObjectList@61d2f267
=============================================================================================================
         urn:node:mnSandboxUCSB2  objectList_hits           3
         urn:node:mnSandboxUCSB2  publicObject_cacheDate    Mon Oct 30 17:08:17 UTC 2017
         urn:node:mnSandboxUCSB2  publicObject_hits         8
         urn:node:mnSandboxUCSB2  objectList_cacheDate      Mon Oct 30 17:24:01 UTC 2017
         urn:node:mnSandboxUCSB2  publicObject              TierTesting:mn-sandbox-ucsb-2:Public_READ.15
         urn:node:mnSandboxUCSB2  objectList                org.dataone.service.types.v1.ObjectList@26d40c77
=============================================================================================================
20171030-17:24:17: [INFO]: created client for certificate file: cnSandboxORC1 with subject: CN=urn:node:cnSandboxORC1,DC=dataone,DC=org [org.dataone.integration.ContextAwareTestCaseDataone]
20171030-17:24:17: [INFO]: RestClient.doRequestNoBody, thread(1) call Info: GET https://mn-sandbox-ucsb-1.test.dataone.org/knb/d1/mn/v2/monitor/ping [org.dataone.client.rest.RestClient]
20171030-17:24:17: [INFO]: MN included in test: https://mn-sandbox-ucsb-1.test.dataone.org/knb/d1/mn [org.dataone.integration.ContextAwareTestCaseDataone]
20171030-17:24:17: [INFO]: created client for certificate file: cnSandboxORC1 with subject: CN=urn:node:cnSandboxORC1,DC=dataone,DC=org [org.dataone.integration.ContextAwareTestCaseDataone]
20171030-17:24:17: [INFO]: RestClient.doRequestNoBody, thread(1) call Info: GET https://mn-sandbox-ucsb-2.test.dataone.org/knb/d1/mn/v2/monitor/ping [org.dataone.client.rest.RestClient]
20171030-17:24:17: [INFO]: MN included in test: https://mn-sandbox-ucsb-2.test.dataone.org/knb/d1/mn [org.dataone.integration.ContextAwareTestCaseDataone]
20171030-17:24:17: [INFO]: created client for certificate file: cnSandboxORC1 with subject: CN=urn:node:cnSandboxORC1,DC=dataone,DC=org [org.dataone.integration.ContextAwareTestCaseDataone]
20171030-17:24:18: [INFO]: RestClient.doRequestNoBody, thread(1) call Info: GET https://mn-sandbox-orc-1.test.dataone.org/mn/v2/monitor/ping [org.dataone.client.rest.RestClient]
20171030-17:24:18: [INFO]: MN excluded from test: https://mn-sandbox-orc-1.test.dataone.org/mn [org.dataone.integration.ContextAwareTestCaseDataone]
20171030-17:24:18: [INFO]: created client for certificate file: cnSandboxORC1 with subject: CN=urn:node:cnSandboxORC1,DC=dataone,DC=org [org.dataone.integration.ContextAwareTestCaseDataone]
20171030-17:24:18: [INFO]: RestClient.doRequestNoBody, thread(1) call Info: GET http://usgs.ornl.gov/USGS_MN/mn/v2/monitor/ping [org.dataone.client.rest.RestClient]
20171030-17:24:18: [INFO]: MN excluded from test: http://usgs.ornl.gov/USGS_MN/mn [org.dataone.integration.ContextAwareTestCaseDataone]
20171030-17:24:18: [INFO]: created client for certificate file: cnSandboxORC1 with subject: CN=urn:node:cnSandboxORC1,DC=dataone,DC=org [org.dataone.integration.ContextAwareTestCaseDataone]
20171030-17:24:18: [INFO]: RestClient.doRequestNoBody, thread(1) call Info: GET https://alpha.tdar.org/dataone/v2/monitor/ping [org.dataone.client.rest.RestClient]
20171030-17:24:18: [INFO]: MN excluded from test: https://alpha.tdar.org/dataone/ [org.dataone.integration.ContextAwareTestCaseDataone]
20171030-17:24:18: [INFO]: created client for certificate file: cnSandboxORC1 with subject: CN=urn:node:cnSandboxORC1,DC=dataone,DC=org [org.dataone.integration.ContextAwareTestCaseDataone]
20171030-17:24:18: [INFO]: RestClient.doRequestNoBody, thread(1) call Info: GET https://test-prod.bco-dmo.org/d1/mn/v2/monitor/ping [org.dataone.client.rest.RestClient]
20171030-17:24:18: [INFO]: MN excluded from test: https://test-prod.bco-dmo.org/d1/mn [org.dataone.integration.ContextAwareTestCaseDataone]
20171030-17:24:18: [INFO]: created client for certificate file: cnSandboxORC1 with subject: CN=urn:node:cnSandboxORC1,DC=dataone,DC=org [org.dataone.integration.ContextAwareTestCaseDataone]
20171030-17:24:18: [INFO]: RestClient.doRequestNoBody, thread(1) call Info: GET https://ncei-node.test.dataone.org/mn/v2/monitor/ping [org.dataone.client.rest.RestClient]
20171030-17:24:18: [INFO]: MN excluded from test: https://ncei-node.test.dataone.org/mn [org.dataone.integration.ContextAwareTestCaseDataone]
20171030-17:24:18: [INFO]: created client for certificate file: cnSandboxORC1 with subject: CN=urn:node:cnSandboxORC1,DC=dataone,DC=org [org.dataone.integration.ContextAwareTestCaseDataone]
20171030-17:24:18: [INFO]: RestClient.doRequestNoBody, thread(1) call Info: GET https://edacd1mn.unm.edu/mn/v2/monitor/ping [org.dataone.client.rest.RestClient]
20171030-17:24:18: [INFO]: MN excluded from test: https://edacd1mn.unm.edu/mn [org.dataone.integration.ContextAwareTestCaseDataone]
20171030-17:24:18: [INFO]: created client for certificate file: cnSandboxORC1 with subject: CN=urn:node:cnSandboxORC1,DC=dataone,DC=org [org.dataone.integration.ContextAwareTestCaseDataone]
20171030-17:24:19: [INFO]: RestClient.doRequestNoBody, thread(1) call Info: GET https://gmnv2.test.dataone.org/mn/v2/monitor/ping [org.dataone.client.rest.RestClient]
20171030-17:24:19: [INFO]: MN excluded from test: https://gmnv2.test.dataone.org/mn [org.dataone.integration.ContextAwareTestCaseDataone]
20171030-17:24:19: [INFO]: 
***************** running test for testGetReplica_NoCert() vs. node: https://mn-sandbox-ucsb-1.test.dataone.org/knb/d1/mn/v2 ***************** [org.dataone.integration.ContextAwareTestCaseDataone]
20171030-17:24:19: [INFO]: Using cached identifier for node urn:node:mnSandboxUCSB1 [org.dataone.integration.ContextAwareTestCaseDataone]
20171030-17:24:19: [INFO]: RestClient.doRequestNoBody, thread(1) call Info: GET https://mn-sandbox-ucsb-1.test.dataone.org/knb/d1/mn/v2/replica/TierTesting:mn-sandbox-ucsb-1:Public_READ.15 [org.dataone.client.rest.RestClient]
20171030-17:24:19: [INFO]: 
***************** running test for testGetReplica_NoCert() vs. node: https://mn-sandbox-ucsb-2.test.dataone.org/knb/d1/mn/v2 ***************** [org.dataone.integration.ContextAwareTestCaseDataone]
20171030-17:24:19: [INFO]: Using cached identifier for node urn:node:mnSandboxUCSB2 [org.dataone.integration.ContextAwareTestCaseDataone]
20171030-17:24:19: [INFO]: RestClient.doRequestNoBody, thread(1) call Info: GET https://mn-sandbox-ucsb-2.test.dataone.org/knb/d1/mn/v2/replica/TierTesting:mn-sandbox-ucsb-2:Public_READ.15 [org.dataone.client.rest.RestClient]
20171030-17:24:19: [INFO]: **************************************************** [org.dataone.integration.ContextAwareTestCaseDataone]
20171030-17:24:19: [INFO]: ***  context label:   SANDBOX [org.dataone.integration.ContextAwareTestCaseDataone]
20171030-17:24:19: [INFO]: **************************************************** [org.dataone.integration.ContextAwareTestCaseDataone]
20171030-17:24:19: [INFO]: **************************************************** [org.dataone.integration.ContextAwareTestCaseDataone]
                          nodeId  key                       value
=============================================================================================================
         urn:node:mnSandboxUCSB1  objectList_hits           3
         urn:node:mnSandboxUCSB1  publicObject_cacheDate    Mon Oct 30 17:08:13 UTC 2017
         urn:node:mnSandboxUCSB1  publicObject_hits         9
         urn:node:mnSandboxUCSB1  objectList_cacheDate      Mon Oct 30 17:24:01 UTC 2017
         urn:node:mnSandboxUCSB1  publicObject              TierTesting:mn-sandbox-ucsb-1:Public_READ.15
         urn:node:mnSandboxUCSB1  objectList                org.dataone.service.types.v1.ObjectList@61d2f267
=============================================================================================================
         urn:node:mnSandboxUCSB2  objectList_hits           3
         urn:node:mnSandboxUCSB2  publicObject_cacheDate    Mon Oct 30 17:08:17 UTC 2017
         urn:node:mnSandboxUCSB2  publicObject_hits         9
         urn:node:mnSandboxUCSB2  objectList_cacheDate      Mon Oct 30 17:24:01 UTC 2017
         urn:node:mnSandboxUCSB2  publicObject              TierTesting:mn-sandbox-ucsb-2:Public_READ.15
         urn:node:mnSandboxUCSB2  objectList                org.dataone.service.types.v1.ObjectList@26d40c77
=============================================================================================================
20171030-17:24:19: [INFO]: created client for certificate file: cnSandboxORC1 with subject: CN=urn:node:cnSandboxORC1,DC=dataone,DC=org [org.dataone.integration.ContextAwareTestCaseDataone]
20171030-17:24:19: [INFO]: RestClient.doRequestNoBody, thread(1) call Info: GET https://mn-sandbox-ucsb-1.test.dataone.org/knb/d1/mn/v2/monitor/ping [org.dataone.client.rest.RestClient]
20171030-17:24:19: [INFO]: MN included in test: https://mn-sandbox-ucsb-1.test.dataone.org/knb/d1/mn [org.dataone.integration.ContextAwareTestCaseDataone]
20171030-17:24:19: [INFO]: created client for certificate file: cnSandboxORC1 with subject: CN=urn:node:cnSandboxORC1,DC=dataone,DC=org [org.dataone.integration.ContextAwareTestCaseDataone]
20171030-17:24:19: [INFO]: RestClient.doRequestNoBody, thread(1) call Info: GET https://mn-sandbox-ucsb-2.test.dataone.org/knb/d1/mn/v2/monitor/ping [org.dataone.client.rest.RestClient]
20171030-17:24:19: [INFO]: MN included in test: https://mn-sandbox-ucsb-2.test.dataone.org/knb/d1/mn [org.dataone.integration.ContextAwareTestCaseDataone]
20171030-17:24:19: [INFO]: created client for certificate file: cnSandboxORC1 with subject: CN=urn:node:cnSandboxORC1,DC=dataone,DC=org [org.dataone.integration.ContextAwareTestCaseDataone]
20171030-17:24:19: [INFO]: RestClient.doRequestNoBody, thread(1) call Info: GET https://mn-sandbox-orc-1.test.dataone.org/mn/v2/monitor/ping [org.dataone.client.rest.RestClient]
20171030-17:24:19: [INFO]: MN excluded from test: https://mn-sandbox-orc-1.test.dataone.org/mn [org.dataone.integration.ContextAwareTestCaseDataone]
20171030-17:24:19: [INFO]: created client for certificate file: cnSandboxORC1 with subject: CN=urn:node:cnSandboxORC1,DC=dataone,DC=org [org.dataone.integration.ContextAwareTestCaseDataone]
20171030-17:24:19: [INFO]: RestClient.doRequestNoBody, thread(1) call Info: GET http://usgs.ornl.gov/USGS_MN/mn/v2/monitor/ping [org.dataone.client.rest.RestClient]
20171030-17:24:19: [INFO]: MN excluded from test: http://usgs.ornl.gov/USGS_MN/mn [org.dataone.integration.ContextAwareTestCaseDataone]
20171030-17:24:19: [INFO]: created client for certificate file: cnSandboxORC1 with subject: CN=urn:node:cnSandboxORC1,DC=dataone,DC=org [org.dataone.integration.ContextAwareTestCaseDataone]
20171030-17:24:19: [INFO]: RestClient.doRequestNoBody, thread(1) call Info: GET https://alpha.tdar.org/dataone/v2/monitor/ping [org.dataone.client.rest.RestClient]
20171030-17:24:19: [INFO]: MN excluded from test: https://alpha.tdar.org/dataone/ [org.dataone.integration.ContextAwareTestCaseDataone]
20171030-17:24:19: [INFO]: created client for certificate file: cnSandboxORC1 with subject: CN=urn:node:cnSandboxORC1,DC=dataone,DC=org [org.dataone.integration.ContextAwareTestCaseDataone]
20171030-17:24:20: [INFO]: RestClient.doRequestNoBody, thread(1) call Info: GET https://test-prod.bco-dmo.org/d1/mn/v2/monitor/ping [org.dataone.client.rest.RestClient]
20171030-17:24:20: [INFO]: MN excluded from test: https://test-prod.bco-dmo.org/d1/mn [org.dataone.integration.ContextAwareTestCaseDataone]
20171030-17:24:20: [INFO]: created client for certificate file: cnSandboxORC1 with subject: CN=urn:node:cnSandboxORC1,DC=dataone,DC=org [org.dataone.integration.ContextAwareTestCaseDataone]
20171030-17:24:20: [INFO]: RestClient.doRequestNoBody, thread(1) call Info: GET https://ncei-node.test.dataone.org/mn/v2/monitor/ping [org.dataone.client.rest.RestClient]
20171030-17:24:20: [INFO]: MN excluded from test: https://ncei-node.test.dataone.org/mn [org.dataone.integration.ContextAwareTestCaseDataone]
20171030-17:24:20: [INFO]: created client for certificate file: cnSandboxORC1 with subject: CN=urn:node:cnSandboxORC1,DC=dataone,DC=org [org.dataone.integration.ContextAwareTestCaseDataone]
20171030-17:24:20: [INFO]: RestClient.doRequestNoBody, thread(1) call Info: GET https://edacd1mn.unm.edu/mn/v2/monitor/ping [org.dataone.client.rest.RestClient]
20171030-17:24:20: [INFO]: MN excluded from test: https://edacd1mn.unm.edu/mn [org.dataone.integration.ContextAwareTestCaseDataone]
20171030-17:24:20: [INFO]: created client for certificate file: cnSandboxORC1 with subject: CN=urn:node:cnSandboxORC1,DC=dataone,DC=org [org.dataone.integration.ContextAwareTestCaseDataone]
20171030-17:24:20: [INFO]: RestClient.doRequestNoBody, thread(1) call Info: GET https://gmnv2.test.dataone.org/mn/v2/monitor/ping [org.dataone.client.rest.RestClient]
20171030-17:24:20: [INFO]: MN excluded from test: https://gmnv2.test.dataone.org/mn [org.dataone.integration.ContextAwareTestCaseDataone]
20171030-17:24:20: [INFO]: 
***************** running test for testGetReplica() vs. node: https://mn-sandbox-ucsb-1.test.dataone.org/knb/d1/mn/v2 ***************** [org.dataone.integration.ContextAwareTestCaseDataone]
20171030-17:24:20: [INFO]: RestClient.doRequestNoBody, thread(1) call Info: GET https://mn-sandbox-ucsb-1.test.dataone.org/knb/d1/mn/v2/object/TestingNotFound:201730392420588 [org.dataone.client.rest.RestClient]
20171030-17:24:20: [INFO]: 
***************** running test for testGetReplica() vs. node: https://mn-sandbox-ucsb-2.test.dataone.org/knb/d1/mn/v2 ***************** [org.dataone.integration.ContextAwareTestCaseDataone]
20171030-17:24:20: [INFO]: RestClient.doRequestNoBody, thread(1) call Info: GET https://mn-sandbox-ucsb-2.test.dataone.org/knb/d1/mn/v2/object/TestingNotFound:201730392420683 [org.dataone.client.rest.RestClient]
20171030-17:24:20: [INFO]: **************************************************** [org.dataone.integration.ContextAwareTestCaseDataone]
20171030-17:24:20: [INFO]: ***  context label:   SANDBOX [org.dataone.integration.ContextAwareTestCaseDataone]
20171030-17:24:20: [INFO]: **************************************************** [org.dataone.integration.ContextAwareTestCaseDataone]
20171030-17:24:20: [INFO]: **************************************************** [org.dataone.integration.ContextAwareTestCaseDataone]
                          nodeId  key                       value
=============================================================================================================
         urn:node:mnSandboxUCSB1  objectList_hits           3
         urn:node:mnSandboxUCSB1  publicObject_cacheDate    Mon Oct 30 17:08:13 UTC 2017
         urn:node:mnSandboxUCSB1  publicObject_hits         9
         urn:node:mnSandboxUCSB1  objectList_cacheDate      Mon Oct 30 17:24:01 UTC 2017
         urn:node:mnSandboxUCSB1  publicObject              TierTesting:mn-sandbox-ucsb-1:Public_READ.15
         urn:node:mnSandboxUCSB1  objectList                org.dataone.service.types.v1.ObjectList@61d2f267
=============================================================================================================
         urn:node:mnSandboxUCSB2  objectList_hits           3
         urn:node:mnSandboxUCSB2  publicObject_cacheDate    Mon Oct 30 17:08:17 UTC 2017
         urn:node:mnSandboxUCSB2  publicObject_hits         9
         urn:node:mnSandboxUCSB2  objectList_cacheDate      Mon Oct 30 17:24:01 UTC 2017
         urn:node:mnSandboxUCSB2  publicObject              TierTesting:mn-sandbox-ucsb-2:Public_READ.15
         urn:node:mnSandboxUCSB2  objectList                org.dataone.service.types.v1.ObjectList@26d40c77
=============================================================================================================
20171030-17:24:20: [INFO]: created client for certificate file: cnSandboxORC1 with subject: CN=urn:node:cnSandboxORC1,DC=dataone,DC=org [org.dataone.integration.ContextAwareTestCaseDataone]
20171030-17:24:20: [INFO]: RestClient.doRequestNoBody, thread(1) call Info: GET https://mn-sandbox-ucsb-1.test.dataone.org/knb/d1/mn/v2/monitor/ping [org.dataone.client.rest.RestClient]
20171030-17:24:20: [INFO]: MN included in test: https://mn-sandbox-ucsb-1.test.dataone.org/knb/d1/mn [org.dataone.integration.ContextAwareTestCaseDataone]
20171030-17:24:20: [INFO]: created client for certificate file: cnSandboxORC1 with subject: CN=urn:node:cnSandboxORC1,DC=dataone,DC=org [org.dataone.integration.ContextAwareTestCaseDataone]
20171030-17:24:21: [INFO]: RestClient.doRequestNoBody, thread(1) call Info: GET https://mn-sandbox-ucsb-2.test.dataone.org/knb/d1/mn/v2/monitor/ping [org.dataone.client.rest.RestClient]
20171030-17:24:21: [INFO]: MN included in test: https://mn-sandbox-ucsb-2.test.dataone.org/knb/d1/mn [org.dataone.integration.ContextAwareTestCaseDataone]
20171030-17:24:21: [INFO]: created client for certificate file: cnSandboxORC1 with subject: CN=urn:node:cnSandboxORC1,DC=dataone,DC=org [org.dataone.integration.ContextAwareTestCaseDataone]
20171030-17:24:21: [INFO]: RestClient.doRequestNoBody, thread(1) call Info: GET https://mn-sandbox-orc-1.test.dataone.org/mn/v2/monitor/ping [org.dataone.client.rest.RestClient]
20171030-17:24:21: [INFO]: MN excluded from test: https://mn-sandbox-orc-1.test.dataone.org/mn [org.dataone.integration.ContextAwareTestCaseDataone]
20171030-17:24:21: [INFO]: created client for certificate file: cnSandboxORC1 with subject: CN=urn:node:cnSandboxORC1,DC=dataone,DC=org [org.dataone.integration.ContextAwareTestCaseDataone]
20171030-17:24:21: [INFO]: RestClient.doRequestNoBody, thread(1) call Info: GET http://usgs.ornl.gov/USGS_MN/mn/v2/monitor/ping [org.dataone.client.rest.RestClient]
20171030-17:24:21: [INFO]: MN excluded from test: http://usgs.ornl.gov/USGS_MN/mn [org.dataone.integration.ContextAwareTestCaseDataone]
20171030-17:24:21: [INFO]: created client for certificate file: cnSandboxORC1 with subject: CN=urn:node:cnSandboxORC1,DC=dataone,DC=org [org.dataone.integration.ContextAwareTestCaseDataone]
20171030-17:24:21: [INFO]: RestClient.doRequestNoBody, thread(1) call Info: GET https://alpha.tdar.org/dataone/v2/monitor/ping [org.dataone.client.rest.RestClient]
20171030-17:24:21: [INFO]: MN excluded from test: https://alpha.tdar.org/dataone/ [org.dataone.integration.ContextAwareTestCaseDataone]
20171030-17:24:21: [INFO]: created client for certificate file: cnSandboxORC1 with subject: CN=urn:node:cnSandboxORC1,DC=dataone,DC=org [org.dataone.integration.ContextAwareTestCaseDataone]
20171030-17:24:21: [INFO]: RestClient.doRequestNoBody, thread(1) call Info: GET https://test-prod.bco-dmo.org/d1/mn/v2/monitor/ping [org.dataone.client.rest.RestClient]
20171030-17:24:22: [INFO]: MN excluded from test: https://test-prod.bco-dmo.org/d1/mn [org.dataone.integration.ContextAwareTestCaseDataone]
20171030-17:24:22: [INFO]: created client for certificate file: cnSandboxORC1 with subject: CN=urn:node:cnSandboxORC1,DC=dataone,DC=org [org.dataone.integration.ContextAwareTestCaseDataone]
20171030-17:24:22: [INFO]: RestClient.doRequestNoBody, thread(1) call Info: GET https://ncei-node.test.dataone.org/mn/v2/monitor/ping [org.dataone.client.rest.RestClient]
20171030-17:24:22: [INFO]: MN excluded from test: https://ncei-node.test.dataone.org/mn [org.dataone.integration.ContextAwareTestCaseDataone]
20171030-17:24:22: [INFO]: created client for certificate file: cnSandboxORC1 with subject: CN=urn:node:cnSandboxORC1,DC=dataone,DC=org [org.dataone.integration.ContextAwareTestCaseDataone]
20171030-17:24:22: [INFO]: RestClient.doRequestNoBody, thread(1) call Info: GET https://edacd1mn.unm.edu/mn/v2/monitor/ping [org.dataone.client.rest.RestClient]
20171030-17:24:22: [INFO]: MN excluded from test: https://edacd1mn.unm.edu/mn [org.dataone.integration.ContextAwareTestCaseDataone]
20171030-17:24:22: [INFO]: created client for certificate file: cnSandboxORC1 with subject: CN=urn:node:cnSandboxORC1,DC=dataone,DC=org [org.dataone.integration.ContextAwareTestCaseDataone]
20171030-17:24:22: [INFO]: RestClient.doRequestNoBody, thread(1) call Info: GET https://gmnv2.test.dataone.org/mn/v2/monitor/ping [org.dataone.client.rest.RestClient]
20171030-17:24:22: [INFO]: MN excluded from test: https://gmnv2.test.dataone.org/mn [org.dataone.integration.ContextAwareTestCaseDataone]
20171030-17:24:22: [INFO]: created client for certificate file: testRightsHolder with subject: CN=testRightsHolder,DC=dataone,DC=org [org.dataone.integration.ContextAwareTestCaseDataone]
20171030-17:24:22: [INFO]: 
***************** running test for testGetReplica_IdentifierEncoding() vs. node: https://mn-sandbox-ucsb-1.test.dataone.org/knb/d1/mn/v2 ***************** [org.dataone.integration.ContextAwareTestCaseDataone]
20171030-17:24:22: [INFO]: 
***************** running test for   Node:: https://mn-sandbox-ucsb-1.test.dataone.org/knb/d1/mn/v2 ***************** [org.dataone.integration.ContextAwareTestCaseDataone]
20171030-17:24:22: [INFO]: 0   common-unicode-ascii-safe-ABCDEFGHIJKLMNOPQRSTUVWXYZ	common-unicode-ascii-safe-ABCDEFGHIJKLMNOPQRSTUVWXYZ [org.dataone.integration.it.testImplementations.MNReadTestImplementations]
20171030-17:24:22: [INFO]: 1   common-unicode-ascii-safe-abcdefghijklmnopqrstuvwxyz	common-unicode-ascii-safe-abcdefghijklmnopqrstuvwxyz [org.dataone.integration.it.testImplementations.MNReadTestImplementations]
20171030-17:24:22: [INFO]: 2   common-unicode-ascii-safe-0123456789	common-unicode-ascii-safe-0123456789 [org.dataone.integration.it.testImplementations.MNReadTestImplementations]
20171030-17:24:22: [INFO]: 3   common-unicode-ascii-safe-:@$-_.!*()',~	common-unicode-ascii-safe-:@$-_.!*()',~ [org.dataone.integration.it.testImplementations.MNReadTestImplementations]
20171030-17:24:22: [INFO]: 4   common-unicode-ascii-safe-unreserved-._~	common-unicode-ascii-safe-unreserved-._~ [org.dataone.integration.it.testImplementations.MNReadTestImplementations]
20171030-17:24:22: [INFO]: 5   common-unicode-ascii-safe-sub-delims-$!*()',	common-unicode-ascii-safe-sub-delims-$!*()', [org.dataone.integration.it.testImplementations.MNReadTestImplementations]
20171030-17:24:22: [INFO]: 6   common-unicode-ascii-safe-gen-delims-:@	common-unicode-ascii-safe-gen-delims-:@ [org.dataone.integration.it.testImplementations.MNReadTestImplementations]
20171030-17:24:22: [INFO]: 7   common-unicode-ascii-escaped-"#<>[]^`{}|	common-unicode-ascii-escaped-%22%23%3C%3E%5B%5D%5E%60%7B%7D%7C [org.dataone.integration.it.testImplementations.MNReadTestImplementations]
20171030-17:24:22: [INFO]: 8   common-unicode-ascii-escaped-tomcatBlocked-\	common-unicode-ascii-escaped-tomcatBlocked-%5C [org.dataone.integration.it.testImplementations.MNReadTestImplementations]
20171030-17:24:22: [INFO]: 9   common-unicode-ascii-escaped-tomcatBlocked-%5C	common-unicode-ascii-escaped-tomcatBlocked-%255C [org.dataone.integration.it.testImplementations.MNReadTestImplementations]
20171030-17:24:22: [INFO]: 10   common-unicode-ascii-semi-colon-test-%3B	common-unicode-ascii-semi-colon-test-%253B [org.dataone.integration.it.testImplementations.MNReadTestImplementations]
20171030-17:24:22: [INFO]: 11   common-unicode-ascii-escaped-%	common-unicode-ascii-escaped-%25 [org.dataone.integration.it.testImplementations.MNReadTestImplementations]
20171030-17:24:22: [INFO]: 12   common-unicode-ascii-escape-anyway-+	common-unicode-ascii-escape-anyway-%2B [org.dataone.integration.it.testImplementations.MNReadTestImplementations]
20171030-17:24:22: [INFO]: 13   path-unicode-ascii-safe-&=&=	path-unicode-ascii-safe-&=&= [org.dataone.integration.it.testImplementations.MNReadTestImplementations]
20171030-17:24:22: [INFO]: 14   path-unicode-ascii-escaped-;	path-unicode-ascii-escaped-%3B [org.dataone.integration.it.testImplementations.MNReadTestImplementations]
20171030-17:24:22: [INFO]: 15   path-unicode-ascii-escaped-?	path-unicode-ascii-escaped-%3F [org.dataone.integration.it.testImplementations.MNReadTestImplementations]
20171030-17:24:22: [INFO]: 16   path-unicode-ascii-escaped-/	path-unicode-ascii-escaped-%2F [org.dataone.integration.it.testImplementations.MNReadTestImplementations]
20171030-17:24:22: [INFO]: 17   path-unicode-ascii-escaped-%3F	path-unicode-ascii-escaped-%253F [org.dataone.integration.it.testImplementations.MNReadTestImplementations]
20171030-17:24:22: [INFO]: 18   path-unicode-ascii-escaped-%2F	path-unicode-ascii-escaped-%252F [org.dataone.integration.it.testImplementations.MNReadTestImplementations]
20171030-17:24:22: [INFO]: 19   path-unicode-ascii-escaped-double-//case	path-unicode-ascii-escaped-double-%2F%2Fcase [org.dataone.integration.it.testImplementations.MNReadTestImplementations]
20171030-17:24:22: [INFO]: 20   path-unicode-ascii-escaped-double-trailing//	path-unicode-ascii-escaped-double-trailing%2F%2F [org.dataone.integration.it.testImplementations.MNReadTestImplementations]
20171030-17:24:22: [INFO]: 21   path-unicode-ascii-escaped-double-%2F%2Fcase	path-unicode-ascii-escaped-double-%252F%252Fcase [org.dataone.integration.it.testImplementations.MNReadTestImplementations]
20171030-17:24:22: [INFO]: 22   path-unicode-ascii-escaped-double-trailing%2F%2F	path-unicode-ascii-escaped-double-trailing%252F%252F [org.dataone.integration.it.testImplementations.MNReadTestImplementations]
20171030-17:24:22: [INFO]: 23   common-unicode-bmp-1byte-escaped-¡¢£	common-unicode-bmp-1byte-escaped-%C2%A1%C2%A2%C2%A3 [org.dataone.integration.it.testImplementations.MNReadTestImplementations]
20171030-17:24:22: [INFO]: 24   common-unicode-bmp-2byte-escaped-䦹䦺	common-unicode-bmp-2byte-escaped-%E4%A6%B9%E4%A6%BA [org.dataone.integration.it.testImplementations.MNReadTestImplementations]
20171030-17:24:22: [INFO]: 25   common-ascii-doc-example-urn:lsid:ubio.org:namebank:11815	common-ascii-doc-example-urn:lsid:ubio.org:namebank:11815 [org.dataone.integration.it.testImplementations.MNReadTestImplementations]
20171030-17:24:22: [INFO]: 26   path-ascii-doc-example-10.1000/182	path-ascii-doc-example-10.1000%2F182 [org.dataone.integration.it.testImplementations.MNReadTestImplementations]
20171030-17:24:22: [INFO]: 27   path-ascii-doc-example-http://example.com/data/mydata?row=24	path-ascii-doc-example-http:%2F%2Fexample.com%2Fdata%2Fmydata%3Frow=24 [org.dataone.integration.it.testImplementations.MNReadTestImplementations]
20171030-17:24:22: [INFO]: 28   common-bmp-doc-example-ฉันกินกระจกได้	common-bmp-doc-example-%E0%B8%89%E0%B8%B1%E0%B8%99%E0%B8%81%E0%B8%B4%E0%B8%99%E0%B8%81%E0%B8%A3%E0%B8%B0%E0%B8%88%E0%B8%81%E0%B9%84%E0%B8%94%E0%B9%89 [org.dataone.integration.it.testImplementations.MNReadTestImplementations]
20171030-17:24:22: [INFO]: 29   common-bmp-doc-example-Is_féidir_liom_ithe_gloine	common-bmp-doc-example-Is_f%C3%A9idir_liom_ithe_gloine [org.dataone.integration.it.testImplementations.MNReadTestImplementations]
20171030-17:24:22: [INFO]:  [org.dataone.integration.it.testImplementations.MNReadTestImplementations]
20171030-17:24:22: [INFO]: 0    unicode String:: common-unicode-ascii-safe-ABCDEFGHIJKLMNOPQRSTUVWXYZ [org.dataone.integration.it.testImplementations.MNReadTestImplementations]
20171030-17:24:22: [INFO]: RestClient.doRequestNoBody, thread(1) call Info: GET https://mn-sandbox-ucsb-1.test.dataone.org/knb/d1/mn/v2/replica/Test201730392422231_common-unicode-ascii-safe-ABCDEFGHIJKLMNOPQRSTUVWXYZ [org.dataone.client.rest.RestClient]
20171030-17:24:22: [INFO]:  [org.dataone.integration.it.testImplementations.MNReadTestImplementations]
20171030-17:24:22: [INFO]: 1    unicode String:: common-unicode-ascii-safe-abcdefghijklmnopqrstuvwxyz [org.dataone.integration.it.testImplementations.MNReadTestImplementations]
20171030-17:24:22: [INFO]: RestClient.doRequestNoBody, thread(1) call Info: GET https://mn-sandbox-ucsb-1.test.dataone.org/knb/d1/mn/v2/replica/Test201730392422340_common-unicode-ascii-safe-abcdefghijklmnopqrstuvwxyz [org.dataone.client.rest.RestClient]
20171030-17:24:22: [INFO]:  [org.dataone.integration.it.testImplementations.MNReadTestImplementations]
20171030-17:24:22: [INFO]: 2    unicode String:: common-unicode-ascii-safe-0123456789 [org.dataone.integration.it.testImplementations.MNReadTestImplementations]
20171030-17:24:22: [INFO]: RestClient.doRequestNoBody, thread(1) call Info: GET https://mn-sandbox-ucsb-1.test.dataone.org/knb/d1/mn/v2/replica/Test201730392422439_common-unicode-ascii-safe-0123456789 [org.dataone.client.rest.RestClient]
20171030-17:24:22: [INFO]:  [org.dataone.integration.it.testImplementations.MNReadTestImplementations]
20171030-17:24:22: [INFO]: 3    unicode String:: common-unicode-ascii-safe-:@$-_.!*()',~ [org.dataone.integration.it.testImplementations.MNReadTestImplementations]
20171030-17:24:22: [INFO]: RestClient.doRequestNoBody, thread(1) call Info: GET https://mn-sandbox-ucsb-1.test.dataone.org/knb/d1/mn/v2/replica/Test201730392422539_common-unicode-ascii-safe-:@$-_.!*()',~ [org.dataone.client.rest.RestClient]
20171030-17:24:22: [INFO]:  [org.dataone.integration.it.testImplementations.MNReadTestImplementations]
20171030-17:24:22: [INFO]: 4    unicode String:: common-unicode-ascii-safe-unreserved-._~ [org.dataone.integration.it.testImplementations.MNReadTestImplementations]
20171030-17:24:22: [INFO]: RestClient.doRequestNoBody, thread(1) call Info: GET https://mn-sandbox-ucsb-1.test.dataone.org/knb/d1/mn/v2/replica/Test201730392422639_common-unicode-ascii-safe-unreserved-._~ [org.dataone.client.rest.RestClient]
20171030-17:24:22: [INFO]:  [org.dataone.integration.it.testImplementations.MNReadTestImplementations]
20171030-17:24:22: [INFO]: 5    unicode String:: common-unicode-ascii-safe-sub-delims-$!*()', [org.dataone.integration.it.testImplementations.MNReadTestImplementations]
20171030-17:24:22: [INFO]: RestClient.doRequestNoBody, thread(1) call Info: GET https://mn-sandbox-ucsb-1.test.dataone.org/knb/d1/mn/v2/replica/Test201730392422744_common-unicode-ascii-safe-sub-delims-$!*()', [org.dataone.client.rest.RestClient]
20171030-17:24:22: [INFO]:  [org.dataone.integration.it.testImplementations.MNReadTestImplementations]
20171030-17:24:22: [INFO]: 6    unicode String:: common-unicode-ascii-safe-gen-delims-:@ [org.dataone.integration.it.testImplementations.MNReadTestImplementations]
20171030-17:24:22: [INFO]: RestClient.doRequestNoBody, thread(1) call Info: GET https://mn-sandbox-ucsb-1.test.dataone.org/knb/d1/mn/v2/replica/Test201730392422844_common-unicode-ascii-safe-gen-delims-:@ [org.dataone.client.rest.RestClient]
20171030-17:24:22: [INFO]:  [org.dataone.integration.it.testImplementations.MNReadTestImplementations]
20171030-17:24:22: [INFO]: 7    unicode String:: common-unicode-ascii-escaped-"#<>[]^`{}| [org.dataone.integration.it.testImplementations.MNReadTestImplementations]
20171030-17:24:23: [INFO]: RestClient.doRequestNoBody, thread(1) call Info: GET https://mn-sandbox-ucsb-1.test.dataone.org/knb/d1/mn/v2/replica/Test201730392422942_common-unicode-ascii-escaped-%22%23%3C%3E%5B%5D%5E%60%7B%7D%7C [org.dataone.client.rest.RestClient]
20171030-17:24:23: [INFO]:  [org.dataone.integration.it.testImplementations.MNReadTestImplementations]
20171030-17:24:23: [INFO]: 8    unicode String:: common-unicode-ascii-escaped-tomcatBlocked-\ [org.dataone.integration.it.testImplementations.MNReadTestImplementations]
20171030-17:24:23: [INFO]: RestClient.doRequestNoBody, thread(1) call Info: GET https://mn-sandbox-ucsb-1.test.dataone.org/knb/d1/mn/v2/replica/Test20173039242340_common-unicode-ascii-escaped-tomcatBlocked-%5C [org.dataone.client.rest.RestClient]
20171030-17:24:23: [INFO]:  [org.dataone.integration.it.testImplementations.MNReadTestImplementations]
20171030-17:24:23: [INFO]: 9    unicode String:: common-unicode-ascii-escaped-tomcatBlocked-%5C [org.dataone.integration.it.testImplementations.MNReadTestImplementations]
20171030-17:24:23: [INFO]: RestClient.doRequestNoBody, thread(1) call Info: GET https://mn-sandbox-ucsb-1.test.dataone.org/knb/d1/mn/v2/replica/Test201730392423140_common-unicode-ascii-escaped-tomcatBlocked-%255C [org.dataone.client.rest.RestClient]
20171030-17:24:23: [INFO]:  [org.dataone.integration.it.testImplementations.MNReadTestImplementations]
20171030-17:24:23: [INFO]: 10    unicode String:: common-unicode-ascii-semi-colon-test-%3B [org.dataone.integration.it.testImplementations.MNReadTestImplementations]
20171030-17:24:23: [INFO]: RestClient.doRequestNoBody, thread(1) call Info: GET https://mn-sandbox-ucsb-1.test.dataone.org/knb/d1/mn/v2/replica/Test201730392423241_common-unicode-ascii-semi-colon-test-%253B [org.dataone.client.rest.RestClient]
20171030-17:24:23: [INFO]:  [org.dataone.integration.it.testImplementations.MNReadTestImplementations]
20171030-17:24:23: [INFO]: 11    unicode String:: common-unicode-ascii-escaped-% [org.dataone.integration.it.testImplementations.MNReadTestImplementations]
20171030-17:24:23: [INFO]: RestClient.doRequestNoBody, thread(1) call Info: GET https://mn-sandbox-ucsb-1.test.dataone.org/knb/d1/mn/v2/replica/Test201730392423341_common-unicode-ascii-escaped-%25 [org.dataone.client.rest.RestClient]
20171030-17:24:23: [INFO]:  [org.dataone.integration.it.testImplementations.MNReadTestImplementations]
20171030-17:24:23: [INFO]: 12    unicode String:: common-unicode-ascii-escape-anyway-+ [org.dataone.integration.it.testImplementations.MNReadTestImplementations]
20171030-17:24:23: [INFO]: RestClient.doRequestNoBody, thread(1) call Info: GET https://mn-sandbox-ucsb-1.test.dataone.org/knb/d1/mn/v2/replica/Test201730392423440_common-unicode-ascii-escape-anyway-%2B [org.dataone.client.rest.RestClient]
20171030-17:24:23: [INFO]:  [org.dataone.integration.it.testImplementations.MNReadTestImplementations]
20171030-17:24:23: [INFO]: 13    unicode String:: path-unicode-ascii-safe-&=&= [org.dataone.integration.it.testImplementations.MNReadTestImplementations]
20171030-17:24:23: [INFO]: RestClient.doRequestNoBody, thread(1) call Info: GET https://mn-sandbox-ucsb-1.test.dataone.org/knb/d1/mn/v2/replica/Test201730392423538_path-unicode-ascii-safe-&=&= [org.dataone.client.rest.RestClient]
20171030-17:24:23: [INFO]:  [org.dataone.integration.it.testImplementations.MNReadTestImplementations]
20171030-17:24:23: [INFO]: 14    unicode String:: path-unicode-ascii-escaped-; [org.dataone.integration.it.testImplementations.MNReadTestImplementations]
20171030-17:24:23: [INFO]: RestClient.doRequestNoBody, thread(1) call Info: GET https://mn-sandbox-ucsb-1.test.dataone.org/knb/d1/mn/v2/replica/Test201730392423637_path-unicode-ascii-escaped-%3B [org.dataone.client.rest.RestClient]
20171030-17:24:23: [INFO]:  [org.dataone.integration.it.testImplementations.MNReadTestImplementations]
20171030-17:24:23: [INFO]: 15    unicode String:: path-unicode-ascii-escaped-? [org.dataone.integration.it.testImplementations.MNReadTestImplementations]
20171030-17:24:23: [INFO]: RestClient.doRequestNoBody, thread(1) call Info: GET https://mn-sandbox-ucsb-1.test.dataone.org/knb/d1/mn/v2/replica/Test201730392423738_path-unicode-ascii-escaped-%3F [org.dataone.client.rest.RestClient]
20171030-17:24:23: [INFO]:  [org.dataone.integration.it.testImplementations.MNReadTestImplementations]
20171030-17:24:23: [INFO]: 16    unicode String:: path-unicode-ascii-escaped-/ [org.dataone.integration.it.testImplementations.MNReadTestImplementations]
20171030-17:24:23: [INFO]: RestClient.doRequestNoBody, thread(1) call Info: GET https://mn-sandbox-ucsb-1.test.dataone.org/knb/d1/mn/v2/replica/Test201730392423860_path-unicode-ascii-escaped-%2F [org.dataone.client.rest.RestClient]
20171030-17:24:23: [INFO]:  [org.dataone.integration.it.testImplementations.MNReadTestImplementations]
20171030-17:24:23: [INFO]: 17    unicode String:: path-unicode-ascii-escaped-%3F [org.dataone.integration.it.testImplementations.MNReadTestImplementations]
20171030-17:24:24: [INFO]: RestClient.doRequestNoBody, thread(1) call Info: GET https://mn-sandbox-ucsb-1.test.dataone.org/knb/d1/mn/v2/replica/Test201730392423959_path-unicode-ascii-escaped-%253F [org.dataone.client.rest.RestClient]
20171030-17:24:24: [INFO]:  [org.dataone.integration.it.testImplementations.MNReadTestImplementations]
20171030-17:24:24: [INFO]: 18    unicode String:: path-unicode-ascii-escaped-%2F [org.dataone.integration.it.testImplementations.MNReadTestImplementations]
20171030-17:24:24: [INFO]: RestClient.doRequestNoBody, thread(1) call Info: GET https://mn-sandbox-ucsb-1.test.dataone.org/knb/d1/mn/v2/replica/Test20173039242459_path-unicode-ascii-escaped-%252F [org.dataone.client.rest.RestClient]
20171030-17:24:24: [INFO]:  [org.dataone.integration.it.testImplementations.MNReadTestImplementations]
20171030-17:24:24: [INFO]: 19    unicode String:: path-unicode-ascii-escaped-double-//case [org.dataone.integration.it.testImplementations.MNReadTestImplementations]
20171030-17:24:24: [INFO]: RestClient.doRequestNoBody, thread(1) call Info: GET https://mn-sandbox-ucsb-1.test.dataone.org/knb/d1/mn/v2/replica/Test201730392424156_path-unicode-ascii-escaped-double-%2F%2Fcase [org.dataone.client.rest.RestClient]
20171030-17:24:24: [INFO]:  [org.dataone.integration.it.testImplementations.MNReadTestImplementations]
20171030-17:24:24: [INFO]: 20    unicode String:: path-unicode-ascii-escaped-double-trailing// [org.dataone.integration.it.testImplementations.MNReadTestImplementations]
20171030-17:24:24: [INFO]: RestClient.doRequestNoBody, thread(1) call Info: GET https://mn-sandbox-ucsb-1.test.dataone.org/knb/d1/mn/v2/replica/Test201730392424248_path-unicode-ascii-escaped-double-trailing%2F%2F [org.dataone.client.rest.RestClient]
20171030-17:24:24: [INFO]:  [org.dataone.integration.it.testImplementations.MNReadTestImplementations]
20171030-17:24:24: [INFO]: 21    unicode String:: path-unicode-ascii-escaped-double-%2F%2Fcase [org.dataone.integration.it.testImplementations.MNReadTestImplementations]
20171030-17:24:24: [INFO]: RestClient.doRequestNoBody, thread(1) call Info: GET https://mn-sandbox-ucsb-1.test.dataone.org/knb/d1/mn/v2/replica/Test201730392424445_path-unicode-ascii-escaped-double-%252F%252Fcase [org.dataone.client.rest.RestClient]
20171030-17:24:24: [INFO]:  [org.dataone.integration.it.testImplementations.MNReadTestImplementations]
20171030-17:24:24: [INFO]: 22    unicode String:: path-unicode-ascii-escaped-double-trailing%2F%2F [org.dataone.integration.it.testImplementations.MNReadTestImplementations]
20171030-17:24:24: [INFO]: RestClient.doRequestNoBody, thread(1) call Info: GET https://mn-sandbox-ucsb-1.test.dataone.org/knb/d1/mn/v2/replica/Test201730392424547_path-unicode-ascii-escaped-double-trailing%252F%252F [org.dataone.client.rest.RestClient]
20171030-17:24:24: [INFO]:  [org.dataone.integration.it.testImplementations.MNReadTestImplementations]
20171030-17:24:24: [INFO]: 23    unicode String:: common-unicode-bmp-1byte-escaped-¡¢£ [org.dataone.integration.it.testImplementations.MNReadTestImplementations]
20171030-17:24:24: [INFO]: RestClient.doRequestNoBody, thread(1) call Info: GET https://mn-sandbox-ucsb-1.test.dataone.org/knb/d1/mn/v2/replica/Test201730392424646_common-unicode-bmp-1byte-escaped-%C2%A1%C2%A2%C2%A3 [org.dataone.client.rest.RestClient]
20171030-17:24:24: [INFO]:  [org.dataone.integration.it.testImplementations.MNReadTestImplementations]
20171030-17:24:24: [INFO]: 24    unicode String:: common-unicode-bmp-2byte-escaped-䦹䦺 [org.dataone.integration.it.testImplementations.MNReadTestImplementations]
20171030-17:24:24: [INFO]: RestClient.doRequestNoBody, thread(1) call Info: GET https://mn-sandbox-ucsb-1.test.dataone.org/knb/d1/mn/v2/replica/Test201730392424741_common-unicode-bmp-2byte-escaped-%E4%A6%B9%E4%A6%BA [org.dataone.client.rest.RestClient]
20171030-17:24:24: [INFO]:  [org.dataone.integration.it.testImplementations.MNReadTestImplementations]
20171030-17:24:24: [INFO]: 25    unicode String:: common-ascii-doc-example-urn:lsid:ubio.org:namebank:11815 [org.dataone.integration.it.testImplementations.MNReadTestImplementations]
20171030-17:24:24: [INFO]: RestClient.doRequestNoBody, thread(1) call Info: GET https://mn-sandbox-ucsb-1.test.dataone.org/knb/d1/mn/v2/replica/Test201730392424839_common-ascii-doc-example-urn:lsid:ubio.org:namebank:11815 [org.dataone.client.rest.RestClient]
20171030-17:24:24: [INFO]:  [org.dataone.integration.it.testImplementations.MNReadTestImplementations]
20171030-17:24:24: [INFO]: 26    unicode String:: path-ascii-doc-example-10.1000/182 [org.dataone.integration.it.testImplementations.MNReadTestImplementations]
20171030-17:24:25: [INFO]: RestClient.doRequestNoBody, thread(1) call Info: GET https://mn-sandbox-ucsb-1.test.dataone.org/knb/d1/mn/v2/replica/Test201730392424936_path-ascii-doc-example-10.1000%2F182 [org.dataone.client.rest.RestClient]
20171030-17:24:25: [INFO]:  [org.dataone.integration.it.testImplementations.MNReadTestImplementations]
20171030-17:24:25: [INFO]: 27    unicode String:: path-ascii-doc-example-http://example.com/data/mydata?row=24 [org.dataone.integration.it.testImplementations.MNReadTestImplementations]
20171030-17:24:25: [INFO]: RestClient.doRequestNoBody, thread(1) call Info: GET https://mn-sandbox-ucsb-1.test.dataone.org/knb/d1/mn/v2/replica/Test20173039242536_path-ascii-doc-example-http:%2F%2Fexample.com%2Fdata%2Fmydata%3Frow=24 [org.dataone.client.rest.RestClient]
20171030-17:24:25: [INFO]:  [org.dataone.integration.it.testImplementations.MNReadTestImplementations]
20171030-17:24:25: [INFO]: 28    unicode String:: common-bmp-doc-example-ฉันกินกระจกได้ [org.dataone.integration.it.testImplementations.MNReadTestImplementations]
20171030-17:24:25: [INFO]: RestClient.doRequestNoBody, thread(1) call Info: GET https://mn-sandbox-ucsb-1.test.dataone.org/knb/d1/mn/v2/replica/Test201730392425136_common-bmp-doc-example-%E0%B8%89%E0%B8%B1%E0%B8%99%E0%B8%81%E0%B8%B4%E0%B8%99%E0%B8%81%E0%B8%A3%E0%B8%B0%E0%B8%88%E0%B8%81%E0%B9%84%E0%B8%94%E0%B9%89 [org.dataone.client.rest.RestClient]
20171030-17:24:25: [INFO]:  [org.dataone.integration.it.testImplementations.MNReadTestImplementations]
20171030-17:24:25: [INFO]: 29    unicode String:: common-bmp-doc-example-Is_féidir_liom_ithe_gloine [org.dataone.integration.it.testImplementations.MNReadTestImplementations]
20171030-17:24:25: [INFO]: RestClient.doRequestNoBody, thread(1) call Info: GET https://mn-sandbox-ucsb-1.test.dataone.org/knb/d1/mn/v2/replica/Test201730392425241_common-bmp-doc-example-Is_f%C3%A9idir_liom_ithe_gloine [org.dataone.client.rest.RestClient]
20171030-17:24:25: [INFO]: created client for certificate file: testRightsHolder with subject: CN=testRightsHolder,DC=dataone,DC=org [org.dataone.integration.ContextAwareTestCaseDataone]
20171030-17:24:25: [INFO]: 
***************** running test for testGetReplica_IdentifierEncoding() vs. node: https://mn-sandbox-ucsb-2.test.dataone.org/knb/d1/mn/v2 ***************** [org.dataone.integration.ContextAwareTestCaseDataone]
20171030-17:24:25: [INFO]: 
***************** running test for   Node:: https://mn-sandbox-ucsb-2.test.dataone.org/knb/d1/mn/v2 ***************** [org.dataone.integration.ContextAwareTestCaseDataone]
20171030-17:24:25: [INFO]:  [org.dataone.integration.it.testImplementations.MNReadTestImplementations]
20171030-17:24:25: [INFO]: 0    unicode String:: common-unicode-ascii-safe-ABCDEFGHIJKLMNOPQRSTUVWXYZ [org.dataone.integration.it.testImplementations.MNReadTestImplementations]
20171030-17:24:25: [INFO]: RestClient.doRequestNoBody, thread(1) call Info: GET https://mn-sandbox-ucsb-2.test.dataone.org/knb/d1/mn/v2/replica/Test201730392425342_common-unicode-ascii-safe-ABCDEFGHIJKLMNOPQRSTUVWXYZ [org.dataone.client.rest.RestClient]
20171030-17:24:25: [INFO]:  [org.dataone.integration.it.testImplementations.MNReadTestImplementations]
20171030-17:24:25: [INFO]: 1    unicode String:: common-unicode-ascii-safe-abcdefghijklmnopqrstuvwxyz [org.dataone.integration.it.testImplementations.MNReadTestImplementations]
20171030-17:24:25: [INFO]: RestClient.doRequestNoBody, thread(1) call Info: GET https://mn-sandbox-ucsb-2.test.dataone.org/knb/d1/mn/v2/replica/Test201730392425451_common-unicode-ascii-safe-abcdefghijklmnopqrstuvwxyz [org.dataone.client.rest.RestClient]
20171030-17:24:25: [INFO]:  [org.dataone.integration.it.testImplementations.MNReadTestImplementations]
20171030-17:24:25: [INFO]: 2    unicode String:: common-unicode-ascii-safe-0123456789 [org.dataone.integration.it.testImplementations.MNReadTestImplementations]
20171030-17:24:25: [INFO]: RestClient.doRequestNoBody, thread(1) call Info: GET https://mn-sandbox-ucsb-2.test.dataone.org/knb/d1/mn/v2/replica/Test201730392425554_common-unicode-ascii-safe-0123456789 [org.dataone.client.rest.RestClient]
20171030-17:24:25: [INFO]:  [org.dataone.integration.it.testImplementations.MNReadTestImplementations]
20171030-17:24:25: [INFO]: 3    unicode String:: common-unicode-ascii-safe-:@$-_.!*()',~ [org.dataone.integration.it.testImplementations.MNReadTestImplementations]
20171030-17:24:25: [INFO]: RestClient.doRequestNoBody, thread(1) call Info: GET https://mn-sandbox-ucsb-2.test.dataone.org/knb/d1/mn/v2/replica/Test201730392425654_common-unicode-ascii-safe-:@$-_.!*()',~ [org.dataone.client.rest.RestClient]
20171030-17:24:25: [INFO]:  [org.dataone.integration.it.testImplementations.MNReadTestImplementations]
20171030-17:24:25: [INFO]: 4    unicode String:: common-unicode-ascii-safe-unreserved-._~ [org.dataone.integration.it.testImplementations.MNReadTestImplementations]
20171030-17:24:25: [INFO]: RestClient.doRequestNoBody, thread(1) call Info: GET https://mn-sandbox-ucsb-2.test.dataone.org/knb/d1/mn/v2/replica/Test201730392425763_common-unicode-ascii-safe-unreserved-._~ [org.dataone.client.rest.RestClient]
20171030-17:24:25: [INFO]:  [org.dataone.integration.it.testImplementations.MNReadTestImplementations]
20171030-17:24:25: [INFO]: 5    unicode String:: common-unicode-ascii-safe-sub-delims-$!*()', [org.dataone.integration.it.testImplementations.MNReadTestImplementations]
20171030-17:24:25: [INFO]: RestClient.doRequestNoBody, thread(1) call Info: GET https://mn-sandbox-ucsb-2.test.dataone.org/knb/d1/mn/v2/replica/Test201730392425869_common-unicode-ascii-safe-sub-delims-$!*()', [org.dataone.client.rest.RestClient]
20171030-17:24:25: [INFO]:  [org.dataone.integration.it.testImplementations.MNReadTestImplementations]
20171030-17:24:25: [INFO]: 6    unicode String:: common-unicode-ascii-safe-gen-delims-:@ [org.dataone.integration.it.testImplementations.MNReadTestImplementations]
20171030-17:24:26: [INFO]: RestClient.doRequestNoBody, thread(1) call Info: GET https://mn-sandbox-ucsb-2.test.dataone.org/knb/d1/mn/v2/replica/Test201730392425976_common-unicode-ascii-safe-gen-delims-:@ [org.dataone.client.rest.RestClient]
20171030-17:24:26: [INFO]:  [org.dataone.integration.it.testImplementations.MNReadTestImplementations]
20171030-17:24:26: [INFO]: 7    unicode String:: common-unicode-ascii-escaped-"#<>[]^`{}| [org.dataone.integration.it.testImplementations.MNReadTestImplementations]
20171030-17:24:26: [INFO]: RestClient.doRequestNoBody, thread(1) call Info: GET https://mn-sandbox-ucsb-2.test.dataone.org/knb/d1/mn/v2/replica/Test20173039242671_common-unicode-ascii-escaped-%22%23%3C%3E%5B%5D%5E%60%7B%7D%7C [org.dataone.client.rest.RestClient]
20171030-17:24:26: [INFO]:  [org.dataone.integration.it.testImplementations.MNReadTestImplementations]
20171030-17:24:26: [INFO]: 8    unicode String:: common-unicode-ascii-escaped-tomcatBlocked-\ [org.dataone.integration.it.testImplementations.MNReadTestImplementations]
20171030-17:24:26: [INFO]: RestClient.doRequestNoBody, thread(1) call Info: GET https://mn-sandbox-ucsb-2.test.dataone.org/knb/d1/mn/v2/replica/Test201730392426173_common-unicode-ascii-escaped-tomcatBlocked-%5C [org.dataone.client.rest.RestClient]
20171030-17:24:26: [INFO]:  [org.dataone.integration.it.testImplementations.MNReadTestImplementations]
20171030-17:24:26: [INFO]: 9    unicode String:: common-unicode-ascii-escaped-tomcatBlocked-%5C [org.dataone.integration.it.testImplementations.MNReadTestImplementations]
20171030-17:24:26: [INFO]: RestClient.doRequestNoBody, thread(1) call Info: GET https://mn-sandbox-ucsb-2.test.dataone.org/knb/d1/mn/v2/replica/Test201730392426276_common-unicode-ascii-escaped-tomcatBlocked-%255C [org.dataone.client.rest.RestClient]
20171030-17:24:26: [INFO]:  [org.dataone.integration.it.testImplementations.MNReadTestImplementations]
20171030-17:24:26: [INFO]: 10    unicode String:: common-unicode-ascii-semi-colon-test-%3B [org.dataone.integration.it.testImplementations.MNReadTestImplementations]
20171030-17:24:26: [INFO]: RestClient.doRequestNoBody, thread(1) call Info: GET https://mn-sandbox-ucsb-2.test.dataone.org/knb/d1/mn/v2/replica/Test201730392426385_common-unicode-ascii-semi-colon-test-%253B [org.dataone.client.rest.RestClient]
20171030-17:24:26: [INFO]:  [org.dataone.integration.it.testImplementations.MNReadTestImplementations]
20171030-17:24:26: [INFO]: 11    unicode String:: common-unicode-ascii-escaped-% [org.dataone.integration.it.testImplementations.MNReadTestImplementations]
20171030-17:24:26: [INFO]: RestClient.doRequestNoBody, thread(1) call Info: GET https://mn-sandbox-ucsb-2.test.dataone.org/knb/d1/mn/v2/replica/Test201730392426481_common-unicode-ascii-escaped-%25 [org.dataone.client.rest.RestClient]
20171030-17:24:26: [INFO]:  [org.dataone.integration.it.testImplementations.MNReadTestImplementations]
20171030-17:24:26: [INFO]: 12    unicode String:: common-unicode-ascii-escape-anyway-+ [org.dataone.integration.it.testImplementations.MNReadTestImplementations]
20171030-17:24:26: [INFO]: RestClient.doRequestNoBody, thread(1) call Info: GET https://mn-sandbox-ucsb-2.test.dataone.org/knb/d1/mn/v2/replica/Test201730392426584_common-unicode-ascii-escape-anyway-%2B [org.dataone.client.rest.RestClient]
20171030-17:24:26: [INFO]:  [org.dataone.integration.it.testImplementations.MNReadTestImplementations]
20171030-17:24:26: [INFO]: 13    unicode String:: path-unicode-ascii-safe-&=&= [org.dataone.integration.it.testImplementations.MNReadTestImplementations]
20171030-17:24:26: [INFO]: RestClient.doRequestNoBody, thread(1) call Info: GET https://mn-sandbox-ucsb-2.test.dataone.org/knb/d1/mn/v2/replica/Test201730392426679_path-unicode-ascii-safe-&=&= [org.dataone.client.rest.RestClient]
20171030-17:24:26: [INFO]:  [org.dataone.integration.it.testImplementations.MNReadTestImplementations]
20171030-17:24:26: [INFO]: 14    unicode String:: path-unicode-ascii-escaped-; [org.dataone.integration.it.testImplementations.MNReadTestImplementations]
20171030-17:24:26: [INFO]: RestClient.doRequestNoBody, thread(1) call Info: GET https://mn-sandbox-ucsb-2.test.dataone.org/knb/d1/mn/v2/replica/Test201730392426785_path-unicode-ascii-escaped-%3B [org.dataone.client.rest.RestClient]
20171030-17:24:26: [INFO]:  [org.dataone.integration.it.testImplementations.MNReadTestImplementations]
20171030-17:24:26: [INFO]: 15    unicode String:: path-unicode-ascii-escaped-? [org.dataone.integration.it.testImplementations.MNReadTestImplementations]
20171030-17:24:26: [INFO]: RestClient.doRequestNoBody, thread(1) call Info: GET https://mn-sandbox-ucsb-2.test.dataone.org/knb/d1/mn/v2/replica/Test201730392426894_path-unicode-ascii-escaped-%3F [org.dataone.client.rest.RestClient]
20171030-17:24:26: [INFO]:  [org.dataone.integration.it.testImplementations.MNReadTestImplementations]
20171030-17:24:26: [INFO]: 16    unicode String:: path-unicode-ascii-escaped-/ [org.dataone.integration.it.testImplementations.MNReadTestImplementations]
20171030-17:24:27: [INFO]: RestClient.doRequestNoBody, thread(1) call Info: GET https://mn-sandbox-ucsb-2.test.dataone.org/knb/d1/mn/v2/replica/Test201730392426989_path-unicode-ascii-escaped-%2F [org.dataone.client.rest.RestClient]
20171030-17:24:27: [INFO]:  [org.dataone.integration.it.testImplementations.MNReadTestImplementations]
20171030-17:24:27: [INFO]: 17    unicode String:: path-unicode-ascii-escaped-%3F [org.dataone.integration.it.testImplementations.MNReadTestImplementations]
20171030-17:24:27: [INFO]: RestClient.doRequestNoBody, thread(1) call Info: GET https://mn-sandbox-ucsb-2.test.dataone.org/knb/d1/mn/v2/replica/Test20173039242795_path-unicode-ascii-escaped-%253F [org.dataone.client.rest.RestClient]
20171030-17:24:27: [INFO]:  [org.dataone.integration.it.testImplementations.MNReadTestImplementations]
20171030-17:24:27: [INFO]: 18    unicode String:: path-unicode-ascii-escaped-%2F [org.dataone.integration.it.testImplementations.MNReadTestImplementations]
20171030-17:24:27: [INFO]: RestClient.doRequestNoBody, thread(1) call Info: GET https://mn-sandbox-ucsb-2.test.dataone.org/knb/d1/mn/v2/replica/Test201730392427195_path-unicode-ascii-escaped-%252F [org.dataone.client.rest.RestClient]
20171030-17:24:27: [INFO]:  [org.dataone.integration.it.testImplementations.MNReadTestImplementations]
20171030-17:24:27: [INFO]: 19    unicode String:: path-unicode-ascii-escaped-double-//case [org.dataone.integration.it.testImplementations.MNReadTestImplementations]
20171030-17:24:27: [INFO]: RestClient.doRequestNoBody, thread(1) call Info: GET https://mn-sandbox-ucsb-2.test.dataone.org/knb/d1/mn/v2/replica/Test201730392427291_path-unicode-ascii-escaped-double-%2F%2Fcase [org.dataone.client.rest.RestClient]
20171030-17:24:27: [INFO]:  [org.dataone.integration.it.testImplementations.MNReadTestImplementations]
20171030-17:24:27: [INFO]: 20    unicode String:: path-unicode-ascii-escaped-double-trailing// [org.dataone.integration.it.testImplementations.MNReadTestImplementations]
20171030-17:24:27: [INFO]: RestClient.doRequestNoBody, thread(1) call Info: GET https://mn-sandbox-ucsb-2.test.dataone.org/knb/d1/mn/v2/replica/Test201730392427395_path-unicode-ascii-escaped-double-trailing%2F%2F [org.dataone.client.rest.RestClient]
20171030-17:24:27: [INFO]:  [org.dataone.integration.it.testImplementations.MNReadTestImplementations]
20171030-17:24:27: [INFO]: 21    unicode String:: path-unicode-ascii-escaped-double-%2F%2Fcase [org.dataone.integration.it.testImplementations.MNReadTestImplementations]
20171030-17:24:27: [INFO]: RestClient.doRequestNoBody, thread(1) call Info: GET https://mn-sandbox-ucsb-2.test.dataone.org/knb/d1/mn/v2/replica/Test201730392427515_path-unicode-ascii-escaped-double-%252F%252Fcase [org.dataone.client.rest.RestClient]
20171030-17:24:27: [INFO]:  [org.dataone.integration.it.testImplementations.MNReadTestImplementations]
20171030-17:24:27: [INFO]: 22    unicode String:: path-unicode-ascii-escaped-double-trailing%2F%2F [org.dataone.integration.it.testImplementations.MNReadTestImplementations]
20171030-17:24:27: [INFO]: RestClient.doRequestNoBody, thread(1) call Info: GET https://mn-sandbox-ucsb-2.test.dataone.org/knb/d1/mn/v2/replica/Test201730392427614_path-unicode-ascii-escaped-double-trailing%252F%252F [org.dataone.client.rest.RestClient]
20171030-17:24:27: [INFO]:  [org.dataone.integration.it.testImplementations.MNReadTestImplementations]
20171030-17:24:27: [INFO]: 23    unicode String:: common-unicode-bmp-1byte-escaped-¡¢£ [org.dataone.integration.it.testImplementations.MNReadTestImplementations]
20171030-17:24:27: [INFO]: RestClient.doRequestNoBody, thread(1) call Info: GET https://mn-sandbox-ucsb-2.test.dataone.org/knb/d1/mn/v2/replica/Test201730392427709_common-unicode-bmp-1byte-escaped-%C2%A1%C2%A2%C2%A3 [org.dataone.client.rest.RestClient]
20171030-17:24:27: [INFO]:  [org.dataone.integration.it.testImplementations.MNReadTestImplementations]
20171030-17:24:27: [INFO]: 24    unicode String:: common-unicode-bmp-2byte-escaped-䦹䦺 [org.dataone.integration.it.testImplementations.MNReadTestImplementations]
20171030-17:24:27: [INFO]: RestClient.doRequestNoBody, thread(1) call Info: GET https://mn-sandbox-ucsb-2.test.dataone.org/knb/d1/mn/v2/replica/Test201730392427810_common-unicode-bmp-2byte-escaped-%E4%A6%B9%E4%A6%BA [org.dataone.client.rest.RestClient]
20171030-17:24:27: [INFO]:  [org.dataone.integration.it.testImplementations.MNReadTestImplementations]
20171030-17:24:27: [INFO]: 25    unicode String:: common-ascii-doc-example-urn:lsid:ubio.org:namebank:11815 [org.dataone.integration.it.testImplementations.MNReadTestImplementations]
20171030-17:24:28: [INFO]: RestClient.doRequestNoBody, thread(1) call Info: GET https://mn-sandbox-ucsb-2.test.dataone.org/knb/d1/mn/v2/replica/Test201730392427913_common-ascii-doc-example-urn:lsid:ubio.org:namebank:11815 [org.dataone.client.rest.RestClient]
20171030-17:24:28: [INFO]:  [org.dataone.integration.it.testImplementations.MNReadTestImplementations]
20171030-17:24:28: [INFO]: 26    unicode String:: path-ascii-doc-example-10.1000/182 [org.dataone.integration.it.testImplementations.MNReadTestImplementations]
20171030-17:24:28: [INFO]: RestClient.doRequestNoBody, thread(1) call Info: GET https://mn-sandbox-ucsb-2.test.dataone.org/knb/d1/mn/v2/replica/Test20173039242812_path-ascii-doc-example-10.1000%2F182 [org.dataone.client.rest.RestClient]
20171030-17:24:28: [INFO]:  [org.dataone.integration.it.testImplementations.MNReadTestImplementations]
20171030-17:24:28: [INFO]: 27    unicode String:: path-ascii-doc-example-http://example.com/data/mydata?row=24 [org.dataone.integration.it.testImplementations.MNReadTestImplementations]
20171030-17:24:28: [INFO]: RestClient.doRequestNoBody, thread(1) call Info: GET https://mn-sandbox-ucsb-2.test.dataone.org/knb/d1/mn/v2/replica/Test201730392428108_path-ascii-doc-example-http:%2F%2Fexample.com%2Fdata%2Fmydata%3Frow=24 [org.dataone.client.rest.RestClient]
20171030-17:24:28: [INFO]:  [org.dataone.integration.it.testImplementations.MNReadTestImplementations]
20171030-17:24:28: [INFO]: 28    unicode String:: common-bmp-doc-example-ฉันกินกระจกได้ [org.dataone.integration.it.testImplementations.MNReadTestImplementations]
20171030-17:24:28: [INFO]: RestClient.doRequestNoBody, thread(1) call Info: GET https://mn-sandbox-ucsb-2.test.dataone.org/knb/d1/mn/v2/replica/Test201730392428208_common-bmp-doc-example-%E0%B8%89%E0%B8%B1%E0%B8%99%E0%B8%81%E0%B8%B4%E0%B8%99%E0%B8%81%E0%B8%A3%E0%B8%B0%E0%B8%88%E0%B8%81%E0%B9%84%E0%B8%94%E0%B9%89 [org.dataone.client.rest.RestClient]
20171030-17:24:28: [INFO]:  [org.dataone.integration.it.testImplementations.MNReadTestImplementations]
20171030-17:24:28: [INFO]: 29    unicode String:: common-bmp-doc-example-Is_féidir_liom_ithe_gloine [org.dataone.integration.it.testImplementations.MNReadTestImplementations]
20171030-17:24:28: [INFO]: RestClient.doRequestNoBody, thread(1) call Info: GET https://mn-sandbox-ucsb-2.test.dataone.org/knb/d1/mn/v2/replica/Test201730392428311_common-bmp-doc-example-Is_f%C3%A9idir_liom_ithe_gloine [org.dataone.client.rest.RestClient]
20171030-17:24:28: [INFO]: **************************************************** [org.dataone.integration.ContextAwareTestCaseDataone]
20171030-17:24:28: [INFO]: ***  context label:   SANDBOX [org.dataone.integration.ContextAwareTestCaseDataone]
20171030-17:24:28: [INFO]: **************************************************** [org.dataone.integration.ContextAwareTestCaseDataone]
20171030-17:24:28: [INFO]: **************************************************** [org.dataone.integration.ContextAwareTestCaseDataone]
                          nodeId  key                       value
=============================================================================================================
         urn:node:mnSandboxUCSB1  objectList_hits           3
         urn:node:mnSandboxUCSB1  publicObject_cacheDate    Mon Oct 30 17:08:13 UTC 2017
         urn:node:mnSandboxUCSB1  publicObject_hits         9
         urn:node:mnSandboxUCSB1  objectList_cacheDate      Mon Oct 30 17:24:01 UTC 2017
         urn:node:mnSandboxUCSB1  publicObject              TierTesting:mn-sandbox-ucsb-1:Public_READ.15
         urn:node:mnSandboxUCSB1  objectList                org.dataone.service.types.v1.ObjectList@61d2f267
=============================================================================================================
         urn:node:mnSandboxUCSB2  objectList_hits           3
         urn:node:mnSandboxUCSB2  publicObject_cacheDate    Mon Oct 30 17:08:17 UTC 2017
         urn:node:mnSandboxUCSB2  publicObject_hits         9
         urn:node:mnSandboxUCSB2  objectList_cacheDate      Mon Oct 30 17:24:01 UTC 2017
         urn:node:mnSandboxUCSB2  publicObject              TierTesting:mn-sandbox-ucsb-2:Public_READ.15
         urn:node:mnSandboxUCSB2  objectList                org.dataone.service.types.v1.ObjectList@26d40c77
=============================================================================================================
20171030-17:24:28: [INFO]: Testing get() method ...  [org.dataone.integration.ContextAwareTestCaseDataone]
20171030-17:24:28: [INFO]: Testing get(), Case1 [org.dataone.integration.ContextAwareTestCaseDataone]
20171030-17:24:28: [INFO]: **************************************************** [org.dataone.integration.ContextAwareTestCaseDataone]
20171030-17:24:28: [INFO]: ***  context label:   SANDBOX [org.dataone.integration.ContextAwareTestCaseDataone]
20171030-17:24:28: [INFO]: **************************************************** [org.dataone.integration.ContextAwareTestCaseDataone]
20171030-17:24:28: [INFO]: **************************************************** [org.dataone.integration.ContextAwareTestCaseDataone]
                          nodeId  key                       value
=============================================================================================================
         urn:node:mnSandboxUCSB1  objectList_hits           3
         urn:node:mnSandboxUCSB1  publicObject_cacheDate    Mon Oct 30 17:08:13 UTC 2017
         urn:node:mnSandboxUCSB1  publicObject_hits         9
         urn:node:mnSandboxUCSB1  objectList_cacheDate      Mon Oct 30 17:24:01 UTC 2017
         urn:node:mnSandboxUCSB1  publicObject              TierTesting:mn-sandbox-ucsb-1:Public_READ.15
         urn:node:mnSandboxUCSB1  objectList                org.dataone.service.types.v1.ObjectList@61d2f267
=============================================================================================================
         urn:node:mnSandboxUCSB2  objectList_hits           3
         urn:node:mnSandboxUCSB2  publicObject_cacheDate    Mon Oct 30 17:08:17 UTC 2017
         urn:node:mnSandboxUCSB2  publicObject_hits         9
         urn:node:mnSandboxUCSB2  objectList_cacheDate      Mon Oct 30 17:24:01 UTC 2017
         urn:node:mnSandboxUCSB2  publicObject              TierTesting:mn-sandbox-ucsb-2:Public_READ.15
         urn:node:mnSandboxUCSB2  objectList                org.dataone.service.types.v1.ObjectList@26d40c77
=============================================================================================================
20171030-17:24:28: [INFO]: Testing getSystemMetadata() method ...  [org.dataone.integration.ContextAwareTestCaseDataone]
20171030-17:24:28: [INFO]: Testing getSystemMetadata(), Case1 [org.dataone.integration.ContextAwareTestCaseDataone]
20171030-17:24:28: [INFO]: **************************************************** [org.dataone.integration.ContextAwareTestCaseDataone]
20171030-17:24:28: [INFO]: ***  context label:   SANDBOX [org.dataone.integration.ContextAwareTestCaseDataone]
20171030-17:24:28: [INFO]: **************************************************** [org.dataone.integration.ContextAwareTestCaseDataone]
20171030-17:24:28: [INFO]: **************************************************** [org.dataone.integration.ContextAwareTestCaseDataone]
                          nodeId  key                       value
=============================================================================================================
         urn:node:mnSandboxUCSB1  objectList_hits           3
         urn:node:mnSandboxUCSB1  publicObject_cacheDate    Mon Oct 30 17:08:13 UTC 2017
         urn:node:mnSandboxUCSB1  publicObject_hits         9
         urn:node:mnSandboxUCSB1  objectList_cacheDate      Mon Oct 30 17:24:01 UTC 2017
         urn:node:mnSandboxUCSB1  publicObject              TierTesting:mn-sandbox-ucsb-1:Public_READ.15
         urn:node:mnSandboxUCSB1  objectList                org.dataone.service.types.v1.ObjectList@61d2f267
=============================================================================================================
         urn:node:mnSandboxUCSB2  objectList_hits           3
         urn:node:mnSandboxUCSB2  publicObject_cacheDate    Mon Oct 30 17:08:17 UTC 2017
         urn:node:mnSandboxUCSB2  publicObject_hits         9
         urn:node:mnSandboxUCSB2  objectList_cacheDate      Mon Oct 30 17:24:01 UTC 2017
         urn:node:mnSandboxUCSB2  publicObject              TierTesting:mn-sandbox-ucsb-2:Public_READ.15
         urn:node:mnSandboxUCSB2  objectList                org.dataone.service.types.v1.ObjectList@26d40c77
=============================================================================================================
20171030-17:24:28: [INFO]: Testing describe() method ...  [org.dataone.integration.ContextAwareTestCaseDataone]
20171030-17:24:28: [INFO]: Testing describe(), Case1 [org.dataone.integration.ContextAwareTestCaseDataone]
20171030-17:24:28: [INFO]: **************************************************** [org.dataone.integration.ContextAwareTestCaseDataone]
20171030-17:24:28: [INFO]: ***  context label:   SANDBOX [org.dataone.integration.ContextAwareTestCaseDataone]
20171030-17:24:28: [INFO]: **************************************************** [org.dataone.integration.ContextAwareTestCaseDataone]
20171030-17:24:28: [INFO]: **************************************************** [org.dataone.integration.ContextAwareTestCaseDataone]
                          nodeId  key                       value
=============================================================================================================
         urn:node:mnSandboxUCSB1  objectList_hits           3
         urn:node:mnSandboxUCSB1  publicObject_cacheDate    Mon Oct 30 17:08:13 UTC 2017
         urn:node:mnSandboxUCSB1  publicObject_hits         9
         urn:node:mnSandboxUCSB1  objectList_cacheDate      Mon Oct 30 17:24:01 UTC 2017
         urn:node:mnSandboxUCSB1  publicObject              TierTesting:mn-sandbox-ucsb-1:Public_READ.15
         urn:node:mnSandboxUCSB1  objectList                org.dataone.service.types.v1.ObjectList@61d2f267
=============================================================================================================
         urn:node:mnSandboxUCSB2  objectList_hits           3
         urn:node:mnSandboxUCSB2  publicObject_cacheDate    Mon Oct 30 17:08:17 UTC 2017
         urn:node:mnSandboxUCSB2  publicObject_hits         9
         urn:node:mnSandboxUCSB2  objectList_cacheDate      Mon Oct 30 17:24:01 UTC 2017
         urn:node:mnSandboxUCSB2  publicObject              TierTesting:mn-sandbox-ucsb-2:Public_READ.15
         urn:node:mnSandboxUCSB2  objectList                org.dataone.service.types.v1.ObjectList@26d40c77
=============================================================================================================
20171030-17:24:28: [INFO]: Testing listObjects() method ...  [org.dataone.integration.ContextAwareTestCaseDataone]
20171030-17:24:28: [INFO]: Testing listObjects(), Case1 [org.dataone.integration.ContextAwareTestCaseDataone]
20171030-17:24:28: [INFO]: **************************************************** [org.dataone.integration.ContextAwareTestCaseDataone]
20171030-17:24:28: [INFO]: ***  context label:   SANDBOX [org.dataone.integration.ContextAwareTestCaseDataone]
20171030-17:24:28: [INFO]: **************************************************** [org.dataone.integration.ContextAwareTestCaseDataone]
20171030-17:24:28: [INFO]: **************************************************** [org.dataone.integration.ContextAwareTestCaseDataone]
                          nodeId  key                       value
=============================================================================================================
         urn:node:mnSandboxUCSB1  objectList_hits           3
         urn:node:mnSandboxUCSB1  publicObject_cacheDate    Mon Oct 30 17:08:13 UTC 2017
         urn:node:mnSandboxUCSB1  publicObject_hits         9
         urn:node:mnSandboxUCSB1  objectList_cacheDate      Mon Oct 30 17:24:01 UTC 2017
         urn:node:mnSandboxUCSB1  publicObject              TierTesting:mn-sandbox-ucsb-1:Public_READ.15
         urn:node:mnSandboxUCSB1  objectList                org.dataone.service.types.v1.ObjectList@61d2f267
=============================================================================================================
         urn:node:mnSandboxUCSB2  objectList_hits           3
         urn:node:mnSandboxUCSB2  publicObject_cacheDate    Mon Oct 30 17:08:17 UTC 2017
         urn:node:mnSandboxUCSB2  publicObject_hits         9
         urn:node:mnSandboxUCSB2  objectList_cacheDate      Mon Oct 30 17:24:01 UTC 2017
         urn:node:mnSandboxUCSB2  publicObject              TierTesting:mn-sandbox-ucsb-2:Public_READ.15
         urn:node:mnSandboxUCSB2  objectList                org.dataone.service.types.v1.ObjectList@26d40c77
=============================================================================================================
20171030-17:24:28: [INFO]: created client for certificate file: cnSandboxORC1 with subject: CN=urn:node:cnSandboxORC1,DC=dataone,DC=org [org.dataone.integration.ContextAwareTestCaseDataone]
20171030-17:24:28: [INFO]: RestClient.doRequestNoBody, thread(1) call Info: GET https://mn-sandbox-ucsb-1.test.dataone.org/knb/d1/mn/v2/monitor/ping [org.dataone.client.rest.RestClient]
20171030-17:24:28: [INFO]: MN included in test: https://mn-sandbox-ucsb-1.test.dataone.org/knb/d1/mn [org.dataone.integration.ContextAwareTestCaseDataone]
20171030-17:24:28: [INFO]: created client for certificate file: cnSandboxORC1 with subject: CN=urn:node:cnSandboxORC1,DC=dataone,DC=org [org.dataone.integration.ContextAwareTestCaseDataone]
20171030-17:24:28: [INFO]: RestClient.doRequestNoBody, thread(1) call Info: GET https://mn-sandbox-ucsb-2.test.dataone.org/knb/d1/mn/v2/monitor/ping [org.dataone.client.rest.RestClient]
20171030-17:24:28: [INFO]: MN included in test: https://mn-sandbox-ucsb-2.test.dataone.org/knb/d1/mn [org.dataone.integration.ContextAwareTestCaseDataone]
20171030-17:24:28: [INFO]: created client for certificate file: cnSandboxORC1 with subject: CN=urn:node:cnSandboxORC1,DC=dataone,DC=org [org.dataone.integration.ContextAwareTestCaseDataone]
20171030-17:24:28: [INFO]: RestClient.doRequestNoBody, thread(1) call Info: GET https://mn-sandbox-orc-1.test.dataone.org/mn/v2/monitor/ping [org.dataone.client.rest.RestClient]
20171030-17:24:28: [INFO]: MN excluded from test: https://mn-sandbox-orc-1.test.dataone.org/mn [org.dataone.integration.ContextAwareTestCaseDataone]
20171030-17:24:28: [INFO]: created client for certificate file: cnSandboxORC1 with subject: CN=urn:node:cnSandboxORC1,DC=dataone,DC=org [org.dataone.integration.ContextAwareTestCaseDataone]
20171030-17:24:29: [INFO]: RestClient.doRequestNoBody, thread(1) call Info: GET http://usgs.ornl.gov/USGS_MN/mn/v2/monitor/ping [org.dataone.client.rest.RestClient]
20171030-17:24:29: [INFO]: MN excluded from test: http://usgs.ornl.gov/USGS_MN/mn [org.dataone.integration.ContextAwareTestCaseDataone]
20171030-17:24:29: [INFO]: created client for certificate file: cnSandboxORC1 with subject: CN=urn:node:cnSandboxORC1,DC=dataone,DC=org [org.dataone.integration.ContextAwareTestCaseDataone]
20171030-17:24:29: [INFO]: RestClient.doRequestNoBody, thread(1) call Info: GET https://alpha.tdar.org/dataone/v2/monitor/ping [org.dataone.client.rest.RestClient]
20171030-17:24:29: [INFO]: MN excluded from test: https://alpha.tdar.org/dataone/ [org.dataone.integration.ContextAwareTestCaseDataone]
20171030-17:24:29: [INFO]: created client for certificate file: cnSandboxORC1 with subject: CN=urn:node:cnSandboxORC1,DC=dataone,DC=org [org.dataone.integration.ContextAwareTestCaseDataone]
20171030-17:24:30: [INFO]: RestClient.doRequestNoBody, thread(1) call Info: GET https://test-prod.bco-dmo.org/d1/mn/v2/monitor/ping [org.dataone.client.rest.RestClient]
20171030-17:24:30: [INFO]: MN excluded from test: https://test-prod.bco-dmo.org/d1/mn [org.dataone.integration.ContextAwareTestCaseDataone]
20171030-17:24:30: [INFO]: created client for certificate file: cnSandboxORC1 with subject: CN=urn:node:cnSandboxORC1,DC=dataone,DC=org [org.dataone.integration.ContextAwareTestCaseDataone]
20171030-17:24:30: [INFO]: RestClient.doRequestNoBody, thread(1) call Info: GET https://ncei-node.test.dataone.org/mn/v2/monitor/ping [org.dataone.client.rest.RestClient]
20171030-17:24:30: [INFO]: MN excluded from test: https://ncei-node.test.dataone.org/mn [org.dataone.integration.ContextAwareTestCaseDataone]
20171030-17:24:30: [INFO]: created client for certificate file: cnSandboxORC1 with subject: CN=urn:node:cnSandboxORC1,DC=dataone,DC=org [org.dataone.integration.ContextAwareTestCaseDataone]
20171030-17:24:30: [INFO]: RestClient.doRequestNoBody, thread(1) call Info: GET https://edacd1mn.unm.edu/mn/v2/monitor/ping [org.dataone.client.rest.RestClient]
20171030-17:24:30: [INFO]: MN excluded from test: https://edacd1mn.unm.edu/mn [org.dataone.integration.ContextAwareTestCaseDataone]
20171030-17:24:30: [INFO]: created client for certificate file: cnSandboxORC1 with subject: CN=urn:node:cnSandboxORC1,DC=dataone,DC=org [org.dataone.integration.ContextAwareTestCaseDataone]
20171030-17:24:30: [INFO]: RestClient.doRequestNoBody, thread(1) call Info: GET https://gmnv2.test.dataone.org/mn/v2/monitor/ping [org.dataone.client.rest.RestClient]
20171030-17:24:30: [INFO]: MN excluded from test: https://gmnv2.test.dataone.org/mn [org.dataone.integration.ContextAwareTestCaseDataone]
20171030-17:24:30: [INFO]: certificate directory: /etc/dataone/client/testClientCerts/ [org.dataone.integration.ContextAwareTestCaseDataone]
20171030-17:24:30: [INFO]: certificate filename: cnDevUNM1 [org.dataone.integration.ContextAwareTestCaseDataone]
20171030-17:24:30: [WARN]: registering ConnectionManager... [org.dataone.client.utils.HttpConnectionMonitorService]
20171030-17:24:30: [INFO]: client setup as Subject: CN=urn:node:cnDevUNM1,DC=dataone,DC=org [org.dataone.integration.ContextAwareTestCaseDataone]
20171030-17:24:30: [WARN]: registering ConnectionManager... [org.dataone.client.utils.HttpConnectionMonitorService]
20171030-17:24:30: [INFO]: created client for certificate file: cnDevUNM1 with subject: CN=urn:node:cnDevUNM1,DC=dataone,DC=org [org.dataone.integration.ContextAwareTestCaseDataone]
20171030-17:24:30: [INFO]: certificate directory: /etc/dataone/client/testClientCerts/ [org.dataone.integration.ContextAwareTestCaseDataone]
20171030-17:24:30: [INFO]: certificate filename: cnDevUNM2 [org.dataone.integration.ContextAwareTestCaseDataone]
20171030-17:24:30: [WARN]: registering ConnectionManager... [org.dataone.client.utils.HttpConnectionMonitorService]
20171030-17:24:30: [INFO]: client setup as Subject: CN=urn:node:cnDevUNM2,DC=dataone,DC=org [org.dataone.integration.ContextAwareTestCaseDataone]
20171030-17:24:30: [WARN]: registering ConnectionManager... [org.dataone.client.utils.HttpConnectionMonitorService]
20171030-17:24:30: [INFO]: created client for certificate file: cnDevUNM2 with subject: CN=urn:node:cnDevUNM2,DC=dataone,DC=org [org.dataone.integration.ContextAwareTestCaseDataone]
20171030-17:24:30: [INFO]: created client for certificate file: cnSandboxORC1 with subject: CN=urn:node:cnSandboxORC1,DC=dataone,DC=org [org.dataone.integration.ContextAwareTestCaseDataone]
20171030-17:24:30: [INFO]: certificate directory: /etc/dataone/client/testClientCerts/ [org.dataone.integration.ContextAwareTestCaseDataone]
20171030-17:24:30: [INFO]: certificate filename: cnStageUNM1 [org.dataone.integration.ContextAwareTestCaseDataone]
20171030-17:24:30: [WARN]: registering ConnectionManager... [org.dataone.client.utils.HttpConnectionMonitorService]
20171030-17:24:30: [INFO]: client setup as Subject: CN=urn:node:cnStageUNM1,DC=dataone,DC=org [org.dataone.integration.ContextAwareTestCaseDataone]
20171030-17:24:30: [WARN]: registering ConnectionManager... [org.dataone.client.utils.HttpConnectionMonitorService]
20171030-17:24:30: [INFO]: created client for certificate file: cnStageUNM1 with subject: CN=urn:node:cnStageUNM1,DC=dataone,DC=org [org.dataone.integration.ContextAwareTestCaseDataone]
20171030-17:24:30: [INFO]: created client for certificate file: testRightsHolder with subject: CN=testRightsHolder,DC=dataone,DC=org [org.dataone.integration.ContextAwareTestCaseDataone]
20171030-17:24:30: [INFO]: 
***************** running test for testSystemMetadataChanged() vs. node: https://mn-sandbox-ucsb-1.test.dataone.org/knb/d1/mn/v2 ***************** [org.dataone.integration.ContextAwareTestCaseDataone]
20171030-17:24:30: [INFO]: Using cached identifier for node urn:node:mnSandboxUCSB1 [org.dataone.integration.ContextAwareTestCaseDataone]
20171030-17:24:30: [INFO]: RestClient.doRequestNoBody, thread(1) call Info: GET https://mn-sandbox-ucsb-1.test.dataone.org/knb/d1/mn/v2/meta/TierTesting:mn-sandbox-ucsb-1:Public_READ.15 [org.dataone.client.rest.RestClient]
20171030-17:24:31: [INFO]: RestClient.doRequestMMPBody, thread(1) call Info: POST https://mn-sandbox-ucsb-1.test.dataone.org/knb/d1/mn/v2/dirtySystemMetadata; MMP message has: ParamPart:pid = TierTesting:mn-sandbox-ucsb-1:Public_READ.15; ParamPart:dateSysMetaLastModified = 2017-10-30T17:24:30.770+00:00; ParamPart:serialVersion = 10;  [org.dataone.client.rest.RestClient]
20171030-17:24:31: [INFO]: NotAuthorized with cert : cnDevUNM1 [org.dataone.integration.it.ContextAwareAdapter]
20171030-17:24:31: [INFO]: RestClient.doRequestMMPBody, thread(1) call Info: POST https://mn-sandbox-ucsb-1.test.dataone.org/knb/d1/mn/v2/dirtySystemMetadata; MMP message has: ParamPart:pid = TierTesting:mn-sandbox-ucsb-1:Public_READ.15; ParamPart:dateSysMetaLastModified = 2017-10-30T17:24:30.770+00:00; ParamPart:serialVersion = 10;  [org.dataone.client.rest.RestClient]
20171030-17:24:31: [INFO]: NotAuthorized with cert : cnDevUNM2 [org.dataone.integration.it.ContextAwareAdapter]
20171030-17:24:31: [INFO]: RestClient.doRequestMMPBody, thread(1) call Info: POST https://mn-sandbox-ucsb-1.test.dataone.org/knb/d1/mn/v2/dirtySystemMetadata; MMP message has: ParamPart:pid = TierTesting:mn-sandbox-ucsb-1:Public_READ.15; ParamPart:dateSysMetaLastModified = 2017-10-30T17:24:30.770+00:00; ParamPart:serialVersion = 10;  [org.dataone.client.rest.RestClient]
20171030-17:24:31: [INFO]: success with cert : cnSandboxORC1 [org.dataone.integration.it.ContextAwareAdapter]
20171030-17:24:31: [INFO]: RestClient.doRequestMMPBody, thread(1) call Info: POST https://mn-sandbox-ucsb-1.test.dataone.org/knb/d1/mn/v2/dirtySystemMetadata; MMP message has: ParamPart:pid = TierTesting:mn-sandbox-ucsb-1:Public_READ.15; ParamPart:dateSysMetaLastModified = 2017-10-30T17:24:30.770+00:00; ParamPart:serialVersion = 10;  [org.dataone.client.rest.RestClient]
20171030-17:24:31: [INFO]: NotAuthorized with cert : cnStageUNM1 [org.dataone.integration.it.ContextAwareAdapter]
20171030-17:24:31: [INFO]: success = 1 [org.dataone.integration.it.ContextAwareAdapter]
20171030-17:24:31: [INFO]: InvalidRequest = 0 [org.dataone.integration.it.ContextAwareAdapter]
20171030-17:24:31: [INFO]: NotAuthorized = 3 [org.dataone.integration.it.ContextAwareAdapter]
20171030-17:24:31: [INFO]: other = 0 [org.dataone.integration.it.ContextAwareAdapter]
20171030-17:24:31: [INFO]: created client for certificate file: cnDevUNM1 with subject: CN=urn:node:cnDevUNM1,DC=dataone,DC=org [org.dataone.integration.ContextAwareTestCaseDataone]
20171030-17:24:31: [INFO]: created client for certificate file: cnDevUNM2 with subject: CN=urn:node:cnDevUNM2,DC=dataone,DC=org [org.dataone.integration.ContextAwareTestCaseDataone]
20171030-17:24:31: [INFO]: created client for certificate file: cnSandboxORC1 with subject: CN=urn:node:cnSandboxORC1,DC=dataone,DC=org [org.dataone.integration.ContextAwareTestCaseDataone]
20171030-17:24:31: [INFO]: created client for certificate file: cnStageUNM1 with subject: CN=urn:node:cnStageUNM1,DC=dataone,DC=org [org.dataone.integration.ContextAwareTestCaseDataone]
20171030-17:24:31: [INFO]: created client for certificate file: testRightsHolder with subject: CN=testRightsHolder,DC=dataone,DC=org [org.dataone.integration.ContextAwareTestCaseDataone]
20171030-17:24:31: [INFO]: 
***************** running test for testSystemMetadataChanged() vs. node: https://mn-sandbox-ucsb-2.test.dataone.org/knb/d1/mn/v2 ***************** [org.dataone.integration.ContextAwareTestCaseDataone]
20171030-17:24:31: [INFO]: Using cached identifier for node urn:node:mnSandboxUCSB2 [org.dataone.integration.ContextAwareTestCaseDataone]
20171030-17:24:32: [INFO]: RestClient.doRequestNoBody, thread(1) call Info: GET https://mn-sandbox-ucsb-2.test.dataone.org/knb/d1/mn/v2/meta/TierTesting:mn-sandbox-ucsb-2:Public_READ.15 [org.dataone.client.rest.RestClient]
20171030-17:24:32: [INFO]: RestClient.doRequestMMPBody, thread(1) call Info: POST https://mn-sandbox-ucsb-2.test.dataone.org/knb/d1/mn/v2/dirtySystemMetadata; MMP message has: ParamPart:pid = TierTesting:mn-sandbox-ucsb-2:Public_READ.15; ParamPart:dateSysMetaLastModified = 2017-10-30T17:24:32.187+00:00; ParamPart:serialVersion = 10;  [org.dataone.client.rest.RestClient]
20171030-17:24:32: [INFO]: NotAuthorized with cert : cnDevUNM1 [org.dataone.integration.it.ContextAwareAdapter]
20171030-17:24:32: [INFO]: RestClient.doRequestMMPBody, thread(1) call Info: POST https://mn-sandbox-ucsb-2.test.dataone.org/knb/d1/mn/v2/dirtySystemMetadata; MMP message has: ParamPart:pid = TierTesting:mn-sandbox-ucsb-2:Public_READ.15; ParamPart:dateSysMetaLastModified = 2017-10-30T17:24:32.187+00:00; ParamPart:serialVersion = 10;  [org.dataone.client.rest.RestClient]
20171030-17:24:32: [INFO]: NotAuthorized with cert : cnDevUNM2 [org.dataone.integration.it.ContextAwareAdapter]
20171030-17:24:32: [INFO]: RestClient.doRequestMMPBody, thread(1) call Info: POST https://mn-sandbox-ucsb-2.test.dataone.org/knb/d1/mn/v2/dirtySystemMetadata; MMP message has: ParamPart:pid = TierTesting:mn-sandbox-ucsb-2:Public_READ.15; ParamPart:dateSysMetaLastModified = 2017-10-30T17:24:32.187+00:00; ParamPart:serialVersion = 10;  [org.dataone.client.rest.RestClient]
20171030-17:24:32: [INFO]: success with cert : cnSandboxORC1 [org.dataone.integration.it.ContextAwareAdapter]
20171030-17:24:32: [INFO]: RestClient.doRequestMMPBody, thread(1) call Info: POST https://mn-sandbox-ucsb-2.test.dataone.org/knb/d1/mn/v2/dirtySystemMetadata; MMP message has: ParamPart:pid = TierTesting:mn-sandbox-ucsb-2:Public_READ.15; ParamPart:dateSysMetaLastModified = 2017-10-30T17:24:32.187+00:00; ParamPart:serialVersion = 10;  [org.dataone.client.rest.RestClient]
20171030-17:24:32: [INFO]: NotAuthorized with cert : cnStageUNM1 [org.dataone.integration.it.ContextAwareAdapter]
20171030-17:24:32: [INFO]: success = 1 [org.dataone.integration.it.ContextAwareAdapter]
20171030-17:24:32: [INFO]: InvalidRequest = 0 [org.dataone.integration.it.ContextAwareAdapter]
20171030-17:24:32: [INFO]: NotAuthorized = 3 [org.dataone.integration.it.ContextAwareAdapter]
20171030-17:24:32: [INFO]: other = 0 [org.dataone.integration.it.ContextAwareAdapter]
20171030-17:24:32: [INFO]: **************************************************** [org.dataone.integration.ContextAwareTestCaseDataone]
20171030-17:24:32: [INFO]: ***  context label:   SANDBOX [org.dataone.integration.ContextAwareTestCaseDataone]
20171030-17:24:32: [INFO]: **************************************************** [org.dataone.integration.ContextAwareTestCaseDataone]
20171030-17:24:32: [INFO]: **************************************************** [org.dataone.integration.ContextAwareTestCaseDataone]
                          nodeId  key                       value
=============================================================================================================
         urn:node:mnSandboxUCSB1  objectList_hits           3
         urn:node:mnSandboxUCSB1  publicObject_cacheDate    Mon Oct 30 17:08:13 UTC 2017
         urn:node:mnSandboxUCSB1  publicObject_hits         10
         urn:node:mnSandboxUCSB1  objectList_cacheDate      Mon Oct 30 17:24:01 UTC 2017
         urn:node:mnSandboxUCSB1  publicObject              TierTesting:mn-sandbox-ucsb-1:Public_READ.15
         urn:node:mnSandboxUCSB1  objectList                org.dataone.service.types.v1.ObjectList@61d2f267
=============================================================================================================
         urn:node:mnSandboxUCSB2  objectList_hits           3
         urn:node:mnSandboxUCSB2  publicObject_cacheDate    Mon Oct 30 17:08:17 UTC 2017
         urn:node:mnSandboxUCSB2  publicObject_hits         10
         urn:node:mnSandboxUCSB2  objectList_cacheDate      Mon Oct 30 17:24:01 UTC 2017
         urn:node:mnSandboxUCSB2  publicObject              TierTesting:mn-sandbox-ucsb-2:Public_READ.15
         urn:node:mnSandboxUCSB2  objectList                org.dataone.service.types.v1.ObjectList@26d40c77
=============================================================================================================
20171030-17:24:32: [INFO]: created client for certificate file: cnSandboxORC1 with subject: CN=urn:node:cnSandboxORC1,DC=dataone,DC=org [org.dataone.integration.ContextAwareTestCaseDataone]
20171030-17:24:33: [INFO]: RestClient.doRequestNoBody, thread(1) call Info: GET https://mn-sandbox-ucsb-1.test.dataone.org/knb/d1/mn/v2/monitor/ping [org.dataone.client.rest.RestClient]
20171030-17:24:33: [INFO]: MN included in test: https://mn-sandbox-ucsb-1.test.dataone.org/knb/d1/mn [org.dataone.integration.ContextAwareTestCaseDataone]
20171030-17:24:33: [INFO]: created client for certificate file: cnSandboxORC1 with subject: CN=urn:node:cnSandboxORC1,DC=dataone,DC=org [org.dataone.integration.ContextAwareTestCaseDataone]
20171030-17:24:33: [INFO]: RestClient.doRequestNoBody, thread(1) call Info: GET https://mn-sandbox-ucsb-2.test.dataone.org/knb/d1/mn/v2/monitor/ping [org.dataone.client.rest.RestClient]
20171030-17:24:33: [INFO]: MN included in test: https://mn-sandbox-ucsb-2.test.dataone.org/knb/d1/mn [org.dataone.integration.ContextAwareTestCaseDataone]
20171030-17:24:33: [INFO]: created client for certificate file: cnSandboxORC1 with subject: CN=urn:node:cnSandboxORC1,DC=dataone,DC=org [org.dataone.integration.ContextAwareTestCaseDataone]
20171030-17:24:33: [INFO]: RestClient.doRequestNoBody, thread(1) call Info: GET https://mn-sandbox-orc-1.test.dataone.org/mn/v2/monitor/ping [org.dataone.client.rest.RestClient]
20171030-17:24:33: [INFO]: MN excluded from test: https://mn-sandbox-orc-1.test.dataone.org/mn [org.dataone.integration.ContextAwareTestCaseDataone]
20171030-17:24:33: [INFO]: created client for certificate file: cnSandboxORC1 with subject: CN=urn:node:cnSandboxORC1,DC=dataone,DC=org [org.dataone.integration.ContextAwareTestCaseDataone]
20171030-17:24:33: [INFO]: RestClient.doRequestNoBody, thread(1) call Info: GET http://usgs.ornl.gov/USGS_MN/mn/v2/monitor/ping [org.dataone.client.rest.RestClient]
20171030-17:24:33: [INFO]: MN excluded from test: http://usgs.ornl.gov/USGS_MN/mn [org.dataone.integration.ContextAwareTestCaseDataone]
20171030-17:24:33: [INFO]: created client for certificate file: cnSandboxORC1 with subject: CN=urn:node:cnSandboxORC1,DC=dataone,DC=org [org.dataone.integration.ContextAwareTestCaseDataone]
20171030-17:24:33: [INFO]: RestClient.doRequestNoBody, thread(1) call Info: GET https://alpha.tdar.org/dataone/v2/monitor/ping [org.dataone.client.rest.RestClient]
20171030-17:24:33: [INFO]: MN excluded from test: https://alpha.tdar.org/dataone/ [org.dataone.integration.ContextAwareTestCaseDataone]
20171030-17:24:33: [INFO]: created client for certificate file: cnSandboxORC1 with subject: CN=urn:node:cnSandboxORC1,DC=dataone,DC=org [org.dataone.integration.ContextAwareTestCaseDataone]
20171030-17:24:34: [INFO]: RestClient.doRequestNoBody, thread(1) call Info: GET https://test-prod.bco-dmo.org/d1/mn/v2/monitor/ping [org.dataone.client.rest.RestClient]
20171030-17:24:34: [INFO]: MN excluded from test: https://test-prod.bco-dmo.org/d1/mn [org.dataone.integration.ContextAwareTestCaseDataone]
20171030-17:24:34: [INFO]: created client for certificate file: cnSandboxORC1 with subject: CN=urn:node:cnSandboxORC1,DC=dataone,DC=org [org.dataone.integration.ContextAwareTestCaseDataone]
20171030-17:24:34: [INFO]: RestClient.doRequestNoBody, thread(1) call Info: GET https://ncei-node.test.dataone.org/mn/v2/monitor/ping [org.dataone.client.rest.RestClient]
20171030-17:24:34: [INFO]: MN excluded from test: https://ncei-node.test.dataone.org/mn [org.dataone.integration.ContextAwareTestCaseDataone]
20171030-17:24:34: [INFO]: created client for certificate file: cnSandboxORC1 with subject: CN=urn:node:cnSandboxORC1,DC=dataone,DC=org [org.dataone.integration.ContextAwareTestCaseDataone]
20171030-17:24:34: [INFO]: RestClient.doRequestNoBody, thread(1) call Info: GET https://edacd1mn.unm.edu/mn/v2/monitor/ping [org.dataone.client.rest.RestClient]
20171030-17:24:34: [INFO]: MN excluded from test: https://edacd1mn.unm.edu/mn [org.dataone.integration.ContextAwareTestCaseDataone]
20171030-17:24:34: [INFO]: created client for certificate file: cnSandboxORC1 with subject: CN=urn:node:cnSandboxORC1,DC=dataone,DC=org [org.dataone.integration.ContextAwareTestCaseDataone]
20171030-17:24:34: [INFO]: RestClient.doRequestNoBody, thread(1) call Info: GET https://gmnv2.test.dataone.org/mn/v2/monitor/ping [org.dataone.client.rest.RestClient]
20171030-17:24:34: [INFO]: MN excluded from test: https://gmnv2.test.dataone.org/mn [org.dataone.integration.ContextAwareTestCaseDataone]
20171030-17:24:34: [INFO]: created client for certificate file: cnSandboxORC1 with subject: CN=urn:node:cnSandboxORC1,DC=dataone,DC=org [org.dataone.integration.ContextAwareTestCaseDataone]
20171030-17:24:34: [INFO]: 
***************** running test for testSystemMetadataChanged() vs. node: https://mn-sandbox-ucsb-1.test.dataone.org/knb/d1/mn/v2 ***************** [org.dataone.integration.ContextAwareTestCaseDataone]
20171030-17:24:34: [INFO]: Using cached identifier for node urn:node:mnSandboxUCSB1 [org.dataone.integration.ContextAwareTestCaseDataone]
20171030-17:24:34: [INFO]: RestClient.doRequestNoBody, thread(1) call Info: GET https://mn-sandbox-ucsb-1.test.dataone.org/knb/d1/mn/v2/meta/TierTesting:mn-sandbox-ucsb-1:Public_READ.15 [org.dataone.client.rest.RestClient]
20171030-17:24:34: [INFO]: RestClient.doRequestMMPBody, thread(1) call Info: POST https://mn-sandbox-ucsb-1.test.dataone.org/knb/d1/mn/v2/dirtySystemMetadata; MMP message has: ParamPart:pid = TierTesting:mn-sandbox-ucsb-1:Public_READ.15; ParamPart:dateSysMetaLastModified = 2015-12-22T01:40:28.909+00:00; ParamPart:serialVersion = 10;  [org.dataone.client.rest.RestClient]
20171030-17:24:34: [INFO]: created client for certificate file: cnSandboxORC1 with subject: CN=urn:node:cnSandboxORC1,DC=dataone,DC=org [org.dataone.integration.ContextAwareTestCaseDataone]
20171030-17:24:34: [INFO]: 
***************** running test for testSystemMetadataChanged() vs. node: https://mn-sandbox-ucsb-2.test.dataone.org/knb/d1/mn/v2 ***************** [org.dataone.integration.ContextAwareTestCaseDataone]
20171030-17:24:34: [INFO]: Using cached identifier for node urn:node:mnSandboxUCSB2 [org.dataone.integration.ContextAwareTestCaseDataone]
20171030-17:24:34: [INFO]: RestClient.doRequestNoBody, thread(1) call Info: GET https://mn-sandbox-ucsb-2.test.dataone.org/knb/d1/mn/v2/meta/TierTesting:mn-sandbox-ucsb-2:Public_READ.15 [org.dataone.client.rest.RestClient]
20171030-17:24:34: [INFO]: RestClient.doRequestMMPBody, thread(1) call Info: POST https://mn-sandbox-ucsb-2.test.dataone.org/knb/d1/mn/v2/dirtySystemMetadata; MMP message has: ParamPart:pid = TierTesting:mn-sandbox-ucsb-2:Public_READ.15; ParamPart:dateSysMetaLastModified = 2015-12-22T01:40:30.563+00:00; ParamPart:serialVersion = 10;  [org.dataone.client.rest.RestClient]
20171030-17:24:34: [INFO]: **************************************************** [org.dataone.integration.ContextAwareTestCaseDataone]
20171030-17:24:34: [INFO]: ***  context label:   SANDBOX [org.dataone.integration.ContextAwareTestCaseDataone]
20171030-17:24:34: [INFO]: **************************************************** [org.dataone.integration.ContextAwareTestCaseDataone]
20171030-17:24:34: [INFO]: **************************************************** [org.dataone.integration.ContextAwareTestCaseDataone]
                          nodeId  key                       value
=============================================================================================================
         urn:node:mnSandboxUCSB1  objectList_hits           3
         urn:node:mnSandboxUCSB1  publicObject_cacheDate    Mon Oct 30 17:08:13 UTC 2017
         urn:node:mnSandboxUCSB1  publicObject_hits         11
         urn:node:mnSandboxUCSB1  objectList_cacheDate      Mon Oct 30 17:24:01 UTC 2017
         urn:node:mnSandboxUCSB1  publicObject              TierTesting:mn-sandbox-ucsb-1:Public_READ.15
         urn:node:mnSandboxUCSB1  objectList                org.dataone.service.types.v1.ObjectList@61d2f267
=============================================================================================================
         urn:node:mnSandboxUCSB2  objectList_hits           3
         urn:node:mnSandboxUCSB2  publicObject_cacheDate    Mon Oct 30 17:08:17 UTC 2017
         urn:node:mnSandboxUCSB2  publicObject_hits         11
         urn:node:mnSandboxUCSB2  objectList_cacheDate      Mon Oct 30 17:24:01 UTC 2017
         urn:node:mnSandboxUCSB2  publicObject              TierTesting:mn-sandbox-ucsb-2:Public_READ.15
         urn:node:mnSandboxUCSB2  objectList                org.dataone.service.types.v1.ObjectList@26d40c77
=============================================================================================================
20171030-17:24:34: [INFO]: created client for certificate file: cnSandboxORC1 with subject: CN=urn:node:cnSandboxORC1,DC=dataone,DC=org [org.dataone.integration.ContextAwareTestCaseDataone]
20171030-17:24:34: [INFO]: RestClient.doRequestNoBody, thread(1) call Info: GET https://mn-sandbox-ucsb-1.test.dataone.org/knb/d1/mn/v2/monitor/ping [org.dataone.client.rest.RestClient]
20171030-17:24:34: [INFO]: MN included in test: https://mn-sandbox-ucsb-1.test.dataone.org/knb/d1/mn [org.dataone.integration.ContextAwareTestCaseDataone]
20171030-17:24:34: [INFO]: created client for certificate file: cnSandboxORC1 with subject: CN=urn:node:cnSandboxORC1,DC=dataone,DC=org [org.dataone.integration.ContextAwareTestCaseDataone]
20171030-17:24:34: [INFO]: RestClient.doRequestNoBody, thread(1) call Info: GET https://mn-sandbox-ucsb-2.test.dataone.org/knb/d1/mn/v2/monitor/ping [org.dataone.client.rest.RestClient]
20171030-17:24:34: [INFO]: MN included in test: https://mn-sandbox-ucsb-2.test.dataone.org/knb/d1/mn [org.dataone.integration.ContextAwareTestCaseDataone]
20171030-17:24:34: [INFO]: created client for certificate file: cnSandboxORC1 with subject: CN=urn:node:cnSandboxORC1,DC=dataone,DC=org [org.dataone.integration.ContextAwareTestCaseDataone]
20171030-17:24:35: [INFO]: RestClient.doRequestNoBody, thread(1) call Info: GET https://mn-sandbox-orc-1.test.dataone.org/mn/v2/monitor/ping [org.dataone.client.rest.RestClient]
20171030-17:24:35: [INFO]: MN excluded from test: https://mn-sandbox-orc-1.test.dataone.org/mn [org.dataone.integration.ContextAwareTestCaseDataone]
20171030-17:24:35: [INFO]: created client for certificate file: cnSandboxORC1 with subject: CN=urn:node:cnSandboxORC1,DC=dataone,DC=org [org.dataone.integration.ContextAwareTestCaseDataone]
20171030-17:24:35: [INFO]: RestClient.doRequestNoBody, thread(1) call Info: GET http://usgs.ornl.gov/USGS_MN/mn/v2/monitor/ping [org.dataone.client.rest.RestClient]
20171030-17:24:35: [INFO]: MN excluded from test: http://usgs.ornl.gov/USGS_MN/mn [org.dataone.integration.ContextAwareTestCaseDataone]
20171030-17:24:35: [INFO]: created client for certificate file: cnSandboxORC1 with subject: CN=urn:node:cnSandboxORC1,DC=dataone,DC=org [org.dataone.integration.ContextAwareTestCaseDataone]
20171030-17:24:35: [INFO]: RestClient.doRequestNoBody, thread(1) call Info: GET https://alpha.tdar.org/dataone/v2/monitor/ping [org.dataone.client.rest.RestClient]
20171030-17:24:35: [INFO]: MN excluded from test: https://alpha.tdar.org/dataone/ [org.dataone.integration.ContextAwareTestCaseDataone]
20171030-17:24:35: [INFO]: created client for certificate file: cnSandboxORC1 with subject: CN=urn:node:cnSandboxORC1,DC=dataone,DC=org [org.dataone.integration.ContextAwareTestCaseDataone]
20171030-17:24:35: [INFO]: RestClient.doRequestNoBody, thread(1) call Info: GET https://test-prod.bco-dmo.org/d1/mn/v2/monitor/ping [org.dataone.client.rest.RestClient]
20171030-17:24:35: [INFO]: MN excluded from test: https://test-prod.bco-dmo.org/d1/mn [org.dataone.integration.ContextAwareTestCaseDataone]
20171030-17:24:35: [INFO]: created client for certificate file: cnSandboxORC1 with subject: CN=urn:node:cnSandboxORC1,DC=dataone,DC=org [org.dataone.integration.ContextAwareTestCaseDataone]
20171030-17:24:35: [INFO]: RestClient.doRequestNoBody, thread(1) call Info: GET https://ncei-node.test.dataone.org/mn/v2/monitor/ping [org.dataone.client.rest.RestClient]
20171030-17:24:35: [INFO]: MN excluded from test: https://ncei-node.test.dataone.org/mn [org.dataone.integration.ContextAwareTestCaseDataone]
20171030-17:24:35: [INFO]: created client for certificate file: cnSandboxORC1 with subject: CN=urn:node:cnSandboxORC1,DC=dataone,DC=org [org.dataone.integration.ContextAwareTestCaseDataone]
20171030-17:24:35: [INFO]: RestClient.doRequestNoBody, thread(1) call Info: GET https://edacd1mn.unm.edu/mn/v2/monitor/ping [org.dataone.client.rest.RestClient]
20171030-17:24:35: [INFO]: MN excluded from test: https://edacd1mn.unm.edu/mn [org.dataone.integration.ContextAwareTestCaseDataone]
20171030-17:24:35: [INFO]: created client for certificate file: cnSandboxORC1 with subject: CN=urn:node:cnSandboxORC1,DC=dataone,DC=org [org.dataone.integration.ContextAwareTestCaseDataone]
20171030-17:24:36: [INFO]: RestClient.doRequestNoBody, thread(1) call Info: GET https://gmnv2.test.dataone.org/mn/v2/monitor/ping [org.dataone.client.rest.RestClient]
20171030-17:24:36: [INFO]: MN excluded from test: https://gmnv2.test.dataone.org/mn [org.dataone.integration.ContextAwareTestCaseDataone]
20171030-17:24:36: [INFO]: created client for certificate file: testPerson with subject: CN=testPerson,DC=dataone,DC=org [org.dataone.integration.ContextAwareTestCaseDataone]
20171030-17:24:36: [INFO]: 
***************** running test for testSystemMetadataChanged_authITKuser() vs. node: https://mn-sandbox-ucsb-1.test.dataone.org/knb/d1/mn/v2 ***************** [org.dataone.integration.ContextAwareTestCaseDataone]
20171030-17:24:37: [INFO]: RestClient.doRequestMMPBody, thread(1) call Info: POST https://mn-sandbox-ucsb-1.test.dataone.org/knb/d1/mn/v2/object; MMP message has: ParamPart:pid = mNodeTier320173039243685; FilePart:object = /tmp/mmp.output.6173509984159934832.tmp (684336 bytes); FilePart:sysmeta = /tmp/mmp.output.1484528820992659447.tmp (917 bytes);  [org.dataone.client.rest.RestClient]
20171030-17:24:37: [INFO]: RestClient.doRequestMMPBody, thread(1) call Info: POST https://mn-sandbox-ucsb-1.test.dataone.org/knb/d1/mn/v2/dirtySystemMetadata; MMP message has: ParamPart:pid = mNodeTier320173039243685; ParamPart:dateSysMetaLastModified = 2017-10-30T17:24:37.003+00:00; ParamPart:serialVersion = 10;  [org.dataone.client.rest.RestClient]
20171030-17:24:37: [INFO]: created client for certificate file: testPerson with subject: CN=testPerson,DC=dataone,DC=org [org.dataone.integration.ContextAwareTestCaseDataone]
20171030-17:24:37: [INFO]: 
***************** running test for testSystemMetadataChanged_authITKuser() vs. node: https://mn-sandbox-ucsb-2.test.dataone.org/knb/d1/mn/v2 ***************** [org.dataone.integration.ContextAwareTestCaseDataone]
20171030-17:24:37: [INFO]: RestClient.doRequestMMPBody, thread(1) call Info: POST https://mn-sandbox-ucsb-2.test.dataone.org/knb/d1/mn/v2/object; MMP message has: ParamPart:pid = mNodeTier3201730392437124; FilePart:object = /tmp/mmp.output.746316915744735212.tmp (684336 bytes); FilePart:sysmeta = /tmp/mmp.output.8283199669210984085.tmp (918 bytes);  [org.dataone.client.rest.RestClient]
20171030-17:24:37: [INFO]: RestClient.doRequestMMPBody, thread(1) call Info: POST https://mn-sandbox-ucsb-2.test.dataone.org/knb/d1/mn/v2/dirtySystemMetadata; MMP message has: ParamPart:pid = mNodeTier3201730392437124; ParamPart:dateSysMetaLastModified = 2017-10-30T17:24:37.696+00:00; ParamPart:serialVersion = 10;  [org.dataone.client.rest.RestClient]
20171030-17:24:37: [INFO]: **************************************************** [org.dataone.integration.ContextAwareTestCaseDataone]
20171030-17:24:37: [INFO]: ***  context label:   SANDBOX [org.dataone.integration.ContextAwareTestCaseDataone]
20171030-17:24:37: [INFO]: **************************************************** [org.dataone.integration.ContextAwareTestCaseDataone]
20171030-17:24:37: [INFO]: **************************************************** [org.dataone.integration.ContextAwareTestCaseDataone]
                          nodeId  key                       value
=============================================================================================================
         urn:node:mnSandboxUCSB1  objectList_hits           3
         urn:node:mnSandboxUCSB1  publicObject_cacheDate    Mon Oct 30 17:08:13 UTC 2017
         urn:node:mnSandboxUCSB1  publicObject_hits         11
         urn:node:mnSandboxUCSB1  objectList_cacheDate      Mon Oct 30 17:24:01 UTC 2017
         urn:node:mnSandboxUCSB1  publicObject              TierTesting:mn-sandbox-ucsb-1:Public_READ.15
         urn:node:mnSandboxUCSB1  objectList                org.dataone.service.types.v1.ObjectList@61d2f267
=============================================================================================================
         urn:node:mnSandboxUCSB2  objectList_hits           3
         urn:node:mnSandboxUCSB2  publicObject_cacheDate    Mon Oct 30 17:08:17 UTC 2017
         urn:node:mnSandboxUCSB2  publicObject_hits         11
         urn:node:mnSandboxUCSB2  objectList_cacheDate      Mon Oct 30 17:24:01 UTC 2017
         urn:node:mnSandboxUCSB2  publicObject              TierTesting:mn-sandbox-ucsb-2:Public_READ.15
         urn:node:mnSandboxUCSB2  objectList                org.dataone.service.types.v1.ObjectList@26d40c77
=============================================================================================================
20171030-17:24:37: [INFO]: created client for certificate file: cnSandboxORC1 with subject: CN=urn:node:cnSandboxORC1,DC=dataone,DC=org [org.dataone.integration.ContextAwareTestCaseDataone]
20171030-17:24:37: [INFO]: RestClient.doRequestNoBody, thread(1) call Info: GET https://mn-sandbox-ucsb-1.test.dataone.org/knb/d1/mn/v2/monitor/ping [org.dataone.client.rest.RestClient]
20171030-17:24:37: [INFO]: MN included in test: https://mn-sandbox-ucsb-1.test.dataone.org/knb/d1/mn [org.dataone.integration.ContextAwareTestCaseDataone]
20171030-17:24:37: [INFO]: created client for certificate file: cnSandboxORC1 with subject: CN=urn:node:cnSandboxORC1,DC=dataone,DC=org [org.dataone.integration.ContextAwareTestCaseDataone]
20171030-17:24:38: [INFO]: RestClient.doRequestNoBody, thread(1) call Info: GET https://mn-sandbox-ucsb-2.test.dataone.org/knb/d1/mn/v2/monitor/ping [org.dataone.client.rest.RestClient]
20171030-17:24:38: [INFO]: MN included in test: https://mn-sandbox-ucsb-2.test.dataone.org/knb/d1/mn [org.dataone.integration.ContextAwareTestCaseDataone]
20171030-17:24:38: [INFO]: created client for certificate file: cnSandboxORC1 with subject: CN=urn:node:cnSandboxORC1,DC=dataone,DC=org [org.dataone.integration.ContextAwareTestCaseDataone]
20171030-17:24:38: [INFO]: RestClient.doRequestNoBody, thread(1) call Info: GET https://mn-sandbox-orc-1.test.dataone.org/mn/v2/monitor/ping [org.dataone.client.rest.RestClient]
20171030-17:24:38: [INFO]: MN excluded from test: https://mn-sandbox-orc-1.test.dataone.org/mn [org.dataone.integration.ContextAwareTestCaseDataone]
20171030-17:24:38: [INFO]: created client for certificate file: cnSandboxORC1 with subject: CN=urn:node:cnSandboxORC1,DC=dataone,DC=org [org.dataone.integration.ContextAwareTestCaseDataone]
20171030-17:24:38: [INFO]: RestClient.doRequestNoBody, thread(1) call Info: GET http://usgs.ornl.gov/USGS_MN/mn/v2/monitor/ping [org.dataone.client.rest.RestClient]
20171030-17:24:38: [INFO]: MN excluded from test: http://usgs.ornl.gov/USGS_MN/mn [org.dataone.integration.ContextAwareTestCaseDataone]
20171030-17:24:38: [INFO]: created client for certificate file: cnSandboxORC1 with subject: CN=urn:node:cnSandboxORC1,DC=dataone,DC=org [org.dataone.integration.ContextAwareTestCaseDataone]
20171030-17:24:38: [INFO]: RestClient.doRequestNoBody, thread(1) call Info: GET https://alpha.tdar.org/dataone/v2/monitor/ping [org.dataone.client.rest.RestClient]
20171030-17:24:38: [INFO]: MN excluded from test: https://alpha.tdar.org/dataone/ [org.dataone.integration.ContextAwareTestCaseDataone]
20171030-17:24:38: [INFO]: created client for certificate file: cnSandboxORC1 with subject: CN=urn:node:cnSandboxORC1,DC=dataone,DC=org [org.dataone.integration.ContextAwareTestCaseDataone]
20171030-17:24:38: [INFO]: RestClient.doRequestNoBody, thread(1) call Info: GET https://test-prod.bco-dmo.org/d1/mn/v2/monitor/ping [org.dataone.client.rest.RestClient]
20171030-17:24:38: [INFO]: MN excluded from test: https://test-prod.bco-dmo.org/d1/mn [org.dataone.integration.ContextAwareTestCaseDataone]
20171030-17:24:38: [INFO]: created client for certificate file: cnSandboxORC1 with subject: CN=urn:node:cnSandboxORC1,DC=dataone,DC=org [org.dataone.integration.ContextAwareTestCaseDataone]
20171030-17:24:38: [INFO]: RestClient.doRequestNoBody, thread(1) call Info: GET https://ncei-node.test.dataone.org/mn/v2/monitor/ping [org.dataone.client.rest.RestClient]
20171030-17:24:38: [INFO]: MN excluded from test: https://ncei-node.test.dataone.org/mn [org.dataone.integration.ContextAwareTestCaseDataone]
20171030-17:24:38: [INFO]: created client for certificate file: cnSandboxORC1 with subject: CN=urn:node:cnSandboxORC1,DC=dataone,DC=org [org.dataone.integration.ContextAwareTestCaseDataone]
20171030-17:24:38: [INFO]: RestClient.doRequestNoBody, thread(1) call Info: GET https://edacd1mn.unm.edu/mn/v2/monitor/ping [org.dataone.client.rest.RestClient]
20171030-17:24:38: [INFO]: MN excluded from test: https://edacd1mn.unm.edu/mn [org.dataone.integration.ContextAwareTestCaseDataone]
20171030-17:24:38: [INFO]: created client for certificate file: cnSandboxORC1 with subject: CN=urn:node:cnSandboxORC1,DC=dataone,DC=org [org.dataone.integration.ContextAwareTestCaseDataone]
20171030-17:24:39: [INFO]: RestClient.doRequestNoBody, thread(1) call Info: GET https://gmnv2.test.dataone.org/mn/v2/monitor/ping [org.dataone.client.rest.RestClient]
20171030-17:24:39: [INFO]: MN excluded from test: https://gmnv2.test.dataone.org/mn [org.dataone.integration.ContextAwareTestCaseDataone]
20171030-17:24:39: [INFO]: 
***************** running test for testSystemMetadataChanged_NotAuthPuplic() vs. node: https://mn-sandbox-ucsb-1.test.dataone.org/knb/d1/mn/v2 ***************** [org.dataone.integration.ContextAwareTestCaseDataone]
20171030-17:24:39: [INFO]: RestClient.doRequestMMPBody, thread(1) call Info: POST https://mn-sandbox-ucsb-1.test.dataone.org/knb/d1/mn/v2/dirtySystemMetadata; MMP message has: ParamPart:pid = bogusPid; ParamPart:dateSysMetaLastModified = 2017-10-30T17:24:39.104+00:00; ParamPart:serialVersion = 10;  [org.dataone.client.rest.RestClient]
20171030-17:24:39: [INFO]: 
***************** running test for testSystemMetadataChanged_NotAuthPuplic() vs. node: https://mn-sandbox-ucsb-2.test.dataone.org/knb/d1/mn/v2 ***************** [org.dataone.integration.ContextAwareTestCaseDataone]
20171030-17:24:39: [INFO]: RestClient.doRequestMMPBody, thread(1) call Info: POST https://mn-sandbox-ucsb-2.test.dataone.org/knb/d1/mn/v2/dirtySystemMetadata; MMP message has: ParamPart:pid = bogusPid; ParamPart:dateSysMetaLastModified = 2017-10-30T17:24:39.201+00:00; ParamPart:serialVersion = 10;  [org.dataone.client.rest.RestClient]
20171030-17:24:39: [INFO]: **************************************************** [org.dataone.integration.ContextAwareTestCaseDataone]
20171030-17:24:39: [INFO]: ***  context label:   SANDBOX [org.dataone.integration.ContextAwareTestCaseDataone]
20171030-17:24:39: [INFO]: **************************************************** [org.dataone.integration.ContextAwareTestCaseDataone]
20171030-17:24:39: [INFO]: **************************************************** [org.dataone.integration.ContextAwareTestCaseDataone]
                          nodeId  key                       value
=============================================================================================================
         urn:node:mnSandboxUCSB1  objectList_hits           3
         urn:node:mnSandboxUCSB1  publicObject_cacheDate    Mon Oct 30 17:08:13 UTC 2017
         urn:node:mnSandboxUCSB1  publicObject_hits         11
         urn:node:mnSandboxUCSB1  objectList_cacheDate      Mon Oct 30 17:24:01 UTC 2017
         urn:node:mnSandboxUCSB1  publicObject              TierTesting:mn-sandbox-ucsb-1:Public_READ.15
         urn:node:mnSandboxUCSB1  objectList                org.dataone.service.types.v1.ObjectList@61d2f267
=============================================================================================================
         urn:node:mnSandboxUCSB2  objectList_hits           3
         urn:node:mnSandboxUCSB2  publicObject_cacheDate    Mon Oct 30 17:08:17 UTC 2017
         urn:node:mnSandboxUCSB2  publicObject_hits         11
         urn:node:mnSandboxUCSB2  objectList_cacheDate      Mon Oct 30 17:24:01 UTC 2017
         urn:node:mnSandboxUCSB2  publicObject              TierTesting:mn-sandbox-ucsb-2:Public_READ.15
         urn:node:mnSandboxUCSB2  objectList                org.dataone.service.types.v1.ObjectList@26d40c77
=============================================================================================================
20171030-17:24:39: [INFO]: created client for certificate file: cnSandboxORC1 with subject: CN=urn:node:cnSandboxORC1,DC=dataone,DC=org [org.dataone.integration.ContextAwareTestCaseDataone]
20171030-17:24:39: [INFO]: RestClient.doRequestNoBody, thread(1) call Info: GET https://mn-sandbox-ucsb-1.test.dataone.org/knb/d1/mn/v2/monitor/ping [org.dataone.client.rest.RestClient]
20171030-17:24:39: [INFO]: MN included in test: https://mn-sandbox-ucsb-1.test.dataone.org/knb/d1/mn [org.dataone.integration.ContextAwareTestCaseDataone]
20171030-17:24:39: [INFO]: created client for certificate file: cnSandboxORC1 with subject: CN=urn:node:cnSandboxORC1,DC=dataone,DC=org [org.dataone.integration.ContextAwareTestCaseDataone]
20171030-17:24:39: [INFO]: RestClient.doRequestNoBody, thread(1) call Info: GET https://mn-sandbox-ucsb-2.test.dataone.org/knb/d1/mn/v2/monitor/ping [org.dataone.client.rest.RestClient]
20171030-17:24:39: [INFO]: MN included in test: https://mn-sandbox-ucsb-2.test.dataone.org/knb/d1/mn [org.dataone.integration.ContextAwareTestCaseDataone]
20171030-17:24:39: [INFO]: created client for certificate file: cnSandboxORC1 with subject: CN=urn:node:cnSandboxORC1,DC=dataone,DC=org [org.dataone.integration.ContextAwareTestCaseDataone]
20171030-17:24:39: [INFO]: RestClient.doRequestNoBody, thread(1) call Info: GET https://mn-sandbox-orc-1.test.dataone.org/mn/v2/monitor/ping [org.dataone.client.rest.RestClient]
20171030-17:24:39: [INFO]: MN excluded from test: https://mn-sandbox-orc-1.test.dataone.org/mn [org.dataone.integration.ContextAwareTestCaseDataone]
20171030-17:24:39: [INFO]: created client for certificate file: cnSandboxORC1 with subject: CN=urn:node:cnSandboxORC1,DC=dataone,DC=org [org.dataone.integration.ContextAwareTestCaseDataone]
20171030-17:24:39: [INFO]: RestClient.doRequestNoBody, thread(1) call Info: GET http://usgs.ornl.gov/USGS_MN/mn/v2/monitor/ping [org.dataone.client.rest.RestClient]
20171030-17:24:39: [INFO]: MN excluded from test: http://usgs.ornl.gov/USGS_MN/mn [org.dataone.integration.ContextAwareTestCaseDataone]
20171030-17:24:39: [INFO]: created client for certificate file: cnSandboxORC1 with subject: CN=urn:node:cnSandboxORC1,DC=dataone,DC=org [org.dataone.integration.ContextAwareTestCaseDataone]
20171030-17:24:39: [INFO]: RestClient.doRequestNoBody, thread(1) call Info: GET https://alpha.tdar.org/dataone/v2/monitor/ping [org.dataone.client.rest.RestClient]
20171030-17:24:39: [INFO]: MN excluded from test: https://alpha.tdar.org/dataone/ [org.dataone.integration.ContextAwareTestCaseDataone]
20171030-17:24:39: [INFO]: created client for certificate file: cnSandboxORC1 with subject: CN=urn:node:cnSandboxORC1,DC=dataone,DC=org [org.dataone.integration.ContextAwareTestCaseDataone]
20171030-17:24:40: [INFO]: RestClient.doRequestNoBody, thread(1) call Info: GET https://test-prod.bco-dmo.org/d1/mn/v2/monitor/ping [org.dataone.client.rest.RestClient]
20171030-17:24:40: [INFO]: MN excluded from test: https://test-prod.bco-dmo.org/d1/mn [org.dataone.integration.ContextAwareTestCaseDataone]
20171030-17:24:40: [INFO]: created client for certificate file: cnSandboxORC1 with subject: CN=urn:node:cnSandboxORC1,DC=dataone,DC=org [org.dataone.integration.ContextAwareTestCaseDataone]
20171030-17:24:40: [INFO]: RestClient.doRequestNoBody, thread(1) call Info: GET https://ncei-node.test.dataone.org/mn/v2/monitor/ping [org.dataone.client.rest.RestClient]
20171030-17:24:40: [INFO]: MN excluded from test: https://ncei-node.test.dataone.org/mn [org.dataone.integration.ContextAwareTestCaseDataone]
20171030-17:24:40: [INFO]: created client for certificate file: cnSandboxORC1 with subject: CN=urn:node:cnSandboxORC1,DC=dataone,DC=org [org.dataone.integration.ContextAwareTestCaseDataone]
20171030-17:24:40: [INFO]: RestClient.doRequestNoBody, thread(1) call Info: GET https://edacd1mn.unm.edu/mn/v2/monitor/ping [org.dataone.client.rest.RestClient]
20171030-17:24:40: [INFO]: MN excluded from test: https://edacd1mn.unm.edu/mn [org.dataone.integration.ContextAwareTestCaseDataone]
20171030-17:24:40: [INFO]: created client for certificate file: cnSandboxORC1 with subject: CN=urn:node:cnSandboxORC1,DC=dataone,DC=org [org.dataone.integration.ContextAwareTestCaseDataone]
20171030-17:24:40: [INFO]: RestClient.doRequestNoBody, thread(1) call Info: GET https://gmnv2.test.dataone.org/mn/v2/monitor/ping [org.dataone.client.rest.RestClient]
20171030-17:24:40: [INFO]: MN excluded from test: https://gmnv2.test.dataone.org/mn [org.dataone.integration.ContextAwareTestCaseDataone]
20171030-17:24:40: [INFO]: created client for certificate file: testRightsHolder with subject: CN=testRightsHolder,DC=dataone,DC=org [org.dataone.integration.ContextAwareTestCaseDataone]
20171030-17:24:40: [INFO]: 
***************** running test for testSystemMetadataChanged_NotAuthRightsHolder() vs. node: https://mn-sandbox-ucsb-1.test.dataone.org/knb/d1/mn/v2 ***************** [org.dataone.integration.ContextAwareTestCaseDataone]
20171030-17:24:40: [INFO]: RestClient.doRequestMMPBody, thread(1) call Info: POST https://mn-sandbox-ucsb-1.test.dataone.org/knb/d1/mn/v2/dirtySystemMetadata; MMP message has: ParamPart:pid = bogusPid; ParamPart:dateSysMetaLastModified = 2017-10-30T17:24:40.576+00:00; ParamPart:serialVersion = 10;  [org.dataone.client.rest.RestClient]
20171030-17:24:40: [INFO]: created client for certificate file: testRightsHolder with subject: CN=testRightsHolder,DC=dataone,DC=org [org.dataone.integration.ContextAwareTestCaseDataone]
20171030-17:24:40: [INFO]: 
***************** running test for testSystemMetadataChanged_NotAuthRightsHolder() vs. node: https://mn-sandbox-ucsb-2.test.dataone.org/knb/d1/mn/v2 ***************** [org.dataone.integration.ContextAwareTestCaseDataone]
20171030-17:24:40: [INFO]: RestClient.doRequestMMPBody, thread(1) call Info: POST https://mn-sandbox-ucsb-2.test.dataone.org/knb/d1/mn/v2/dirtySystemMetadata; MMP message has: ParamPart:pid = bogusPid; ParamPart:dateSysMetaLastModified = 2017-10-30T17:24:40.815+00:00; ParamPart:serialVersion = 10;  [org.dataone.client.rest.RestClient]
20171030-17:24:40: [INFO]: **************************************************** [org.dataone.integration.ContextAwareTestCaseDataone]
20171030-17:24:40: [INFO]: ***  context label:   SANDBOX [org.dataone.integration.ContextAwareTestCaseDataone]
20171030-17:24:40: [INFO]: **************************************************** [org.dataone.integration.ContextAwareTestCaseDataone]
20171030-17:24:40: [INFO]: **************************************************** [org.dataone.integration.ContextAwareTestCaseDataone]
                          nodeId  key                       value
=============================================================================================================
         urn:node:mnSandboxUCSB1  objectList_hits           3
         urn:node:mnSandboxUCSB1  publicObject_cacheDate    Mon Oct 30 17:08:13 UTC 2017
         urn:node:mnSandboxUCSB1  publicObject_hits         11
         urn:node:mnSandboxUCSB1  objectList_cacheDate      Mon Oct 30 17:24:01 UTC 2017
         urn:node:mnSandboxUCSB1  publicObject              TierTesting:mn-sandbox-ucsb-1:Public_READ.15
         urn:node:mnSandboxUCSB1  objectList                org.dataone.service.types.v1.ObjectList@61d2f267
=============================================================================================================
         urn:node:mnSandboxUCSB2  objectList_hits           3
         urn:node:mnSandboxUCSB2  publicObject_cacheDate    Mon Oct 30 17:08:17 UTC 2017
         urn:node:mnSandboxUCSB2  publicObject_hits         11
         urn:node:mnSandboxUCSB2  objectList_cacheDate      Mon Oct 30 17:24:01 UTC 2017
         urn:node:mnSandboxUCSB2  publicObject              TierTesting:mn-sandbox-ucsb-2:Public_READ.15
         urn:node:mnSandboxUCSB2  objectList                org.dataone.service.types.v1.ObjectList@26d40c77
=============================================================================================================
20171030-17:24:40: [INFO]: created client for certificate file: cnSandboxORC1 with subject: CN=urn:node:cnSandboxORC1,DC=dataone,DC=org [org.dataone.integration.ContextAwareTestCaseDataone]
20171030-17:24:41: [INFO]: RestClient.doRequestNoBody, thread(1) call Info: GET https://mn-sandbox-ucsb-1.test.dataone.org/knb/d1/mn/v2/monitor/ping [org.dataone.client.rest.RestClient]
20171030-17:24:41: [INFO]: MN included in test: https://mn-sandbox-ucsb-1.test.dataone.org/knb/d1/mn [org.dataone.integration.ContextAwareTestCaseDataone]
20171030-17:24:41: [INFO]: created client for certificate file: cnSandboxORC1 with subject: CN=urn:node:cnSandboxORC1,DC=dataone,DC=org [org.dataone.integration.ContextAwareTestCaseDataone]
20171030-17:24:41: [INFO]: RestClient.doRequestNoBody, thread(1) call Info: GET https://mn-sandbox-ucsb-2.test.dataone.org/knb/d1/mn/v2/monitor/ping [org.dataone.client.rest.RestClient]
20171030-17:24:41: [INFO]: MN included in test: https://mn-sandbox-ucsb-2.test.dataone.org/knb/d1/mn [org.dataone.integration.ContextAwareTestCaseDataone]
20171030-17:24:41: [INFO]: created client for certificate file: cnSandboxORC1 with subject: CN=urn:node:cnSandboxORC1,DC=dataone,DC=org [org.dataone.integration.ContextAwareTestCaseDataone]
20171030-17:24:41: [INFO]: RestClient.doRequestNoBody, thread(1) call Info: GET https://mn-sandbox-orc-1.test.dataone.org/mn/v2/monitor/ping [org.dataone.client.rest.RestClient]
20171030-17:24:41: [INFO]: MN excluded from test: https://mn-sandbox-orc-1.test.dataone.org/mn [org.dataone.integration.ContextAwareTestCaseDataone]
20171030-17:24:41: [INFO]: created client for certificate file: cnSandboxORC1 with subject: CN=urn:node:cnSandboxORC1,DC=dataone,DC=org [org.dataone.integration.ContextAwareTestCaseDataone]
20171030-17:24:41: [INFO]: RestClient.doRequestNoBody, thread(1) call Info: GET http://usgs.ornl.gov/USGS_MN/mn/v2/monitor/ping [org.dataone.client.rest.RestClient]
20171030-17:24:41: [INFO]: MN excluded from test: http://usgs.ornl.gov/USGS_MN/mn [org.dataone.integration.ContextAwareTestCaseDataone]
20171030-17:24:41: [INFO]: created client for certificate file: cnSandboxORC1 with subject: CN=urn:node:cnSandboxORC1,DC=dataone,DC=org [org.dataone.integration.ContextAwareTestCaseDataone]
20171030-17:24:41: [INFO]: RestClient.doRequestNoBody, thread(1) call Info: GET https://alpha.tdar.org/dataone/v2/monitor/ping [org.dataone.client.rest.RestClient]
20171030-17:24:41: [INFO]: MN excluded from test: https://alpha.tdar.org/dataone/ [org.dataone.integration.ContextAwareTestCaseDataone]
20171030-17:24:41: [INFO]: created client for certificate file: cnSandboxORC1 with subject: CN=urn:node:cnSandboxORC1,DC=dataone,DC=org [org.dataone.integration.ContextAwareTestCaseDataone]
20171030-17:24:42: [INFO]: RestClient.doRequestNoBody, thread(1) call Info: GET https://test-prod.bco-dmo.org/d1/mn/v2/monitor/ping [org.dataone.client.rest.RestClient]
20171030-17:24:42: [INFO]: MN excluded from test: https://test-prod.bco-dmo.org/d1/mn [org.dataone.integration.ContextAwareTestCaseDataone]
20171030-17:24:42: [INFO]: created client for certificate file: cnSandboxORC1 with subject: CN=urn:node:cnSandboxORC1,DC=dataone,DC=org [org.dataone.integration.ContextAwareTestCaseDataone]
20171030-17:24:42: [INFO]: RestClient.doRequestNoBody, thread(1) call Info: GET https://ncei-node.test.dataone.org/mn/v2/monitor/ping [org.dataone.client.rest.RestClient]
20171030-17:24:42: [INFO]: MN excluded from test: https://ncei-node.test.dataone.org/mn [org.dataone.integration.ContextAwareTestCaseDataone]
20171030-17:24:42: [INFO]: created client for certificate file: cnSandboxORC1 with subject: CN=urn:node:cnSandboxORC1,DC=dataone,DC=org [org.dataone.integration.ContextAwareTestCaseDataone]
20171030-17:24:42: [INFO]: RestClient.doRequestNoBody, thread(1) call Info: GET https://edacd1mn.unm.edu/mn/v2/monitor/ping [org.dataone.client.rest.RestClient]
20171030-17:24:42: [INFO]: MN excluded from test: https://edacd1mn.unm.edu/mn [org.dataone.integration.ContextAwareTestCaseDataone]
20171030-17:24:42: [INFO]: created client for certificate file: cnSandboxORC1 with subject: CN=urn:node:cnSandboxORC1,DC=dataone,DC=org [org.dataone.integration.ContextAwareTestCaseDataone]
20171030-17:24:42: [INFO]: RestClient.doRequestNoBody, thread(1) call Info: GET https://gmnv2.test.dataone.org/mn/v2/monitor/ping [org.dataone.client.rest.RestClient]
20171030-17:24:42: [INFO]: MN excluded from test: https://gmnv2.test.dataone.org/mn [org.dataone.integration.ContextAwareTestCaseDataone]
20171030-17:24:42: [INFO]: created client for certificate file: cnSandboxORC1 with subject: CN=urn:node:cnSandboxORC1,DC=dataone,DC=org [org.dataone.integration.ContextAwareTestCaseDataone]
20171030-17:24:42: [INFO]: 
***************** running test for testSystemMetadataChanged_InvalidPid() vs. node: https://mn-sandbox-ucsb-1.test.dataone.org/knb/d1/mn/v2 ***************** [org.dataone.integration.ContextAwareTestCaseDataone]
20171030-17:24:42: [INFO]: RestClient.doRequestMMPBody, thread(1) call Info: POST https://mn-sandbox-ucsb-1.test.dataone.org/knb/d1/mn/v2/dirtySystemMetadata; MMP message has: ParamPart:pid = bogusPid; ParamPart:dateSysMetaLastModified = 2017-10-30T17:24:42.811+00:00; ParamPart:serialVersion = 10;  [org.dataone.client.rest.RestClient]
20171030-17:24:42: [INFO]: created client for certificate file: cnSandboxORC1 with subject: CN=urn:node:cnSandboxORC1,DC=dataone,DC=org [org.dataone.integration.ContextAwareTestCaseDataone]
20171030-17:24:42: [INFO]: 
***************** running test for testSystemMetadataChanged_InvalidPid() vs. node: https://mn-sandbox-ucsb-2.test.dataone.org/knb/d1/mn/v2 ***************** [org.dataone.integration.ContextAwareTestCaseDataone]
20171030-17:24:43: [INFO]: RestClient.doRequestMMPBody, thread(1) call Info: POST https://mn-sandbox-ucsb-2.test.dataone.org/knb/d1/mn/v2/dirtySystemMetadata; MMP message has: ParamPart:pid = bogusPid; ParamPart:dateSysMetaLastModified = 2017-10-30T17:24:42.925+00:00; ParamPart:serialVersion = 10;  [org.dataone.client.rest.RestClient]
Tests run: 34, Failures: 2, Errors: 0, Skipped: 0, Time elapsed: 90.828 sec <<< FAILURE!

Results :

Failed tests: 
  testUpdateSystemMetadata_InvalidRequest_NoPid(org.dataone.integration.it.apiTests.MNStorageV2IT): Expected an InvalidRequest exception. Got: ServiceFailure: 0 Client_Error: class org.dataone.exceptions.MarshallingException: null  [for host GET https://mn-sandbox-ucsb-1.test.dataone.org/knb/d1/mn/v2/meta/testUpdateSystemMetadata_InvalidRequest_NoPid_201730385539349 ]
  testUpdateSystemMetadata_InvalidRequest_NoPid(org.dataone.integration.it.apiTests.MNStorageV2IT): Expected an InvalidRequest exception. Got: ServiceFailure: 0 Client_Error: class org.dataone.exceptions.MarshallingException: null  [for host GET https://mn-sandbox-ucsb-2.test.dataone.org/knb/d1/mn/v2/meta/testUpdateSystemMetadata_InvalidRequest_NoPid_20173038554133 ]
  testUpdateSystemMetadata_InvalidRequest_PidMismatch(org.dataone.integration.it.apiTests.MNStorageV2IT): Expected an InvalidRequest. Got: ServiceFailure: 0 Client_Error: class org.dataone.exceptions.MarshallingException: null  [for host GET https://mn-sandbox-ucsb-1.test.dataone.org/knb/d1/mn/v2/meta/testUpdateSystemMetadata_InvalidRequest_PidMismatch201730385551311 ]
  testUpdateSystemMetadata_InvalidRequest_PidMismatch(org.dataone.integration.it.apiTests.MNStorageV2IT): Expected an InvalidRequest. Got: ServiceFailure: 0 Client_Error: class org.dataone.exceptions.MarshallingException: null  [for host GET https://mn-sandbox-ucsb-2.test.dataone.org/knb/d1/mn/v2/meta/testUpdateSystemMetadata_InvalidRequest_PidMismatch201730385553181 ]
  testGetLogRecords(org.dataone.integration.it.apiTests.MNCoreV2SlowIT): ServiceFailure: 0 Client_Error: class org.dataone.client.exception.ClientSideException: /Read timed out  [for host GET https://mn-sandbox-ucsb-1.test.dataone.org/knb/d1/mn/v2/log ]
  testGetLogRecords_Slicing(org.dataone.integration.it.apiTests.MNCoreV2SlowIT): ServiceFailure: 0 Client_Error: class org.dataone.client.exception.ClientSideException: /Read timed out  [for host GET https://mn-sandbox-ucsb-1.test.dataone.org/knb/d1/mn/v2/log ]
  testGetLogRecords_pidFiltering(org.dataone.integration.it.apiTests.MNCoreV2SlowIT): ServiceFailure: 0 Client_Error: class org.dataone.client.exception.ClientSideException: /Read timed out  [for host GET https://mn-sandbox-ucsb-1.test.dataone.org/knb/d1/mn/v2/log ]
  testGetLogRecords_dateFiltering(org.dataone.integration.it.apiTests.MNCoreV2SlowIT): ServiceFailure : 0 Client_Error : class org.dataone.client.exception.ClientSideException: /Read timed out  [for host GET https://mn-sandbox-ucsb-1.test.dataone.org/knb/d1/mn/v2/log ]
  testIsAuthorized_AccessPolicy_is_testPerson_can_ChangePerm(org.dataone.integration.it.apiTests.MNAuthorizationV2IT): org.dataone.integration.TestIterationEndingException: the AccessRule of the returned object has either multiple subjects or multiple permissions  [for host https://mn-sandbox-ucsb-1.test.dataone.org/knb/d1/mn ]
  testIsAuthorized_AccessPolicy_is_testPerson_can_ChangePerm(org.dataone.integration.it.apiTests.MNAuthorizationV2IT): org.dataone.integration.TestIterationEndingException: the AccessRule of the returned object has either multiple subjects or multiple permissions  [for host https://mn-sandbox-ucsb-2.test.dataone.org/knb/d1/mn ]
  testIsAuthorized_AccessPolicy_is_testGroup_can_ChangePerm(org.dataone.integration.it.apiTests.MNAuthorizationV2IT): org.dataone.integration.TestIterationEndingException: the AccessRule of the returned object has either multiple subjects or multiple permissions  [for host https://mn-sandbox-ucsb-1.test.dataone.org/knb/d1/mn ]
  testIsAuthorized_AccessPolicy_is_testGroup_can_ChangePerm(org.dataone.integration.it.apiTests.MNAuthorizationV2IT): org.dataone.integration.TestIterationEndingException: the AccessRule of the returned object has either multiple subjects or multiple permissions  [for host https://mn-sandbox-ucsb-2.test.dataone.org/knb/d1/mn ]
  testSynchronizationFailed_NoCert(org.dataone.integration.it.apiTests.MNReadV2IT): ServiceFailure:: 2161 The identifier cannot be null.  [for host POST https://mn-sandbox-ucsb-1.test.dataone.org/knb/d1/mn/v2/error; MMP message has: FilePart:message = /tmp/mmp.output.7662572281801230605.tmp (213 bytes);  ]
  testSynchronizationFailed_NoCert(org.dataone.integration.it.apiTests.MNReadV2IT): ServiceFailure:: 2161 The identifier cannot be null.  [for host POST https://mn-sandbox-ucsb-2.test.dataone.org/knb/d1/mn/v2/error; MMP message has: FilePart:message = /tmp/mmp.output.1928894481335057703.tmp (213 bytes);  ]

Tests run: 113, Failures: 14, Errors: 0, Skipped: 5

[WARNING] File encoding has not been set, using platform encoding UTF-8, i.e. build is platform dependent!
[JENKINS] Recording test results
[INFO] 
[INFO] --- maven-failsafe-plugin:2.8.1:verify (verify) @ d1_integration ---
[INFO] Failsafe report directory: /var/lib/jenkins/jobs/d1_integration_Sandbox_mn_v2/workspace/target/failsafe-reports
[WARNING] File encoding has not been set, using platform encoding UTF-8, i.e. build is platform dependent!
[ERROR] There are test failures.

Please refer to /var/lib/jenkins/jobs/d1_integration_Sandbox_mn_v2/workspace/target/failsafe-reports for the individual test results.
[JENKINS] Recording test results
Notifying upstream projects of job completion
Join notifier requires a CauseAction
[INFO] ------------------------------------------------------------------------
[INFO] BUILD SUCCESS
[INFO] ------------------------------------------------------------------------
[INFO] Total time: 30:58.661s
[INFO] Finished at: Mon Oct 30 17:24:43 UTC 2017
[INFO] Final Memory: 53M/589M
[INFO] ------------------------------------------------------------------------
Waiting for Jenkins to finish collecting data