UnstableConsole Output

Skipping 21 KB.. Full Log
egration_STAGE/workspace/D1_INTEGRATION_v1.1/target/classes
[WARNING] error reading /var/lib/jenkins/.m2/repository/javax/sql/jdbc-stdext/2.0/jdbc-stdext-2.0.jar; error in opening zip file
[WARNING] error reading /var/lib/jenkins/.m2/repository/javax/transaction/jta/1.0.1B/jta-1.0.1B.jar; error in opening zip file
[WARNING] error reading /var/lib/jenkins/.m2/repository/javax/sql/jdbc-stdext/2.0/jdbc-stdext-2.0.jar; error in opening zip file
[WARNING] error reading /var/lib/jenkins/.m2/repository/javax/transaction/jta/1.0.1B/jta-1.0.1B.jar; error in opening zip file
[WARNING] /var/lib/jenkins/jobs/d1_integration_STAGE/workspace/D1_INTEGRATION_v1.1/src/main/java/org/dataone/integration/ContextAwareTestCaseDataone.java: Some input files use or override a deprecated API.
[WARNING] /var/lib/jenkins/jobs/d1_integration_STAGE/workspace/D1_INTEGRATION_v1.1/src/main/java/org/dataone/integration/ContextAwareTestCaseDataone.java: Recompile with -Xlint:deprecation for details.
[INFO] 
[INFO] --- maven-resources-plugin:2.6:testResources (default-testResources) @ d1_integration ---
[WARNING] Using platform encoding (UTF-8 actually) to copy filtered resources, i.e. build is platform dependent!
[INFO] Copying 59 resources
[INFO] 
[INFO] --- maven-compiler-plugin:3.1:testCompile (default-testCompile) @ d1_integration ---
[INFO] Changes detected - recompiling the module!
[WARNING] File encoding has not been set, using platform encoding UTF-8, i.e. build is platform dependent!
[INFO] Compiling 48 source files to /var/lib/jenkins/jobs/d1_integration_STAGE/workspace/D1_INTEGRATION_v1.1/target/test-classes
[WARNING] error reading /var/lib/jenkins/.m2/repository/javax/sql/jdbc-stdext/2.0/jdbc-stdext-2.0.jar; error in opening zip file
[WARNING] error reading /var/lib/jenkins/.m2/repository/javax/transaction/jta/1.0.1B/jta-1.0.1B.jar; error in opening zip file
[WARNING] error reading /var/lib/jenkins/.m2/repository/javax/sql/jdbc-stdext/2.0/jdbc-stdext-2.0.jar; error in opening zip file
[WARNING] error reading /var/lib/jenkins/.m2/repository/javax/transaction/jta/1.0.1B/jta-1.0.1B.jar; error in opening zip file
[WARNING] /var/lib/jenkins/jobs/d1_integration_STAGE/workspace/D1_INTEGRATION_v1.1/src/test/java/org/dataone/integration/it/DataReplicationIT.java: Some input files use or override a deprecated API.
[WARNING] /var/lib/jenkins/jobs/d1_integration_STAGE/workspace/D1_INTEGRATION_v1.1/src/test/java/org/dataone/integration/it/DataReplicationIT.java: Recompile with -Xlint:deprecation for details.
[WARNING] /var/lib/jenkins/jobs/d1_integration_STAGE/workspace/D1_INTEGRATION_v1.1/src/test/java/org/dataone/integration/it/ChecksumAnalysis.java: Some input files use unchecked or unsafe operations.
[WARNING] /var/lib/jenkins/jobs/d1_integration_STAGE/workspace/D1_INTEGRATION_v1.1/src/test/java/org/dataone/integration/it/ChecksumAnalysis.java: Recompile with -Xlint:unchecked for details.
[INFO] 
[INFO] --- maven-surefire-plugin:2.12.4:test (default-test) @ d1_integration ---
[INFO] Surefire report directory: /var/lib/jenkins/jobs/d1_integration_STAGE/workspace/D1_INTEGRATION_v1.1/target/surefire-reports

-------------------------------------------------------
 T E S T S
-------------------------------------------------------
Running org.dataone.configuration.TestSettingsTest
20191206-07:58:08: [WARN]: Problem loading testing configuration at: 'null':: Cannot locate configuration source null [org.dataone.configuration.TestSettings]
20191206-07:58:09: [WARN]: Problem loading testing configuration at: 'null':: Cannot locate configuration source null [org.dataone.configuration.TestSettings]
20191206-07:58:09: [WARN]: Problem loading testing configuration at: 'null':: Cannot locate configuration source null [org.dataone.configuration.TestSettings]
20191206-07:58:09: [WARN]: Problem loading testing configuration at: 'null':: Cannot locate configuration source null [org.dataone.configuration.TestSettings]
20191206-07:58:09: [WARN]: Problem loading testing configuration at: 'null':: Cannot locate configuration source null [org.dataone.configuration.TestSettings]
20191206-07:58:09: [ERROR]: General Problem loading TestSettings. InvocationTargetException: null [org.dataone.configuration.Settings]
java.lang.reflect.InvocationTargetException
	at sun.reflect.NativeMethodAccessorImpl.invoke0(Native Method)
	at sun.reflect.NativeMethodAccessorImpl.invoke(NativeMethodAccessorImpl.java:62)
	at sun.reflect.DelegatingMethodAccessorImpl.invoke(DelegatingMethodAccessorImpl.java:43)
	at java.lang.reflect.Method.invoke(Method.java:498)
	at org.dataone.configuration.Settings.loadTestConfigurations(Settings.java:151)
	at org.dataone.configuration.Settings.getConfiguration(Settings.java:87)
	at org.dataone.configuration.Settings.getResetConfiguration(Settings.java:123)
	at org.dataone.configuration.TestSettingsTest.testBadParameterCombinationHandling(TestSettingsTest.java:188)
	at sun.reflect.NativeMethodAccessorImpl.invoke0(Native Method)
	at sun.reflect.NativeMethodAccessorImpl.invoke(NativeMethodAccessorImpl.java:62)
	at sun.reflect.DelegatingMethodAccessorImpl.invoke(DelegatingMethodAccessorImpl.java:43)
	at java.lang.reflect.Method.invoke(Method.java:498)
	at org.junit.runners.model.FrameworkMethod$1.runReflectiveCall(FrameworkMethod.java:44)
	at org.junit.internal.runners.model.ReflectiveCallable.run(ReflectiveCallable.java:15)
	at org.junit.runners.model.FrameworkMethod.invokeExplosively(FrameworkMethod.java:41)
	at org.junit.internal.runners.statements.InvokeMethod.evaluate(InvokeMethod.java:20)
	at org.junit.internal.runners.statements.RunBefores.evaluate(RunBefores.java:28)
	at org.junit.internal.runners.statements.RunAfters.evaluate(RunAfters.java:31)
	at org.junit.runners.BlockJUnit4ClassRunner.runChild(BlockJUnit4ClassRunner.java:76)
	at org.junit.runners.BlockJUnit4ClassRunner.runChild(BlockJUnit4ClassRunner.java:50)
	at org.junit.runners.ParentRunner$3.run(ParentRunner.java:193)
	at org.junit.runners.ParentRunner$1.schedule(ParentRunner.java:52)
	at org.junit.runners.ParentRunner.runChildren(ParentRunner.java:191)
	at org.junit.runners.ParentRunner.access$000(ParentRunner.java:42)
	at org.junit.runners.ParentRunner$2.evaluate(ParentRunner.java:184)
	at org.junit.runners.ParentRunner.run(ParentRunner.java:236)
	at org.apache.maven.surefire.junit4.JUnit4Provider.execute(JUnit4Provider.java:252)
	at org.apache.maven.surefire.junit4.JUnit4Provider.executeTestSet(JUnit4Provider.java:141)
	at org.apache.maven.surefire.junit4.JUnit4Provider.invoke(JUnit4Provider.java:112)
	at sun.reflect.NativeMethodAccessorImpl.invoke0(Native Method)
	at sun.reflect.NativeMethodAccessorImpl.invoke(NativeMethodAccessorImpl.java:62)
	at sun.reflect.DelegatingMethodAccessorImpl.invoke(DelegatingMethodAccessorImpl.java:43)
	at java.lang.reflect.Method.invoke(Method.java:498)
	at org.apache.maven.surefire.util.ReflectionUtils.invokeMethodWithArray(ReflectionUtils.java:189)
	at org.apache.maven.surefire.booter.ProviderFactory$ProviderProxy.invoke(ProviderFactory.java:165)
	at org.apache.maven.surefire.booter.ProviderFactory.invokeProvider(ProviderFactory.java:85)
	at org.apache.maven.surefire.booter.ForkedBooter.runSuitesInProcess(ForkedBooter.java:115)
	at org.apache.maven.surefire.booter.ForkedBooter.main(ForkedBooter.java:75)
Caused by: org.apache.commons.configuration.ConfigurationException: Can only set one of properties: context.label, context.mn.baseurl, context.cn.baseurl, or context.nodelist.uri.  Number received: 2
	at org.dataone.configuration.TestSettings.determineContext(TestSettings.java:162)
	at org.dataone.configuration.TestSettings.getConfiguration(TestSettings.java:93)
	... 38 more
20191206-07:58:09: [ERROR]: Problem loading testing configuration at: 'null':: Cannot locate configuration source null [org.dataone.configuration.TestSettings]
20191206-07:58:09: [ERROR]: General Problem loading TestSettings. InvocationTargetException: null [org.dataone.configuration.Settings]
java.lang.reflect.InvocationTargetException
	at sun.reflect.NativeMethodAccessorImpl.invoke0(Native Method)
	at sun.reflect.NativeMethodAccessorImpl.invoke(NativeMethodAccessorImpl.java:62)
	at sun.reflect.DelegatingMethodAccessorImpl.invoke(DelegatingMethodAccessorImpl.java:43)
	at java.lang.reflect.Method.invoke(Method.java:498)
	at org.dataone.configuration.Settings.loadTestConfigurations(Settings.java:151)
	at org.dataone.configuration.Settings.getConfiguration(Settings.java:87)
	at org.dataone.configuration.Settings.getResetConfiguration(Settings.java:123)
	at org.dataone.configuration.TestSettingsTest.testBadFilenameExceptionHandling(TestSettingsTest.java:196)
	at sun.reflect.NativeMethodAccessorImpl.invoke0(Native Method)
	at sun.reflect.NativeMethodAccessorImpl.invoke(NativeMethodAccessorImpl.java:62)
	at sun.reflect.DelegatingMethodAccessorImpl.invoke(DelegatingMethodAccessorImpl.java:43)
	at java.lang.reflect.Method.invoke(Method.java:498)
	at org.junit.runners.model.FrameworkMethod$1.runReflectiveCall(FrameworkMethod.java:44)
	at org.junit.internal.runners.model.ReflectiveCallable.run(ReflectiveCallable.java:15)
	at org.junit.runners.model.FrameworkMethod.invokeExplosively(FrameworkMethod.java:41)
	at org.junit.internal.runners.statements.InvokeMethod.evaluate(InvokeMethod.java:20)
	at org.junit.internal.runners.statements.RunBefores.evaluate(RunBefores.java:28)
	at org.junit.internal.runners.statements.RunAfters.evaluate(RunAfters.java:31)
	at org.junit.runners.BlockJUnit4ClassRunner.runChild(BlockJUnit4ClassRunner.java:76)
	at org.junit.runners.BlockJUnit4ClassRunner.runChild(BlockJUnit4ClassRunner.java:50)
	at org.junit.runners.ParentRunner$3.run(ParentRunner.java:193)
	at org.junit.runners.ParentRunner$1.schedule(ParentRunner.java:52)
	at org.junit.runners.ParentRunner.runChildren(ParentRunner.java:191)
	at org.junit.runners.ParentRunner.access$000(ParentRunner.java:42)
	at org.junit.runners.ParentRunner$2.evaluate(ParentRunner.java:184)
	at org.junit.runners.ParentRunner.run(ParentRunner.java:236)
	at org.apache.maven.surefire.junit4.JUnit4Provider.execute(JUnit4Provider.java:252)
	at org.apache.maven.surefire.junit4.JUnit4Provider.executeTestSet(JUnit4Provider.java:141)
	at org.apache.maven.surefire.junit4.JUnit4Provider.invoke(JUnit4Provider.java:112)
	at sun.reflect.NativeMethodAccessorImpl.invoke0(Native Method)
	at sun.reflect.NativeMethodAccessorImpl.invoke(NativeMethodAccessorImpl.java:62)
	at sun.reflect.DelegatingMethodAccessorImpl.invoke(DelegatingMethodAccessorImpl.java:43)
	at java.lang.reflect.Method.invoke(Method.java:498)
	at org.apache.maven.surefire.util.ReflectionUtils.invokeMethodWithArray(ReflectionUtils.java:189)
	at org.apache.maven.surefire.booter.ProviderFactory$ProviderProxy.invoke(ProviderFactory.java:165)
	at org.apache.maven.surefire.booter.ProviderFactory.invokeProvider(ProviderFactory.java:85)
	at org.apache.maven.surefire.booter.ForkedBooter.runSuitesInProcess(ForkedBooter.java:115)
	at org.apache.maven.surefire.booter.ForkedBooter.main(ForkedBooter.java:75)
Caused by: org.apache.commons.configuration.ConfigurationException: Cannot locate configuration source null
	at org.apache.commons.configuration.AbstractFileConfiguration.load(AbstractFileConfiguration.java:217)
	at org.apache.commons.configuration.AbstractFileConfiguration.load(AbstractFileConfiguration.java:197)
	at org.apache.commons.configuration.AbstractFileConfiguration.<init>(AbstractFileConfiguration.java:181)
	at org.apache.commons.configuration.PropertiesConfiguration.<init>(PropertiesConfiguration.java:269)
	at org.dataone.configuration.TestSettings.loadConfigurationFile(TestSettings.java:201)
	at org.dataone.configuration.TestSettings.getConfiguration(TestSettings.java:71)
	... 38 more
20191206-07:58:09: [ERROR]: Problem loading testing configuration at: 'null':: Cannot locate configuration source null [org.dataone.configuration.TestSettings]
20191206-07:58:09: [ERROR]: General Problem loading TestSettings. InvocationTargetException: null [org.dataone.configuration.Settings]
java.lang.reflect.InvocationTargetException
	at sun.reflect.NativeMethodAccessorImpl.invoke0(Native Method)
	at sun.reflect.NativeMethodAccessorImpl.invoke(NativeMethodAccessorImpl.java:62)
	at sun.reflect.DelegatingMethodAccessorImpl.invoke(DelegatingMethodAccessorImpl.java:43)
	at java.lang.reflect.Method.invoke(Method.java:498)
	at org.dataone.configuration.Settings.loadTestConfigurations(Settings.java:151)
	at org.dataone.configuration.Settings.getConfiguration(Settings.java:87)
	at org.dataone.configuration.Settings.getResetConfiguration(Settings.java:123)
	at org.dataone.configuration.TestSettingsTest.testContextSafetyOnError(TestSettingsTest.java:209)
	at sun.reflect.NativeMethodAccessorImpl.invoke0(Native Method)
	at sun.reflect.NativeMethodAccessorImpl.invoke(NativeMethodAccessorImpl.java:62)
	at sun.reflect.DelegatingMethodAccessorImpl.invoke(DelegatingMethodAccessorImpl.java:43)
	at java.lang.reflect.Method.invoke(Method.java:498)
	at org.junit.runners.model.FrameworkMethod$1.runReflectiveCall(FrameworkMethod.java:44)
	at org.junit.internal.runners.model.ReflectiveCallable.run(ReflectiveCallable.java:15)
	at org.junit.runners.model.FrameworkMethod.invokeExplosively(FrameworkMethod.java:41)
	at org.junit.internal.runners.statements.InvokeMethod.evaluate(InvokeMethod.java:20)
	at org.junit.internal.runners.statements.RunBefores.evaluate(RunBefores.java:28)
	at org.junit.internal.runners.statements.RunAfters.evaluate(RunAfters.java:31)
	at org.junit.runners.BlockJUnit4ClassRunner.runChild(BlockJUnit4ClassRunner.java:76)
	at org.junit.runners.BlockJUnit4ClassRunner.runChild(BlockJUnit4ClassRunner.java:50)
	at org.junit.runners.ParentRunner$3.run(ParentRunner.java:193)
	at org.junit.runners.ParentRunner$1.schedule(ParentRunner.java:52)
	at org.junit.runners.ParentRunner.runChildren(ParentRunner.java:191)
	at org.junit.runners.ParentRunner.access$000(ParentRunner.java:42)
	at org.junit.runners.ParentRunner$2.evaluate(ParentRunner.java:184)
	at org.junit.runners.ParentRunner.run(ParentRunner.java:236)
	at org.apache.maven.surefire.junit4.JUnit4Provider.execute(JUnit4Provider.java:252)
	at org.apache.maven.surefire.junit4.JUnit4Provider.executeTestSet(JUnit4Provider.java:141)
	at org.apache.maven.surefire.junit4.JUnit4Provider.invoke(JUnit4Provider.java:112)
	at sun.reflect.NativeMethodAccessorImpl.invoke0(Native Method)
	at sun.reflect.NativeMethodAccessorImpl.invoke(NativeMethodAccessorImpl.java:62)
	at sun.reflect.DelegatingMethodAccessorImpl.invoke(DelegatingMethodAccessorImpl.java:43)
	at java.lang.reflect.Method.invoke(Method.java:498)
	at org.apache.maven.surefire.util.ReflectionUtils.invokeMethodWithArray(ReflectionUtils.java:189)
	at org.apache.maven.surefire.booter.ProviderFactory$ProviderProxy.invoke(ProviderFactory.java:165)
	at org.apache.maven.surefire.booter.ProviderFactory.invokeProvider(ProviderFactory.java:85)
	at org.apache.maven.surefire.booter.ForkedBooter.runSuitesInProcess(ForkedBooter.java:115)
	at org.apache.maven.surefire.booter.ForkedBooter.main(ForkedBooter.java:75)
Caused by: org.apache.commons.configuration.ConfigurationException: Cannot locate configuration source null
	at org.apache.commons.configuration.AbstractFileConfiguration.load(AbstractFileConfiguration.java:217)
	at org.apache.commons.configuration.AbstractFileConfiguration.load(AbstractFileConfiguration.java:197)
	at org.apache.commons.configuration.AbstractFileConfiguration.<init>(AbstractFileConfiguration.java:181)
	at org.apache.commons.configuration.PropertiesConfiguration.<init>(PropertiesConfiguration.java:269)
	at org.dataone.configuration.TestSettings.loadConfigurationFile(TestSettings.java:201)
	at org.dataone.configuration.TestSettings.getConfiguration(TestSettings.java:71)
	... 38 more
20191206-07:58:09: [ERROR]: Problem loading testing configuration at: 'null':: Cannot locate configuration source null [org.dataone.configuration.TestSettings]
20191206-07:58:09: [ERROR]: General Problem loading TestSettings. InvocationTargetException: null [org.dataone.configuration.Settings]
java.lang.reflect.InvocationTargetException
	at sun.reflect.NativeMethodAccessorImpl.invoke0(Native Method)
	at sun.reflect.NativeMethodAccessorImpl.invoke(NativeMethodAccessorImpl.java:62)
	at sun.reflect.DelegatingMethodAccessorImpl.invoke(DelegatingMethodAccessorImpl.java:43)
	at java.lang.reflect.Method.invoke(Method.java:498)
	at org.dataone.configuration.Settings.loadTestConfigurations(Settings.java:151)
	at org.dataone.configuration.Settings.getConfiguration(Settings.java:87)
	at org.dataone.configuration.Settings.getResetConfiguration(Settings.java:123)
	at org.dataone.configuration.TestSettingsTest.testContextSafetyOnError(TestSettingsTest.java:211)
	at sun.reflect.NativeMethodAccessorImpl.invoke0(Native Method)
	at sun.reflect.NativeMethodAccessorImpl.invoke(NativeMethodAccessorImpl.java:62)
	at sun.reflect.DelegatingMethodAccessorImpl.invoke(DelegatingMethodAccessorImpl.java:43)
	at java.lang.reflect.Method.invoke(Method.java:498)
	at org.junit.runners.model.FrameworkMethod$1.runReflectiveCall(FrameworkMethod.java:44)
	at org.junit.internal.runners.model.ReflectiveCallable.run(ReflectiveCallable.java:15)
	at org.junit.runners.model.FrameworkMethod.invokeExplosively(FrameworkMethod.java:41)
	at org.junit.internal.runners.statements.InvokeMethod.evaluate(InvokeMethod.java:20)
	at org.junit.internal.runners.statements.RunBefores.evaluate(RunBefores.java:28)
	at org.junit.internal.runners.statements.RunAfters.evaluate(RunAfters.java:31)
	at org.junit.runners.BlockJUnit4ClassRunner.runChild(BlockJUnit4ClassRunner.java:76)
	at org.junit.runners.BlockJUnit4ClassRunner.runChild(BlockJUnit4ClassRunner.java:50)
	at org.junit.runners.ParentRunner$3.run(ParentRunner.java:193)
	at org.junit.runners.ParentRunner$1.schedule(ParentRunner.java:52)
	at org.junit.runners.ParentRunner.runChildren(ParentRunner.java:191)
	at org.junit.runners.ParentRunner.access$000(ParentRunner.java:42)
	at org.junit.runners.ParentRunner$2.evaluate(ParentRunner.java:184)
	at org.junit.runners.ParentRunner.run(ParentRunner.java:236)
	at org.apache.maven.surefire.junit4.JUnit4Provider.execute(JUnit4Provider.java:252)
	at org.apache.maven.surefire.junit4.JUnit4Provider.executeTestSet(JUnit4Provider.java:141)
	at org.apache.maven.surefire.junit4.JUnit4Provider.invoke(JUnit4Provider.java:112)
	at sun.reflect.NativeMethodAccessorImpl.invoke0(Native Method)
	at sun.reflect.NativeMethodAccessorImpl.invoke(NativeMethodAccessorImpl.java:62)
	at sun.reflect.DelegatingMethodAccessorImpl.invoke(DelegatingMethodAccessorImpl.java:43)
	at java.lang.reflect.Method.invoke(Method.java:498)
	at org.apache.maven.surefire.util.ReflectionUtils.invokeMethodWithArray(ReflectionUtils.java:189)
	at org.apache.maven.surefire.booter.ProviderFactory$ProviderProxy.invoke(ProviderFactory.java:165)
	at org.apache.maven.surefire.booter.ProviderFactory.invokeProvider(ProviderFactory.java:85)
	at org.apache.maven.surefire.booter.ForkedBooter.runSuitesInProcess(ForkedBooter.java:115)
	at org.apache.maven.surefire.booter.ForkedBooter.main(ForkedBooter.java:75)
Caused by: org.apache.commons.configuration.ConfigurationException: Cannot locate configuration source null
	at org.apache.commons.configuration.AbstractFileConfiguration.load(AbstractFileConfiguration.java:217)
	at org.apache.commons.configuration.AbstractFileConfiguration.load(AbstractFileConfiguration.java:197)
	at org.apache.commons.configuration.AbstractFileConfiguration.<init>(AbstractFileConfiguration.java:181)
	at org.apache.commons.configuration.PropertiesConfiguration.<init>(PropertiesConfiguration.java:269)
	at org.dataone.configuration.TestSettings.loadConfigurationFile(TestSettings.java:201)
	at org.dataone.configuration.TestSettings.getConfiguration(TestSettings.java:71)
	... 38 more
Tests run: 11, Failures: 0, Errors: 0, Skipped: 1, Time elapsed: 0.288 sec
Running org.dataone.integration.ContextAwareTestCaseDataoneTest
20191206-07:58:09: [WARN]: Problem loading testing configuration at: 'null':: Cannot locate configuration source null [org.dataone.configuration.TestSettings]
~~~ Context is solo MemberNode: https://mn-x.dataone.org/mn
reference BaseUrl = https://cn-dev.test.dataone.org/cn
context CN url = 
Tests run: 3, Failures: 0, Errors: 0, Skipped: 1, Time elapsed: 0.004 sec
Running org.dataone.integration.CommonResourcesTest
Tests run: 2, Failures: 0, Errors: 0, Skipped: 0, Time elapsed: 0.001 sec
Running org.dataone.integration.contextTests.TestDefaultSettings
Tests run: 1, Failures: 0, Errors: 0, Skipped: 0, Time elapsed: 0 sec
Running org.dataone.integration.webTest.TestingTestRunnerServlet
20191206-07:58:09: [INFO]: setting system property 'context.mn.baseurl' to value 'http://demo.test.dataone.org/knb/d1/mn' [org.dataone.integration.webTest.TestRunnerHttpServlet]
20191206-07:58:09: [WARN]: Problem loading testing configuration at: 'null':: Cannot locate configuration source null [org.dataone.configuration.TestSettings]
20191206-07:58:09: [INFO]: Registering class: org.dataone.integration.it.MNodeTier1IT [org.dataone.integration.webTest.TestRunnerHttpServlet]
20191206-07:58:09: [INFO]: Registering class: org.dataone.integration.it.MNodeTier0IT [org.dataone.integration.webTest.TestRunnerHttpServlet]
20191206-07:58:09: [INFO]: Registering class: org.dataone.integration.it.MNodeTier4IT [org.dataone.integration.webTest.TestRunnerHttpServlet]
20191206-07:58:09: [INFO]: Registering class: org.dataone.integration.it.MNodeTier2IT [org.dataone.integration.webTest.TestRunnerHttpServlet]
20191206-07:58:09: [INFO]: Registering class: org.dataone.integration.it.MNodeTier3IT [org.dataone.integration.webTest.TestRunnerHttpServlet]
20191206-07:58:09: [INFO]: Registering class: org.dataone.integration.it.MNodeTier1SlowIT [org.dataone.integration.webTest.TestRunnerHttpServlet]
~~~ Context is solo MemberNode: http://demo.test.dataone.org/knb/d1/mn
java.net.UnknownHostException: demo.test.dataone.org: Name or service not known
	at java.net.Inet6AddressImpl.lookupAllHostAddr(Native Method)
	at java.net.InetAddress$2.lookupAllHostAddr(InetAddress.java:929)
	at java.net.InetAddress.getAddressesFromNameService(InetAddress.java:1324)
	at java.net.InetAddress.getAllByName0(InetAddress.java:1277)
	at java.net.InetAddress.getAllByName(InetAddress.java:1193)
	at java.net.InetAddress.getAllByName(InetAddress.java:1127)
	at org.apache.http.impl.conn.SystemDefaultDnsResolver.resolve(SystemDefaultDnsResolver.java:45)
	at org.apache.http.impl.conn.DefaultClientConnectionOperator.resolveHostname(DefaultClientConnectionOperator.java:278)
	at org.apache.http.impl.conn.DefaultClientConnectionOperator.openConnection(DefaultClientConnectionOperator.java:162)
	at org.apache.http.impl.conn.ManagedClientConnectionImpl.open(ManagedClientConnectionImpl.java:294)
	at org.apache.http.impl.client.DefaultRequestDirector.tryConnect(DefaultRequestDirector.java:643)
	at org.apache.http.impl.client.DefaultRequestDirector.execute(DefaultRequestDirector.java:479)
	at org.apache.http.impl.client.AbstractHttpClient.execute(AbstractHttpClient.java:906)
	at org.apache.http.impl.client.AbstractHttpClient.execute(AbstractHttpClient.java:805)
	at org.apache.http.impl.client.AbstractHttpClient.execute(AbstractHttpClient.java:784)
	at org.dataone.client.RestClient.doRequest(RestClient.java:340)
	at org.dataone.client.RestClient.doRequestNoBody(RestClient.java:266)
	at org.dataone.client.RestClient.doGetRequest(RestClient.java:181)
	at org.dataone.client.D1RestClient.doGetRequest(D1RestClient.java:233)
	at org.dataone.client.D1RestClient.doGetRequest(D1RestClient.java:223)
	at org.dataone.integration.it.MNodeTier0IT.testBaseUrlResponse(MNodeTier0IT.java:67)
	at sun.reflect.NativeMethodAccessorImpl.invoke0(Native Method)
	at sun.reflect.NativeMethodAccessorImpl.invoke(NativeMethodAccessorImpl.java:62)
	at sun.reflect.DelegatingMethodAccessorImpl.invoke(DelegatingMethodAccessorImpl.java:43)
	at java.lang.reflect.Method.invoke(Method.java:498)
	at org.junit.runners.model.FrameworkMethod$1.runReflectiveCall(FrameworkMethod.java:44)
	at org.junit.internal.runners.model.ReflectiveCallable.run(ReflectiveCallable.java:15)
	at org.junit.runners.model.FrameworkMethod.invokeExplosively(FrameworkMethod.java:41)
	at org.junit.internal.runners.statements.InvokeMethod.evaluate(InvokeMethod.java:20)
	at org.junit.rules.Verifier$1.evaluate(Verifier.java:34)
	at org.junit.internal.runners.statements.RunBefores.evaluate(RunBefores.java:28)
	at org.junit.runners.BlockJUnit4ClassRunner.runChild(BlockJUnit4ClassRunner.java:76)
	at org.junit.runners.BlockJUnit4ClassRunner.runChild(BlockJUnit4ClassRunner.java:50)
	at org.junit.runners.ParentRunner$3.run(ParentRunner.java:193)
	at org.junit.runners.ParentRunner$1.schedule(ParentRunner.java:52)
	at org.junit.runners.ParentRunner.runChildren(ParentRunner.java:191)
	at org.junit.runners.ParentRunner.access$000(ParentRunner.java:42)
	at org.junit.runners.ParentRunner$2.evaluate(ParentRunner.java:184)
	at org.junit.runners.ParentRunner.run(ParentRunner.java:236)
	at org.junit.runners.Suite.runChild(Suite.java:128)
	at org.junit.runners.Suite.runChild(Suite.java:24)
	at org.junit.runners.ParentRunner$3.run(ParentRunner.java:193)
	at org.junit.runners.ParentRunner$1.schedule(ParentRunner.java:52)
	at org.junit.runners.ParentRunner.runChildren(ParentRunner.java:191)
	at org.junit.runners.ParentRunner.access$000(ParentRunner.java:42)
	at org.junit.runners.ParentRunner$2.evaluate(ParentRunner.java:184)
	at org.junit.runners.ParentRunner.run(ParentRunner.java:236)
	at org.junit.runner.JUnitCore.run(JUnitCore.java:157)
	at org.junit.runner.JUnitCore.run(JUnitCore.java:136)
	at org.junit.runner.JUnitCore.run(JUnitCore.java:117)
	at org.dataone.integration.webTest.TestRunnerHttpServlet.executeJUnitRun(TestRunnerHttpServlet.java:217)
	at org.dataone.integration.webTest.TestRunnerHttpServlet.doGet(TestRunnerHttpServlet.java:131)
	at org.dataone.integration.webTest.TestingTestRunnerServlet.callServletTest_ITtestSelector(TestingTestRunnerServlet.java:120)
	at sun.reflect.NativeMethodAccessorImpl.invoke0(Native Method)
	at sun.reflect.NativeMethodAccessorImpl.invoke(NativeMethodAccessorImpl.java:62)
	at sun.reflect.DelegatingMethodAccessorImpl.invoke(DelegatingMethodAccessorImpl.java:43)
	at java.lang.reflect.Method.invoke(Method.java:498)
	at org.junit.runners.model.FrameworkMethod$1.runReflectiveCall(FrameworkMethod.java:44)
	at org.junit.internal.runners.model.ReflectiveCallable.run(ReflectiveCallable.java:15)
	at org.junit.runners.model.FrameworkMethod.invokeExplosively(FrameworkMethod.java:41)
	at org.junit.internal.runners.statements.InvokeMethod.evaluate(InvokeMethod.java:20)
	at org.junit.runners.BlockJUnit4ClassRunner.runChild(BlockJUnit4ClassRunner.java:76)
	at org.junit.runners.BlockJUnit4ClassRunner.runChild(BlockJUnit4ClassRunner.java:50)
	at org.junit.runners.ParentRunner$3.run(ParentRunner.java:193)
	at org.junit.runners.ParentRunner$1.schedule(ParentRunner.java:52)
	at org.junit.runners.ParentRunner.runChildren(ParentRunner.java:191)
	at org.junit.runners.ParentRunner.access$000(ParentRunner.java:42)
	at org.junit.runners.ParentRunner$2.evaluate(ParentRunner.java:184)
	at org.junit.runners.ParentRunner.run(ParentRunner.java:236)
	at org.apache.maven.surefire.junit4.JUnit4Provider.execute(JUnit4Provider.java:252)
	at org.apache.maven.surefire.junit4.JUnit4Provider.executeTestSet(JUnit4Provider.java:141)
	at org.apache.maven.surefire.junit4.JUnit4Provider.invoke(JUnit4Provider.java:112)
	at sun.reflect.NativeMethodAccessorImpl.invoke0(Native Method)
	at sun.reflect.NativeMethodAccessorImpl.invoke(NativeMethodAccessorImpl.java:62)
	at sun.reflect.DelegatingMethodAccessorImpl.invoke(DelegatingMethodAccessorImpl.java:43)
	at java.lang.reflect.Method.invoke(Method.java:498)
	at org.apache.maven.surefire.util.ReflectionUtils.invokeMethodWithArray(ReflectionUtils.java:189)
	at org.apache.maven.surefire.booter.ProviderFactory$ProviderProxy.invoke(ProviderFactory.java:165)
	at org.apache.maven.surefire.booter.ProviderFactory.invokeProvider(ProviderFactory.java:85)
	at org.apache.maven.surefire.booter.ForkedBooter.runSuitesInProcess(ForkedBooter.java:115)
	at org.apache.maven.surefire.booter.ForkedBooter.main(ForkedBooter.java:75)
~~~ Context is solo MemberNode: http://demo.test.dataone.org/knb/d1/mn
org.dataone.integration.ContextAwareTestCaseDataone$TestIterationEndingException: could not create a test object and listObjects() threw exception:: ServiceFailure :: class java.net.UnknownHostException: demo.test.dataone.org
	at org.dataone.integration.ContextAwareTestCaseDataone.procurePublicReadableTestObject(ContextAwareTestCaseDataone.java:575)
	at org.dataone.integration.it.MNodeTier2IT.testIsAuthorized(MNodeTier2IT.java:110)
	at sun.reflect.NativeMethodAccessorImpl.invoke0(Native Method)
	at sun.reflect.NativeMethodAccessorImpl.invoke(NativeMethodAccessorImpl.java:62)
	at sun.reflect.DelegatingMethodAccessorImpl.invoke(DelegatingMethodAccessorImpl.java:43)
	at java.lang.reflect.Method.invoke(Method.java:498)
	at org.junit.runners.model.FrameworkMethod$1.runReflectiveCall(FrameworkMethod.java:44)
	at org.junit.internal.runners.model.ReflectiveCallable.run(ReflectiveCallable.java:15)
	at org.junit.runners.model.FrameworkMethod.invokeExplosively(FrameworkMethod.java:41)
	at org.junit.internal.runners.statements.InvokeMethod.evaluate(InvokeMethod.java:20)
	at org.junit.rules.Verifier$1.evaluate(Verifier.java:34)
	at org.junit.internal.runners.statements.RunBefores.evaluate(RunBefores.java:28)
	at org.junit.runners.BlockJUnit4ClassRunner.runChild(BlockJUnit4ClassRunner.java:76)
	at org.junit.runners.BlockJUnit4ClassRunner.runChild(BlockJUnit4ClassRunner.java:50)
	at org.junit.runners.ParentRunner$3.run(ParentRunner.java:193)
	at org.junit.runners.ParentRunner$1.schedule(ParentRunner.java:52)
	at org.junit.runners.ParentRunner.runChildren(ParentRunner.java:191)
	at org.junit.runners.ParentRunner.access$000(ParentRunner.java:42)
	at org.junit.runners.ParentRunner$2.evaluate(ParentRunner.java:184)
	at org.junit.runners.ParentRunner.run(ParentRunner.java:236)
	at org.junit.runners.Suite.runChild(Suite.java:128)
	at org.junit.runners.Suite.runChild(Suite.java:24)
	at org.junit.runners.ParentRunner$3.run(ParentRunner.java:193)
	at org.junit.runners.ParentRunner$1.schedule(ParentRunner.java:52)
	at org.junit.runners.ParentRunner.runChildren(ParentRunner.java:191)
	at org.junit.runners.ParentRunner.access$000(ParentRunner.java:42)
	at org.junit.runners.ParentRunner$2.evaluate(ParentRunner.java:184)
	at org.junit.runners.ParentRunner.run(ParentRunner.java:236)
	at org.junit.runner.JUnitCore.run(JUnitCore.java:157)
	at org.junit.runner.JUnitCore.run(JUnitCore.java:136)
	at org.junit.runner.JUnitCore.run(JUnitCore.java:117)
	at org.dataone.integration.webTest.TestRunnerHttpServlet.executeJUnitRun(TestRunnerHttpServlet.java:217)
	at org.dataone.integration.webTest.TestRunnerHttpServlet.doGet(TestRunnerHttpServlet.java:131)
	at org.dataone.integration.webTest.TestingTestRunnerServlet.callServletTest_ITtestSelector(TestingTestRunnerServlet.java:120)
	at sun.reflect.NativeMethodAccessorImpl.invoke0(Native Method)
	at sun.reflect.NativeMethodAccessorImpl.invoke(NativeMethodAccessorImpl.java:62)
	at sun.reflect.DelegatingMethodAccessorImpl.invoke(DelegatingMethodAccessorImpl.java:43)
	at java.lang.reflect.Method.invoke(Method.java:498)
	at org.junit.runners.model.FrameworkMethod$1.runReflectiveCall(FrameworkMethod.java:44)
	at org.junit.internal.runners.model.ReflectiveCallable.run(ReflectiveCallable.java:15)
	at org.junit.runners.model.FrameworkMethod.invokeExplosively(FrameworkMethod.java:41)
	at org.junit.internal.runners.statements.InvokeMethod.evaluate(InvokeMethod.java:20)
	at org.junit.runners.BlockJUnit4ClassRunner.runChild(BlockJUnit4ClassRunner.java:76)
	at org.junit.runners.BlockJUnit4ClassRunner.runChild(BlockJUnit4ClassRunner.java:50)
	at org.junit.runners.ParentRunner$3.run(ParentRunner.java:193)
	at org.junit.runners.ParentRunner$1.schedule(ParentRunner.java:52)
	at org.junit.runners.ParentRunner.runChildren(ParentRunner.java:191)
	at org.junit.runners.ParentRunner.access$000(ParentRunner.java:42)
	at org.junit.runners.ParentRunner$2.evaluate(ParentRunner.java:184)
	at org.junit.runners.ParentRunner.run(ParentRunner.java:236)
	at org.apache.maven.surefire.junit4.JUnit4Provider.execute(JUnit4Provider.java:252)
	at org.apache.maven.surefire.junit4.JUnit4Provider.executeTestSet(JUnit4Provider.java:141)
	at org.apache.maven.surefire.junit4.JUnit4Provider.invoke(JUnit4Provider.java:112)
	at sun.reflect.NativeMethodAccessorImpl.invoke0(Native Method)
	at sun.reflect.NativeMethodAccessorImpl.invoke(NativeMethodAccessorImpl.java:62)
	at sun.reflect.DelegatingMethodAccessorImpl.invoke(DelegatingMethodAccessorImpl.java:43)
	at java.lang.reflect.Method.invoke(Method.java:498)
	at org.apache.maven.surefire.util.ReflectionUtils.invokeMethodWithArray(ReflectionUtils.java:189)
	at org.apache.maven.surefire.booter.ProviderFactory$ProviderProxy.invoke(ProviderFactory.java:165)
	at org.apache.maven.surefire.booter.ProviderFactory.invokeProvider(ProviderFactory.java:85)
	at org.apache.maven.surefire.booter.ForkedBooter.runSuitesInProcess(ForkedBooter.java:115)
	at org.apache.maven.surefire.booter.ForkedBooter.main(ForkedBooter.java:75)
Caused by: org.dataone.service.exceptions.ServiceFailure: class java.net.UnknownHostException: demo.test.dataone.org
	at java.net.InetAddress.getAllByName0(InetAddress.java:1281)
	at java.net.InetAddress.getAllByName(InetAddress.java:1193)
	at java.net.InetAddress.getAllByName(InetAddress.java:1127)
	at org.apache.http.impl.conn.SystemDefaultDnsResolver.resolve(SystemDefaultDnsResolver.java:45)
	at org.apache.http.impl.conn.DefaultClientConnectionOperator.resolveHostname(DefaultClientConnectionOperator.java:278)
	at org.apache.http.impl.conn.DefaultClientConnectionOperator.openConnection(DefaultClientConnectionOperator.java:162)
	at org.apache.http.impl.conn.ManagedClientConnectionImpl.open(ManagedClientConnectionImpl.java:294)
	at org.apache.http.impl.client.DefaultRequestDirector.tryConnect(DefaultRequestDirector.java:643)
	at org.apache.http.impl.client.DefaultRequestDirector.execute(DefaultRequestDirector.java:479)
	at org.apache.http.impl.client.AbstractHttpClient.execute(AbstractHttpClient.java:906)
	at org.apache.http.impl.client.AbstractHttpClient.execute(AbstractHttpClient.java:805)
	at org.apache.http.impl.client.AbstractHttpClient.execute(AbstractHttpClient.java:784)
	at org.dataone.client.RestClient.doRequest(RestClient.java:340)
	at org.dataone.client.RestClient.doRequestNoBody(RestClient.java:266)
	at org.dataone.client.RestClient.doGetRequest(RestClient.java:181)
	at org.dataone.client.D1RestClient.doGetRequest(D1RestClient.java:233)
	at org.dataone.client.D1RestClient.doGetRequest(D1RestClient.java:223)
	at org.dataone.client.D1Node.listObjects(D1Node.java:276)
	at org.dataone.client.MNode.listObjects(MNode.java:265)
	at org.dataone.client.D1Node.listObjects(D1Node.java:231)
	at org.dataone.client.MNode.listObjects(MNode.java:241)
	at org.dataone.integration.ContextAwareTestCaseDataone.procurePublicReadableTestObject(ContextAwareTestCaseDataone.java:518)
	... 61 more
Caused by: java.net.UnknownHostException: demo.test.dataone.org
	... 83 more
~~~ Context is solo MemberNode: http://demo.test.dataone.org/knb/d1/mn
20191206-07:58:09: [WARN]: Failed to get current ObjectFormatList from the CN, using fallbacklist provided with libclient. Cause = ServiceFailure::0 Client_Error: class java.lang.IllegalStateException: Target host must not be null, or set in parameters. [org.dataone.client.ObjectFormatCache]
~~~ Context is solo MemberNode: http://demo.test.dataone.org/knb/d1/mn
org.dataone.integration.ContextAwareTestCaseDataone$TestIterationEndingException: could not create a test object and listObjects() threw exception:: ServiceFailure :: class java.net.UnknownHostException: demo.test.dataone.org
	at org.dataone.integration.ContextAwareTestCaseDataone.procurePublicReadableTestObject(ContextAwareTestCaseDataone.java:575)
	at org.dataone.integration.it.MNodeTier2IT.testSystemMetadataChanged(MNodeTier2IT.java:156)
	at sun.reflect.NativeMethodAccessorImpl.invoke0(Native Method)
	at sun.reflect.NativeMethodAccessorImpl.invoke(NativeMethodAccessorImpl.java:62)
	at sun.reflect.DelegatingMethodAccessorImpl.invoke(DelegatingMethodAccessorImpl.java:43)
	at java.lang.reflect.Method.invoke(Method.java:498)
	at org.junit.runners.model.FrameworkMethod$1.runReflectiveCall(FrameworkMethod.java:44)
	at org.junit.internal.runners.model.ReflectiveCallable.run(ReflectiveCallable.java:15)
	at org.junit.runners.model.FrameworkMethod.invokeExplosively(FrameworkMethod.java:41)
	at org.junit.internal.runners.statements.InvokeMethod.evaluate(InvokeMethod.java:20)
	at org.junit.rules.Verifier$1.evaluate(Verifier.java:34)
	at org.junit.internal.runners.statements.RunBefores.evaluate(RunBefores.java:28)
	at org.junit.runners.BlockJUnit4ClassRunner.runChild(BlockJUnit4ClassRunner.java:76)
	at org.junit.runners.BlockJUnit4ClassRunner.runChild(BlockJUnit4ClassRunner.java:50)
	at org.junit.runners.ParentRunner$3.run(ParentRunner.java:193)
	at org.junit.runners.ParentRunner$1.schedule(ParentRunner.java:52)
	at org.junit.runners.ParentRunner.runChildren(ParentRunner.java:191)
	at org.junit.runners.ParentRunner.access$000(ParentRunner.java:42)
	at org.junit.runners.ParentRunner$2.evaluate(ParentRunner.java:184)
	at org.junit.runners.ParentRunner.run(ParentRunner.java:236)
	at org.junit.runners.Suite.runChild(Suite.java:128)
	at org.junit.runners.Suite.runChild(Suite.java:24)
	at org.junit.runners.ParentRunner$3.run(ParentRunner.java:193)
	at org.junit.runners.ParentRunner$1.schedule(ParentRunner.java:52)
	at org.junit.runners.ParentRunner.runChildren(ParentRunner.java:191)
	at org.junit.runners.ParentRunner.access$000(ParentRunner.java:42)
	at org.junit.runners.ParentRunner$2.evaluate(ParentRunner.java:184)
	at org.junit.runners.ParentRunner.run(ParentRunner.java:236)
	at org.junit.runner.JUnitCore.run(JUnitCore.java:157)
	at org.junit.runner.JUnitCore.run(JUnitCore.java:136)
	at org.junit.runner.JUnitCore.run(JUnitCore.java:117)
	at org.dataone.integration.webTest.TestRunnerHttpServlet.executeJUnitRun(TestRunnerHttpServlet.java:217)
	at org.dataone.integration.webTest.TestRunnerHttpServlet.doGet(TestRunnerHttpServlet.java:131)
	at org.dataone.integration.webTest.TestingTestRunnerServlet.callServletTest_ITtestSelector(TestingTestRunnerServlet.java:120)
	at sun.reflect.NativeMethodAccessorImpl.invoke0(Native Method)
	at sun.reflect.NativeMethodAccessorImpl.invoke(NativeMethodAccessorImpl.java:62)
	at sun.reflect.DelegatingMethodAccessorImpl.invoke(DelegatingMethodAccessorImpl.java:43)
	at java.lang.reflect.Method.invoke(Method.java:498)
	at org.junit.runners.model.FrameworkMethod$1.runReflectiveCall(FrameworkMethod.java:44)
	at org.junit.internal.runners.model.ReflectiveCallable.run(ReflectiveCallable.java:15)
	at org.junit.runners.model.FrameworkMethod.invokeExplosively(FrameworkMethod.java:41)
	at org.junit.internal.runners.statements.InvokeMethod.evaluate(InvokeMethod.java:20)
	at org.junit.runners.BlockJUnit4ClassRunner.runChild(BlockJUnit4ClassRunner.java:76)
	at org.junit.runners.BlockJUnit4ClassRunner.runChild(BlockJUnit4ClassRunner.java:50)
	at org.junit.runners.ParentRunner$3.run(ParentRunner.java:193)
	at org.junit.runners.ParentRunner$1.schedule(ParentRunner.java:52)
	at org.junit.runners.ParentRunner.runChildren(ParentRunner.java:191)
	at org.junit.runners.ParentRunner.access$000(ParentRunner.java:42)
	at org.junit.runners.ParentRunner$2.evaluate(ParentRunner.java:184)
	at org.junit.runners.ParentRunner.run(ParentRunner.java:236)
	at org.apache.maven.surefire.junit4.JUnit4Provider.execute(JUnit4Provider.java:252)
	at org.apache.maven.surefire.junit4.JUnit4Provider.executeTestSet(JUnit4Provider.java:141)
	at org.apache.maven.surefire.junit4.JUnit4Provider.invoke(JUnit4Provider.java:112)
	at sun.reflect.NativeMethodAccessorImpl.invoke0(Native Method)
	at sun.reflect.NativeMethodAccessorImpl.invoke(NativeMethodAccessorImpl.java:62)
	at sun.reflect.DelegatingMethodAccessorImpl.invoke(DelegatingMethodAccessorImpl.java:43)
	at java.lang.reflect.Method.invoke(Method.java:498)
	at org.apache.maven.surefire.util.ReflectionUtils.invokeMethodWithArray(ReflectionUtils.java:189)
	at org.apache.maven.surefire.booter.ProviderFactory$ProviderProxy.invoke(ProviderFactory.java:165)
	at org.apache.maven.surefire.booter.ProviderFactory.invokeProvider(ProviderFactory.java:85)
	at org.apache.maven.surefire.booter.ForkedBooter.runSuitesInProcess(ForkedBooter.java:115)
	at org.apache.maven.surefire.booter.ForkedBooter.main(ForkedBooter.java:75)
Caused by: org.dataone.service.exceptions.ServiceFailure: class java.net.UnknownHostException: demo.test.dataone.org
	at java.net.InetAddress.getAllByName0(InetAddress.java:1281)
	at java.net.InetAddress.getAllByName(InetAddress.java:1193)
	at java.net.InetAddress.getAllByName(InetAddress.java:1127)
	at org.apache.http.impl.conn.SystemDefaultDnsResolver.resolve(SystemDefaultDnsResolver.java:45)
	at org.apache.http.impl.conn.DefaultClientConnectionOperator.resolveHostname(DefaultClientConnectionOperator.java:278)
	at org.apache.http.impl.conn.DefaultClientConnectionOperator.openConnection(DefaultClientConnectionOperator.java:162)
	at org.apache.http.impl.conn.ManagedClientConnectionImpl.open(ManagedClientConnectionImpl.java:294)
	at org.apache.http.impl.client.DefaultRequestDirector.tryConnect(DefaultRequestDirector.java:643)
	at org.apache.http.impl.client.DefaultRequestDirector.execute(DefaultRequestDirector.java:479)
	at org.apache.http.impl.client.AbstractHttpClient.execute(AbstractHttpClient.java:906)
	at org.apache.http.impl.client.AbstractHttpClient.execute(AbstractHttpClient.java:805)
	at org.apache.http.impl.client.AbstractHttpClient.execute(AbstractHttpClient.java:784)
	at org.dataone.client.RestClient.doRequest(RestClient.java:340)
	at org.dataone.client.RestClient.doRequestNoBody(RestClient.java:266)
	at org.dataone.client.RestClient.doGetRequest(RestClient.java:181)
	at org.dataone.client.D1RestClient.doGetRequest(D1RestClient.java:233)
	at org.dataone.client.D1RestClient.doGetRequest(D1RestClient.java:223)
	at org.dataone.client.D1Node.listObjects(D1Node.java:276)
	at org.dataone.client.MNode.listObjects(MNode.java:265)
	at org.dataone.client.D1Node.listObjects(D1Node.java:231)
	at org.dataone.client.MNode.listObjects(MNode.java:241)
	at org.dataone.integration.ContextAwareTestCaseDataone.procurePublicReadableTestObject(ContextAwareTestCaseDataone.java:518)
	... 61 more
Caused by: java.net.UnknownHostException: demo.test.dataone.org
	... 83 more
~~~ Context is solo MemberNode: http://demo.test.dataone.org/knb/d1/mn
~~~ Context is solo MemberNode: http://demo.test.dataone.org/knb/d1/mn
~~~ Context is solo MemberNode: http://demo.test.dataone.org/knb/d1/mn
~~~ Context is solo MemberNode: http://demo.test.dataone.org/knb/d1/mn
~~~ Context is solo MemberNode: http://demo.test.dataone.org/knb/d1/mn
~~~ Context is solo MemberNode: http://demo.test.dataone.org/knb/d1/mn
~~~ Context is solo MemberNode: http://demo.test.dataone.org/knb/d1/mn
~~~ Context is solo MemberNode: http://demo.test.dataone.org/knb/d1/mn
~~~ Context is solo MemberNode: http://demo.test.dataone.org/knb/d1/mn
~~~ Context is solo MemberNode: http://demo.test.dataone.org/knb/d1/mn
~~~ Context is solo MemberNode: http://demo.test.dataone.org/knb/d1/mn
~~~ Context is solo MemberNode: http://demo.test.dataone.org/knb/d1/mn
~~~ Context is solo MemberNode: http://demo.test.dataone.org/knb/d1/mn
~~~ Context is solo MemberNode: http://demo.test.dataone.org/knb/d1/mn
~~~ Context is solo MemberNode: http://demo.test.dataone.org/knb/d1/mn
<html>
    <head>
        <title>Member Node Web Service Test Results</title>
        <style type="text/css">
			div { padding-left: 10px; padding-right: 10px; border-top: 2px solid #CCC; }
			body { font-family: sans-serif; margin: 0px; }
			div.padded { margin-top: 20px; }
			table { width: 100%; }
			th { text-align: left; }
			td { width: 60%; text-align: left; font-weight=normal; font-size: smaller; padding-left: 50px; }
			.green {background-image: url('images/blue.png'); background-repeat: no-repeat; padding: 10px; padding-left: 70px;}
			.red {background-image: url('images/red.png'); background-repeat: no-repeat; padding: 10px; padding-left: 70px;}
			.orange {background-image: url('images/grey.png'); background-repeat: no-repeat; padding: 10px; padding-left: 70px;}
			.greyDescr {background: #ccc; padding: 10px; padding-left: 70px; font-family: serif;}
			.yellow {background-image: url('images/yellow.png'); background-repeat: no-repeat; padding: 10px; padding-left: 70px;}
			.greyHeader {background: grey; padding: 10px; padding-left: 30px;}
		</style>
		<script language="javascript">
function toggleTrace(showHideDiv, switchTextDiv) {
    var ele = document.getElementById(showHideDiv);
    var text = document.getElementById(switchTextDiv);
    if(ele.style.display == "block") {
    ele.style.display = "none";
    text.innerHTML = "show trace";
    }
    else {
    ele.style.display = "block";
    text.innerHTML = "hide trace";
    }
}
</script>		
    </head>
  <body>
<div class="greyDescr"><table><tr><th>Member Node Url: http://demo.test.dataone.org/knb/d1/mn</th><td>Fri Dec 06 07:58:09 UTC 2019</td></tr></table></div><div class="greyHeader">
  <table>
    <tr>
      <th>org.dataone.integration.it.MNodeTier0IT</th>
      <td/>
    </tr>
  </table>
</div>
<div class="red">
  <table>
    <tr>
      <th>testBaseUrlResponse</th>
      <td>AssertionError: failed to create Node object from input streamjava.net.UnknownHostException: demo.test.dataone.org: Name or service not known [for host http://demo.test.dataone.org/knb/d1/mn/v1 ]
        <a id="toggleControl2" href="javascript:toggleTrace('traceContent2','toggleControl2');">show trace</a>
      </td>
    </tr>
  </table>
  <table>
    <tr>
      <td/>
      <td>
        <div id="traceContent2" style="display: none;">
          <pre>java.lang.AssertionError: failed to create Node object from input streamjava.net.UnknownHostException: demo.test.dataone.org: Name or service not known [for host http://demo.test.dataone.org/knb/d1/mn/v1 ]
            at org.junit.Assert.fail(Assert.java:91)
            at org.dataone.integration.ContextAwareTestCaseDataone$4.call(ContextAwareTestCaseDataone.java:1178)
            at org.junit.rules.ErrorCollector.checkSucceeds(ErrorCollector.java:70)
            at org.dataone.integration.ContextAwareTestCaseDataone.handleFail(ContextAwareTestCaseDataone.java:1173)
            at org.dataone.integration.it.MNodeTier0IT.testBaseUrlResponse(MNodeTier0IT.java:76)</pre>
        </div>
      </td>
    </tr>
  </table>
</div>
<div class="red">
  <table>
    <tr>
      <th>org.dataone.integration.it.MNodeTier0IT</th>
      <td>Failed Tier due to failures or exceptions. [RunCount=1 Failures/Errors=1 Ignored=0]</td>
    </tr>
  </table>
</div>
<div class="greyHeader">
  <table>
    <tr>
      <th>org.dataone.integration.it.MNodeTier2IT</th>
      <td/>
    </tr>
  </table>
</div>
<div class="red">
  <table>
    <tr>
      <th>testIsAuthorized</th>
      <td>AssertionError: org.dataone.integration.ContextAwareTestCaseDataone$TestIterationEndingException: could not create a test object and listObjects() threw exception:: ServiceFailure :: class java.net.UnknownHostException: demo.test.dataone.org [for host http://demo.test.dataone.org/knb/d1/mn/v1 ]
        <a id="toggleControl5" href="javascript:toggleTrace('traceContent5','toggleControl5');">show trace</a>
      </td>
    </tr>
  </table>
  <table>
    <tr>
      <td/>
      <td>
        <div id="traceContent5" style="display: none;">
          <pre>java.lang.AssertionError: org.dataone.integration.ContextAwareTestCaseDataone$TestIterationEndingException: could not create a test object and listObjects() threw exception:: ServiceFailure :: class java.net.UnknownHostException: demo.test.dataone.org [for host http://demo.test.dataone.org/knb/d1/mn/v1 ]
            at org.junit.Assert.fail(Assert.java:91)
            at org.dataone.integration.ContextAwareTestCaseDataone$4.call(ContextAwareTestCaseDataone.java:1178)
            at org.junit.rules.ErrorCollector.checkSucceeds(ErrorCollector.java:70)
            at org.dataone.integration.ContextAwareTestCaseDataone.handleFail(ContextAwareTestCaseDataone.java:1173)
            at org.dataone.integration.it.MNodeTier2IT.testIsAuthorized(MNodeTier2IT.java:121)</pre>
        </div>
      </td>
    </tr>
  </table>
</div>
<div class="red">
  <table>
    <tr>
      <th>testSystemMetadataChanged : authenticatedITKuser</th>
      <td>AssertionError: Expect an ITK client to receive NotAuthorized, got: ServiceFailure: 0 Client_Error: class java.net.UnknownHostException: demo.test.dataone.org [for host POST http://demo.test.dataone.org/knb/d1/mn/v1/object; MMP message has: ParamPart:pid = mNodeTier3201933923589529; FilePart:object = /tmp/mmp.output.7143470652039163027.tmp (684336 bytes); FilePart:sysmeta = /tmp/mmp.output.6613377819446632611.tmp (728 bytes); ]
        <a id="toggleControl6" href="javascript:toggleTrace('traceContent6','toggleControl6');">show trace</a>
      </td>
    </tr>
  </table>
  <table>
    <tr>
      <td/>
      <td>
        <div id="traceContent6" style="display: none;">
          <pre>java.lang.AssertionError: Expect an ITK client to receive NotAuthorized, got: ServiceFailure: 0 Client_Error: class java.net.UnknownHostException: demo.test.dataone.org [for host POST http://demo.test.dataone.org/knb/d1/mn/v1/object; MMP message has: ParamPart:pid = mNodeTier3201933923589529; FilePart:object = /tmp/mmp.output.7143470652039163027.tmp (684336 bytes); FilePart:sysmeta = /tmp/mmp.output.6613377819446632611.tmp (728 bytes); ]
            at org.junit.Assert.fail(Assert.java:91)
            at org.dataone.integration.ContextAwareTestCaseDataone$4.call(ContextAwareTestCaseDataone.java:1178)
            at org.junit.rules.ErrorCollector.checkSucceeds(ErrorCollector.java:70)
            at org.dataone.integration.ContextAwareTestCaseDataone.handleFail(ContextAwareTestCaseDataone.java:1173)
            at org.dataone.integration.it.MNodeTier2IT.testSystemMetadataChanged_authenticatedITKuser(MNodeTier2IT.java:276)</pre>
        </div>
      </td>
    </tr>
  </table>
</div>
<div class="red">
  <table>
    <tr>
      <th>testSystemMetadataChanged</th>
      <td>AssertionError: org.dataone.integration.ContextAwareTestCaseDataone$TestIterationEndingException: could not create a test object and listObjects() threw exception:: ServiceFailure :: class java.net.UnknownHostException: demo.test.dataone.org [for host http://demo.test.dataone.org/knb/d1/mn/v1 ]
        <a id="toggleControl7" href="javascript:toggleTrace('traceContent7','toggleControl7');">show trace</a>
      </td>
    </tr>
  </table>
  <table>
    <tr>
      <td/>
      <td>
        <div id="traceContent7" style="display: none;">
          <pre>java.lang.AssertionError: org.dataone.integration.ContextAwareTestCaseDataone$TestIterationEndingException: could not create a test object and listObjects() threw exception:: ServiceFailure :: class java.net.UnknownHostException: demo.test.dataone.org [for host http://demo.test.dataone.org/knb/d1/mn/v1 ]
            at org.junit.Assert.fail(Assert.java:91)
            at org.dataone.integration.ContextAwareTestCaseDataone$4.call(ContextAwareTestCaseDataone.java:1178)
            at org.junit.rules.ErrorCollector.checkSucceeds(ErrorCollector.java:70)
            at org.dataone.integration.ContextAwareTestCaseDataone.handleFail(ContextAwareTestCaseDataone.java:1173)
            at org.dataone.integration.it.MNodeTier2IT.testSystemMetadataChanged(MNodeTier2IT.java:209)</pre>
        </div>
      </td>
    </tr>
  </table>
</div>
<div class="red">
  <table>
    <tr>
      <th>testIsAuthorized : NullPolicy testGroup is RightsHolder</th>
      <td>AssertionError: ServiceFailure: 0 Client_Error: class java.net.UnknownHostException: demo.test.dataone.org [for host GET http://demo.test.dataone.org/knb/d1/mn/v1/meta/TierTesting:demo:RightsHolder_testGroup.14 ]
        <a id="toggleControl8" href="javascript:toggleTrace('traceContent8','toggleControl8');">show trace</a>
      </td>
    </tr>
  </table>
  <table>
    <tr>
      <td/>
      <td>
        <div id="traceContent8" style="display: none;">
          <pre>java.lang.AssertionError: ServiceFailure: 0 Client_Error: class java.net.UnknownHostException: demo.test.dataone.org [for host GET http://demo.test.dataone.org/knb/d1/mn/v1/meta/TierTesting:demo:RightsHolder_testGroup.14 ]
            at org.junit.Assert.fail(Assert.java:91)</pre>
        </div>
      </td>
    </tr>
  </table>
</div>
<div class="red">
  <table>
    <tr>
      <th>testIsAuthorized : AccessPolicy is AuthenticatedUser can Read</th>
      <td>AssertionError: ServiceFailure: 0 Client_Error: class java.net.UnknownHostException: demo.test.dataone.org [for host GET http://demo.test.dataone.org/knb/d1/mn/v1/meta/TierTesting:demo:Authenticated_READ.14 ]
        <a id="toggleControl9" href="javascript:toggleTrace('traceContent9','toggleControl9');">show trace</a>
      </td>
    </tr>
  </table>
  <table>
    <tr>
      <td/>
      <td>
        <div id="traceContent9" style="display: none;">
          <pre>java.lang.AssertionError: ServiceFailure: 0 Client_Error: class java.net.UnknownHostException: demo.test.dataone.org [for host GET http://demo.test.dataone.org/knb/d1/mn/v1/meta/TierTesting:demo:Authenticated_READ.14 ]
            at org.junit.Assert.fail(Assert.java:91)</pre>
        </div>
      </td>
    </tr>
  </table>
</div>
<div class="red">
  <table>
    <tr>
      <th>testIsAuthorized : AccessPolicy is VerifiedUser can Read</th>
      <td>AssertionError: ServiceFailure: 0 Client_Error: class java.net.UnknownHostException: demo.test.dataone.org [for host GET http://demo.test.dataone.org/knb/d1/mn/v1/meta/TierTesting:demo:Verified_READ.14 ]
        <a id="toggleControl10" href="javascript:toggleTrace('traceContent10','toggleControl10');">show trace</a>
      </td>
    </tr>
  </table>
  <table>
    <tr>
      <td/>
      <td>
        <div id="traceContent10" style="display: none;">
          <pre>java.lang.AssertionError: ServiceFailure: 0 Client_Error: class java.net.UnknownHostException: demo.test.dataone.org [for host GET http://demo.test.dataone.org/knb/d1/mn/v1/meta/TierTesting:demo:Verified_READ.14 ]
            at org.junit.Assert.fail(Assert.java:91)</pre>
        </div>
      </td>
    </tr>
  </table>
</div>
<div class="red">
  <table>
    <tr>
      <th>testIsAuthorized : AccessPolicy is testPerson can Read</th>
      <td>AssertionError: ServiceFailure: 0 Client_Error: class java.net.UnknownHostException: demo.test.dataone.org [for host GET http://demo.test.dataone.org/knb/d1/mn/v1/meta/TierTesting:demo:testPerson_READ.14 ]
        <a id="toggleControl11" href="javascript:toggleTrace('traceContent11','toggleControl11');">show trace</a>
      </td>
    </tr>
  </table>
  <table>
    <tr>
      <td/>
      <td>
        <div id="traceContent11" style="display: none;">
          <pre>java.lang.AssertionError: ServiceFailure: 0 Client_Error: class java.net.UnknownHostException: demo.test.dataone.org [for host GET http://demo.test.dataone.org/knb/d1/mn/v1/meta/TierTesting:demo:testPerson_READ.14 ]
            at org.junit.Assert.fail(Assert.java:91)</pre>
        </div>
      </td>
    </tr>
  </table>
</div>
<div class="red">
  <table>
    <tr>
      <th>testIsAuthorized : AccessPolicy is testPerson can Write</th>
      <td>AssertionError: ServiceFailure: 0 Client_Error: class java.net.UnknownHostException: demo.test.dataone.org [for host GET http://demo.test.dataone.org/knb/d1/mn/v1/meta/TierTesting:demo:testPerson_WRITE.14 ]
        <a id="toggleControl12" href="javascript:toggleTrace('traceContent12','toggleControl12');">show trace</a>
      </td>
    </tr>
  </table>
  <table>
    <tr>
      <td/>
      <td>
        <div id="traceContent12" style="display: none;">
          <pre>java.lang.AssertionError: ServiceFailure: 0 Client_Error: class java.net.UnknownHostException: demo.test.dataone.org [for host GET http://demo.test.dataone.org/knb/d1/mn/v1/meta/TierTesting:demo:testPerson_WRITE.14 ]
            at org.junit.Assert.fail(Assert.java:91)</pre>
        </div>
      </td>
    </tr>
  </table>
</div>
<div class="red">
  <table>
    <tr>
      <th>testIsAuthorized : AccessPolicy is testPerson can ChangePerm</th>
      <td>AssertionError: ServiceFailure: 0 Client_Error: class java.net.UnknownHostException: demo.test.dataone.org [for host GET http://demo.test.dataone.org/knb/d1/mn/v1/meta/TierTesting:demo:testPerson_CHANGE.14 ]
        <a id="toggleControl13" href="javascript:toggleTrace('traceContent13','toggleControl13');">show trace</a>
      </td>
    </tr>
  </table>
  <table>
    <tr>
      <td/>
      <td>
        <div id="traceContent13" style="display: none;">
          <pre>java.lang.AssertionError: ServiceFailure: 0 Client_Error: class java.net.UnknownHostException: demo.test.dataone.org [for host GET http://demo.test.dataone.org/knb/d1/mn/v1/meta/TierTesting:demo:testPerson_CHANGE.14 ]
            at org.junit.Assert.fail(Assert.java:91)</pre>
        </div>
      </td>
    </tr>
  </table>
</div>
<div class="red">
  <table>
    <tr>
      <th>testIsAuthorized : AccessPolicy is testGroup can Read</th>
      <td>AssertionError: ServiceFailure: 0 Client_Error: class java.net.UnknownHostException: demo.test.dataone.org [for host GET http://demo.test.dataone.org/knb/d1/mn/v1/meta/TierTesting:demo:testGroup_READ.14 ]
        <a id="toggleControl14" href="javascript:toggleTrace('traceContent14','toggleControl14');">show trace</a>
      </td>
    </tr>
  </table>
  <table>
    <tr>
      <td/>
      <td>
        <div id="traceContent14" style="display: none;">
          <pre>java.lang.AssertionError: ServiceFailure: 0 Client_Error: class java.net.UnknownHostException: demo.test.dataone.org [for host GET http://demo.test.dataone.org/knb/d1/mn/v1/meta/TierTesting:demo:testGroup_READ.14 ]
            at org.junit.Assert.fail(Assert.java:91)</pre>
        </div>
      </td>
    </tr>
  </table>
</div>
<div class="red">
  <table>
    <tr>
      <th>testIsAuthorized : AccessPolicy is testGroup can Write</th>
      <td>AssertionError: ServiceFailure: 0 Client_Error: class java.net.UnknownHostException: demo.test.dataone.org [for host GET http://demo.test.dataone.org/knb/d1/mn/v1/meta/TierTesting:demo:testGroup_WRITE.14 ]
        <a id="toggleControl15" href="javascript:toggleTrace('traceContent15','toggleControl15');">show trace</a>
      </td>
    </tr>
  </table>
  <table>
    <tr>
      <td/>
      <td>
        <div id="traceContent15" style="display: none;">
          <pre>java.lang.AssertionError: ServiceFailure: 0 Client_Error: class java.net.UnknownHostException: demo.test.dataone.org [for host GET http://demo.test.dataone.org/knb/d1/mn/v1/meta/TierTesting:demo:testGroup_WRITE.14 ]
            at org.junit.Assert.fail(Assert.java:91)</pre>
        </div>
      </td>
    </tr>
  </table>
</div>
<div class="red">
  <table>
    <tr>
      <th>testIsAuthorized : AccessPolicy is testGroup can ChangePerm</th>
      <td>AssertionError: ServiceFailure: 0 Client_Error: class java.net.UnknownHostException: demo.test.dataone.org [for host GET http://demo.test.dataone.org/knb/d1/mn/v1/meta/TierTesting:demo:testGroup_CHANGE.14 ]
        <a id="toggleControl16" href="javascript:toggleTrace('traceContent16','toggleControl16');">show trace</a>
      </td>
    </tr>
  </table>
  <table>
    <tr>
      <td/>
      <td>
        <div id="traceContent16" style="display: none;">
          <pre>java.lang.AssertionError: ServiceFailure: 0 Client_Error: class java.net.UnknownHostException: demo.test.dataone.org [for host GET http://demo.test.dataone.org/knb/d1/mn/v1/meta/TierTesting:demo:testGroup_CHANGE.14 ]
            at org.junit.Assert.fail(Assert.java:91)</pre>
        </div>
      </td>
    </tr>
  </table>
</div>
<div class="red">
  <table>
    <tr>
      <th>testIsAuthorized : AccessPolicy is legacyAccount can Write</th>
      <td>AssertionError: ServiceFailure: 0 Client_Error: class java.net.UnknownHostException: demo.test.dataone.org [for host GET http://demo.test.dataone.org/knb/d1/mn/v1/meta/TierTesting:demo:legacyAcct_WRITE.14 ]
        <a id="toggleControl17" href="javascript:toggleTrace('traceContent17','toggleControl17');">show trace</a>
      </td>
    </tr>
  </table>
  <table>
    <tr>
      <td/>
      <td>
        <div id="traceContent17" style="display: none;">
          <pre>java.lang.AssertionError: ServiceFailure: 0 Client_Error: class java.net.UnknownHostException: demo.test.dataone.org [for host GET http://demo.test.dataone.org/knb/d1/mn/v1/meta/TierTesting:demo:legacyAcct_WRITE.14 ]
            at org.junit.Assert.fail(Assert.java:91)</pre>
        </div>
      </td>
    </tr>
  </table>
</div>
<div class="red">
  <table>
    <tr>
      <th>testIsAuthorized : ComplicatedAccessPolicy</th>
      <td>AssertionError: ServiceFailure: 0 Client_Error: class java.net.UnknownHostException: demo.test.dataone.org [for host GET http://demo.test.dataone.org/knb/d1/mn/v1/meta/TierTesting:demo:ComplicatedPolicy.14 ]
        <a id="toggleControl18" href="javascript:toggleTrace('traceContent18','toggleControl18');">show trace</a>
      </td>
    </tr>
  </table>
  <table>
    <tr>
      <td/>
      <td>
        <div id="traceContent18" style="display: none;">
          <pre>java.lang.AssertionError: ServiceFailure: 0 Client_Error: class java.net.UnknownHostException: demo.test.dataone.org [for host GET http://demo.test.dataone.org/knb/d1/mn/v1/meta/TierTesting:demo:ComplicatedPolicy.14 ]
            at org.junit.Assert.fail(Assert.java:91)</pre>
        </div>
      </td>
    </tr>
  </table>
</div>
<div class="yellow">
  <table>
    <tr>
      <th>testConnectionLayer : SelfSignedCert</th>
      <td>testing with the other tests against the various test objects</td>
    </tr>
  </table>
</div>
<div class="green">
  <table>
    <tr>
      <th>testConnectionLayer : ExpiredCertificate</th>
      <td/>
    </tr>
  </table>
</div>
<div class="red">
  <table>
    <tr>
      <th>testConnectionLayer : dataoneCAtrusted</th>
      <td>AssertionError: ServiceFailure: 0 Client_Error:: class java.net.UnknownHostException: demo.test.dataone.org [for host GET http://demo.test.dataone.org/knb/d1/mn/v1/monitor/ping ]
        <a id="toggleControl21" href="javascript:toggleTrace('traceContent21','toggleControl21');">show trace</a>
      </td>
    </tr>
  </table>
  <table>
    <tr>
      <td/>
      <td>
        <div id="traceContent21" style="display: none;">
          <pre>java.lang.AssertionError: ServiceFailure: 0 Client_Error:: class java.net.UnknownHostException: demo.test.dataone.org [for host GET http://demo.test.dataone.org/knb/d1/mn/v1/monitor/ping ]
            at org.junit.Assert.fail(Assert.java:91)</pre>
        </div>
      </td>
    </tr>
  </table>
</div>
<div class="red">
  <table>
    <tr>
      <th>testIsAuthorized : NullPolicy testPerson is RightsHolder</th>
      <td>AssertionError: ServiceFailure: 0 Client_Error: class java.net.UnknownHostException: demo.test.dataone.org [for host GET http://demo.test.dataone.org/knb/d1/mn/v1/meta/TierTesting:demo:RightsHolder_testPerson.14 ]
        <a id="toggleControl22" href="javascript:toggleTrace('traceContent22','toggleControl22');">show trace</a>
      </td>
    </tr>
  </table>
  <table>
    <tr>
      <td/>
      <td>
        <div id="traceContent22" style="display: none;">
          <pre>java.lang.AssertionError: ServiceFailure: 0 Client_Error: class java.net.UnknownHostException: demo.test.dataone.org [for host GET http://demo.test.dataone.org/knb/d1/mn/v1/meta/TierTesting:demo:RightsHolder_testPerson.14 ]
            at org.junit.Assert.fail(Assert.java:91)</pre>
        </div>
      </td>
    </tr>
  </table>
</div>
<div class="red">
  <table>
    <tr>
      <th>testIsAuthorized : AccessPolicy is Public can Read</th>
      <td>AssertionError: ServiceFailure: 0 Client_Error: class java.net.UnknownHostException: demo.test.dataone.org [for host GET http://demo.test.dataone.org/knb/d1/mn/v1/meta/TierTesting:demo:Public_READ.14 ]
        <a id="toggleControl23" href="javascript:toggleTrace('traceContent23','toggleControl23');">show trace</a>
      </td>
    </tr>
  </table>
  <table>
    <tr>
      <td/>
      <td>
        <div id="traceContent23" style="display: none;">
          <pre>java.lang.AssertionError: ServiceFailure: 0 Client_Error: class java.net.UnknownHostException: demo.test.dataone.org [for host GET http://demo.test.dataone.org/knb/d1/mn/v1/meta/TierTesting:demo:Public_READ.14 ]
            at org.junit.Assert.fail(Assert.java:91)</pre>
        </div>
      </td>
    </tr>
  </table>
</div>
<div class="red">
  <table>
    <tr>
      <th>org.dataone.integration.it.MNodeTier2IT</th>
      <td>Failed Tier due to failures or exceptions. [RunCount=18 Failures/Errors=17 Ignored=1]</td>
    </tr>
  </table>
</div>
  </body>
</html>

20191206-07:58:09: [INFO]: setting system property 'context.mn.baseurl' to value 'http://demo.test.dataone.org/knb/d1/mn' [org.dataone.integration.webTest.TestRunnerHttpServlet]
20191206-07:58:09: [WARN]: Problem loading testing configuration at: 'null':: Cannot locate configuration source null [org.dataone.configuration.TestSettings]
20191206-07:58:09: [INFO]: Registering class: org.dataone.integration.webTest.MockITCase [org.dataone.integration.webTest.TestRunnerHttpServlet]
<html>
    <head>
        <title>Member Node Web Service Test Results</title>
        <style type="text/css">
			div { padding-left: 10px; padding-right: 10px; border-top: 2px solid #CCC; }
			body { font-family: sans-serif; margin: 0px; }
			div.padded { margin-top: 20px; }
			table { width: 100%; }
			th { text-align: left; }
			td { width: 60%; text-align: left; font-weight=normal; font-size: smaller; padding-left: 50px; }
			.green {background-image: url('images/blue.png'); background-repeat: no-repeat; padding: 10px; padding-left: 70px;}
			.red {background-image: url('images/red.png'); background-repeat: no-repeat; padding: 10px; padding-left: 70px;}
			.orange {background-image: url('images/grey.png'); background-repeat: no-repeat; padding: 10px; padding-left: 70px;}
			.greyDescr {background: #ccc; padding: 10px; padding-left: 70px; font-family: serif;}
			.yellow {background-image: url('images/yellow.png'); background-repeat: no-repeat; padding: 10px; padding-left: 70px;}
			.greyHeader {background: grey; padding: 10px; padding-left: 30px;}
		</style>
		<script language="javascript">
function toggleTrace(showHideDiv, switchTextDiv) {
    var ele = document.getElementById(showHideDiv);
    var text = document.getElementById(switchTextDiv);
    if(ele.style.display == "block") {
    ele.style.display = "none";
    text.innerHTML = "show trace";
    }
    else {
    ele.style.display = "block";
    text.innerHTML = "hide trace";
    }
}
</script>		
    </head>
  <body>
<div class="greyDescr"><table><tr><th>Member Node Url: http://demo.test.dataone.org/knb/d1/mn</th><td>Fri Dec 06 07:58:09 UTC 2019</td></tr></table></div><div class="greyHeader">
  <table>
    <tr>
      <th>org.dataone.integration.webTest.MockITCase</th>
      <td/>
    </tr>
  </table>
</div>
<div class="green">
  <table>
    <tr>
      <th>testTrue</th>
      <td/>
    </tr>
  </table>
</div>
<div class="orange">
  <table>
    <tr>
      <th>testException</th>
      <td>ArithmeticException: / by zero
        <a id="toggleControl3" href="javascript:toggleTrace('traceContent3','toggleControl3');">show trace</a>
      </td>
    </tr>
  </table>
  <table>
    <tr>
      <td/>
      <td>
        <div id="traceContent3" style="display: none;">
          <pre>java.lang.ArithmeticException: / by zero
            at org.dataone.integration.webTest.MockITCase.testException(MockITCase.java:59)</pre>
        </div>
      </td>
    </tr>
  </table>
</div>
<div class="yellow">
  <table>
    <tr>
      <th>testIgnore</th>
      <td/>
    </tr>
  </table>
</div>
<div class="red">
  <table>
    <tr>
      <th>testFalse</th>
      <td>AssertionError: 
        <a id="toggleControl5" href="javascript:toggleTrace('traceContent5','toggleControl5');">show trace</a>
      </td>
    </tr>
  </table>
  <table>
    <tr>
      <td/>
      <td>
        <div id="traceContent5" style="display: none;">
          <pre>java.lang.AssertionError: 
            at org.junit.Assert.fail(Assert.java:91)
            at org.junit.Assert.assertTrue(Assert.java:43)
            at org.junit.Assert.assertTrue(Assert.java:54)
            at org.dataone.integration.webTest.MockITCase.testFalse(MockITCase.java:45)</pre>
        </div>
      </td>
    </tr>
  </table>
</div>
<div class="red">
  <table>
    <tr>
      <th>org.dataone.integration.webTest.MockITCase</th>
      <td>Failed Tier due to failures or exceptions. [RunCount=3 Failures/Errors=2 Ignored=1]</td>
    </tr>
  </table>
</div>
  </body>
</html>

Tests run: 3, Failures: 0, Errors: 0, Skipped: 0, Time elapsed: 0.587 sec
Running org.dataone.integration.webTest.TestManifestAccess
Tests run: 2, Failures: 0, Errors: 0, Skipped: 1, Time elapsed: 0 sec
Running org.dataone.integration.webTest.TestLauncher
Tests run: 2, Failures: 0, Errors: 0, Skipped: 0, Time elapsed: 0.001 sec
Running org.dataone.client.CNRestURLTest
Tests run: 9, Failures: 0, Errors: 0, Skipped: 8, Time elapsed: 0.001 sec

Results :

Tests run: 33, Failures: 0, Errors: 0, Skipped: 11

[JENKINS] Recording test results
[INFO] 
[INFO] --- maven-antrun-plugin:1.3:run (execution1) @ d1_integration ---
[INFO] Executing tasks
     [copy] Copying 127 files to /var/lib/jenkins/jobs/d1_integration_STAGE/workspace/D1_INTEGRATION_v1.1/target/classes
     [copy] Copying 3 files to /var/lib/jenkins/jobs/d1_integration_STAGE/workspace/D1_INTEGRATION_v1.1/target/d1_integration-1.1-SNAPSHOT/org/dataone/integration/webTest
[INFO] Executed tasks
[INFO] 
[INFO] --- maven-dependency-plugin:2.3:unpack-dependencies (jetty-classpath) @ d1_integration ---
[INFO] Unpacking /var/lib/jenkins/.m2/repository/org/eclipse/jetty/orbit/javax.activation/1.1.0.v201105071233/javax.activation-1.1.0.v201105071233.jar to /var/lib/jenkins/jobs/d1_integration_STAGE/workspace/D1_INTEGRATION_v1.1/target/d1_integration-1.1-SNAPSHOT with includes "" and excludes ""
[INFO] Unpacking /var/lib/jenkins/.m2/repository/org/eclipse/jetty/orbit/org.eclipse.jdt.core/3.7.1/org.eclipse.jdt.core-3.7.1.jar to /var/lib/jenkins/jobs/d1_integration_STAGE/workspace/D1_INTEGRATION_v1.1/target/d1_integration-1.1-SNAPSHOT with includes "" and excludes ""
[INFO] Unpacking /var/lib/jenkins/.m2/repository/org/eclipse/jetty/aggregate/jetty-all-server/8.1.15.v20140411/jetty-all-server-8.1.15.v20140411.jar to /var/lib/jenkins/jobs/d1_integration_STAGE/workspace/D1_INTEGRATION_v1.1/target/d1_integration-1.1-SNAPSHOT with includes "" and excludes ""
[INFO] Unpacking /var/lib/jenkins/.m2/repository/org/eclipse/jetty/orbit/org.apache.jasper.glassfish/2.2.2.v201112011158/org.apache.jasper.glassfish-2.2.2.v201112011158.jar to /var/lib/jenkins/jobs/d1_integration_STAGE/workspace/D1_INTEGRATION_v1.1/target/d1_integration-1.1-SNAPSHOT with includes "" and excludes ""
[INFO] Unpacking /var/lib/jenkins/.m2/repository/org/eclipse/jetty/orbit/javax.servlet.jsp.jstl/1.2.0.v201105211821/javax.servlet.jsp.jstl-1.2.0.v201105211821.jar to /var/lib/jenkins/jobs/d1_integration_STAGE/workspace/D1_INTEGRATION_v1.1/target/d1_integration-1.1-SNAPSHOT with includes "" and excludes ""
[INFO] Unpacking /var/lib/jenkins/.m2/repository/org/eclipse/jetty/jetty-http/8.1.15.v20140411/jetty-http-8.1.15.v20140411.jar to /var/lib/jenkins/jobs/d1_integration_STAGE/workspace/D1_INTEGRATION_v1.1/target/d1_integration-1.1-SNAPSHOT with includes "" and excludes ""
[INFO] Unpacking /var/lib/jenkins/.m2/repository/org/eclipse/jetty/orbit/javax.servlet/3.0.0.v201112011016/javax.servlet-3.0.0.v201112011016.jar to /var/lib/jenkins/jobs/d1_integration_STAGE/workspace/D1_INTEGRATION_v1.1/target/d1_integration-1.1-SNAPSHOT with includes "" and excludes ""
[INFO] Unpacking /var/lib/jenkins/.m2/repository/org/eclipse/jetty/orbit/javax.security.auth.message/1.0.0.v201108011116/javax.security.auth.message-1.0.0.v201108011116.jar to /var/lib/jenkins/jobs/d1_integration_STAGE/workspace/D1_INTEGRATION_v1.1/target/d1_integration-1.1-SNAPSHOT with includes "" and excludes ""
[INFO] Unpacking /var/lib/jenkins/.m2/repository/org/eclipse/jetty/orbit/javax.annotation/1.1.0.v201108011116/javax.annotation-1.1.0.v201108011116.jar to /var/lib/jenkins/jobs/d1_integration_STAGE/workspace/D1_INTEGRATION_v1.1/target/d1_integration-1.1-SNAPSHOT with includes "" and excludes ""
[INFO] Unpacking /var/lib/jenkins/.m2/repository/org/eclipse/jetty/orbit/javax.servlet.jsp/2.2.0.v201112011158/javax.servlet.jsp-2.2.0.v201112011158.jar to /var/lib/jenkins/jobs/d1_integration_STAGE/workspace/D1_INTEGRATION_v1.1/target/d1_integration-1.1-SNAPSHOT with includes "" and excludes ""
[INFO] Unpacking /var/lib/jenkins/.m2/repository/org/eclipse/jetty/orbit/javax.el/2.2.0.v201108011116/javax.el-2.2.0.v201108011116.jar to /var/lib/jenkins/jobs/d1_integration_STAGE/workspace/D1_INTEGRATION_v1.1/target/d1_integration-1.1-SNAPSHOT with includes "" and excludes ""
[INFO] Unpacking /var/lib/jenkins/.m2/repository/org/eclipse/jetty/jetty-websocket/8.1.15.v20140411/jetty-websocket-8.1.15.v20140411.jar to /var/lib/jenkins/jobs/d1_integration_STAGE/workspace/D1_INTEGRATION_v1.1/target/d1_integration-1.1-SNAPSHOT with includes "" and excludes ""
[INFO] Unpacking /var/lib/jenkins/.m2/repository/org/eclipse/jetty/jetty-util/8.1.15.v20140411/jetty-util-8.1.15.v20140411.jar to /var/lib/jenkins/jobs/d1_integration_STAGE/workspace/D1_INTEGRATION_v1.1/target/d1_integration-1.1-SNAPSHOT with includes "" and excludes ""
[INFO] Unpacking /var/lib/jenkins/.m2/repository/org/eclipse/jetty/jetty-io/8.1.15.v20140411/jetty-io-8.1.15.v20140411.jar to /var/lib/jenkins/jobs/d1_integration_STAGE/workspace/D1_INTEGRATION_v1.1/target/d1_integration-1.1-SNAPSHOT with includes "" and excludes ""
[INFO] Unpacking /var/lib/jenkins/.m2/repository/javax/servlet/servlet-api/2.5/servlet-api-2.5.jar to /var/lib/jenkins/jobs/d1_integration_STAGE/workspace/D1_INTEGRATION_v1.1/target/d1_integration-1.1-SNAPSHOT with includes "" and excludes ""
[INFO] Unpacking /var/lib/jenkins/.m2/repository/org/eclipse/jetty/jetty-jsp/8.1.15.v20140411/jetty-jsp-8.1.15.v20140411.jar to /var/lib/jenkins/jobs/d1_integration_STAGE/workspace/D1_INTEGRATION_v1.1/target/d1_integration-1.1-SNAPSHOT with includes "" and excludes ""
[INFO] Unpacking /var/lib/jenkins/.m2/repository/org/slf4j/slf4j-api/1.6.4/slf4j-api-1.6.4.jar to /var/lib/jenkins/jobs/d1_integration_STAGE/workspace/D1_INTEGRATION_v1.1/target/d1_integration-1.1-SNAPSHOT with includes "" and excludes ""
[INFO] Unpacking /var/lib/jenkins/.m2/repository/org/eclipse/jetty/orbit/com.sun.el/2.2.0.v201108011116/com.sun.el-2.2.0.v201108011116.jar to /var/lib/jenkins/jobs/d1_integration_STAGE/workspace/D1_INTEGRATION_v1.1/target/d1_integration-1.1-SNAPSHOT with includes "" and excludes ""
[INFO] Unpacking /var/lib/jenkins/.m2/repository/org/slf4j/slf4j-simple/1.6.4/slf4j-simple-1.6.4.jar to /var/lib/jenkins/jobs/d1_integration_STAGE/workspace/D1_INTEGRATION_v1.1/target/d1_integration-1.1-SNAPSHOT with includes "" and excludes ""
[INFO] Unpacking /var/lib/jenkins/.m2/repository/org/eclipse/jetty/orbit/javax.mail.glassfish/1.4.1.v201005082020/javax.mail.glassfish-1.4.1.v201005082020.jar to /var/lib/jenkins/jobs/d1_integration_STAGE/workspace/D1_INTEGRATION_v1.1/target/d1_integration-1.1-SNAPSHOT with includes "" and excludes ""
[INFO] Unpacking /var/lib/jenkins/.m2/repository/org/eclipse/jetty/orbit/org.apache.taglibs.standard.glassfish/1.2.0.v201112081803/org.apache.taglibs.standard.glassfish-1.2.0.v201112081803.jar to /var/lib/jenkins/jobs/d1_integration_STAGE/workspace/D1_INTEGRATION_v1.1/target/d1_integration-1.1-SNAPSHOT with includes "" and excludes ""
[INFO] 
[INFO] --- maven-war-plugin:2.2:war (default-war) @ d1_integration ---
[INFO] Packaging webapp
[INFO] Assembling webapp [d1_integration] in [/var/lib/jenkins/jobs/d1_integration_STAGE/workspace/D1_INTEGRATION_v1.1/target/d1_integration-1.1-SNAPSHOT]
[INFO] Processing war project
[INFO] Copying webapp resources [/var/lib/jenkins/jobs/d1_integration_STAGE/workspace/D1_INTEGRATION_v1.1/src/main/webapp]
[INFO] Webapp assembled in [230 msecs]
[INFO] Building war: /var/lib/jenkins/jobs/d1_integration_STAGE/workspace/D1_INTEGRATION_v1.1/target/d1_integration-1.1-SNAPSHOT.war
[INFO] WEB-INF/web.xml already added, skipping
[INFO] 
[INFO] --- maven-antrun-plugin:1.3:run (execution2) @ d1_integration ---
[INFO] Executing tasks
     [move] Moving 1 file to /var/lib/jenkins/jobs/d1_integration_STAGE/workspace/D1_INTEGRATION_v1.1/target
[INFO] Executed tasks
[INFO] 
[INFO] --- maven-failsafe-plugin:2.8.1:integration-test (integration-test) @ d1_integration ---
[INFO] Failsafe report directory: /var/lib/jenkins/jobs/d1_integration_STAGE/workspace/D1_INTEGRATION_v1.1/target/failsafe-reports

-------------------------------------------------------
 T E S T S
-------------------------------------------------------
Running org.dataone.integration.it.MNodeTier1IT
20191206-07:58:17: [WARN]: Problem loading testing configuration at: 'null':: Cannot locate configuration source null [org.dataone.configuration.TestSettings]
~~~ Context is solo MemberNode: https://mn-demo-6.test.dataone.org/knb/d1/mn
~~~ Context is solo MemberNode: https://mn-demo-6.test.dataone.org/knb/d1/mn
~~~ Context is solo MemberNode: https://mn-demo-6.test.dataone.org/knb/d1/mn
~~~ Context is solo MemberNode: https://mn-demo-6.test.dataone.org/knb/d1/mn
~~~ Context is solo MemberNode: https://mn-demo-6.test.dataone.org/knb/d1/mn
~~~ Context is solo MemberNode: https://mn-demo-6.test.dataone.org/knb/d1/mn
~~~ Context is solo MemberNode: https://mn-demo-6.test.dataone.org/knb/d1/mn
~~~ Context is solo MemberNode: https://mn-demo-6.test.dataone.org/knb/d1/mn
~~~ Context is solo MemberNode: https://mn-demo-6.test.dataone.org/knb/d1/mn
~~~ Context is solo MemberNode: https://mn-demo-6.test.dataone.org/knb/d1/mn
~~~ Context is solo MemberNode: https://mn-demo-6.test.dataone.org/knb/d1/mn
~~~ Context is solo MemberNode: https://mn-demo-6.test.dataone.org/knb/d1/mn
~~~ Context is solo MemberNode: https://mn-demo-6.test.dataone.org/knb/d1/mn
~~~ Context is solo MemberNode: https://mn-demo-6.test.dataone.org/knb/d1/mn
~~~ Context is solo MemberNode: https://mn-demo-6.test.dataone.org/knb/d1/mn
~~~ Context is solo MemberNode: https://mn-demo-6.test.dataone.org/knb/d1/mn
~~~ Context is solo MemberNode: https://mn-demo-6.test.dataone.org/knb/d1/mn
~~~ Context is solo MemberNode: https://mn-demo-6.test.dataone.org/knb/d1/mn
~~~ Context is solo MemberNode: https://mn-demo-6.test.dataone.org/knb/d1/mn
~~~ Context is solo MemberNode: https://mn-demo-6.test.dataone.org/knb/d1/mn
~~~ Context is solo MemberNode: https://mn-demo-6.test.dataone.org/knb/d1/mn
~~~ Context is solo MemberNode: https://mn-demo-6.test.dataone.org/knb/d1/mn
~~~ Context is solo MemberNode: https://mn-demo-6.test.dataone.org/knb/d1/mn
20191206-07:58:27: [WARN]: Failed to get current ObjectFormatList from the CN, using fallbacklist provided with libclient. Cause = ServiceFailure::0 Client_Error: class java.lang.IllegalStateException: Target host must not be null, or set in parameters. [org.dataone.client.ObjectFormatCache]
~~~ Context is solo MemberNode: https://mn-demo-6.test.dataone.org/knb/d1/mn
~~~ Context is solo MemberNode: https://mn-demo-6.test.dataone.org/knb/d1/mn
20191206-07:58:30: [ERROR]: (line 17 column 52): {E211} Base URI is null, but there are relative URIs to resolve.: <dakoop_test-PKG> [com.hp.hpl.jena.rdf.model.impl.RDFDefaultErrorHandler]
20191206-07:58:30: [WARN]: (line 17 column 52): {W136} Relative URIs are not permitted in RDF: specifically <dakoop_test-PKG> [com.hp.hpl.jena.rdf.model.impl.RDFDefaultErrorHandler]
20191206-07:58:30: [ERROR]: (line 48 column 48): {E211} Base URI is null, but there are relative URIs to resolve.: <dakoop_test-PKG> [com.hp.hpl.jena.rdf.model.impl.RDFDefaultErrorHandler]
20191206-07:58:30: [WARN]: (line 48 column 48): {W136} Relative URIs are not permitted in RDF: specifically <dakoop_test-PKG> [com.hp.hpl.jena.rdf.model.impl.RDFDefaultErrorHandler]
20191206-07:58:30: [ERROR]: (line 33 column 53): {E211} Base URI is null, but there are relative URIs to resolve.: <EVAWF1PackageVCV> [com.hp.hpl.jena.rdf.model.impl.RDFDefaultErrorHandler]
20191206-07:58:30: [WARN]: (line 33 column 53): {W136} Relative URIs are not permitted in RDF: specifically <EVAWF1PackageVCV> [com.hp.hpl.jena.rdf.model.impl.RDFDefaultErrorHandler]
20191206-07:58:30: [ERROR]: (line 48 column 49): {E211} Base URI is null, but there are relative URIs to resolve.: <EVAWF1PackageVCV> [com.hp.hpl.jena.rdf.model.impl.RDFDefaultErrorHandler]
20191206-07:58:30: [WARN]: (line 48 column 49): {W136} Relative URIs are not permitted in RDF: specifically <EVAWF1PackageVCV> [com.hp.hpl.jena.rdf.model.impl.RDFDefaultErrorHandler]
20191206-07:58:30: [ERROR]: (line 19 column 54): {E211} Base URI is null, but there are relative URIs to resolve.: <EVAWF1PackageVCV1> [com.hp.hpl.jena.rdf.model.impl.RDFDefaultErrorHandler]
20191206-07:58:30: [WARN]: (line 19 column 54): {W136} Relative URIs are not permitted in RDF: specifically <EVAWF1PackageVCV1> [com.hp.hpl.jena.rdf.model.impl.RDFDefaultErrorHandler]
20191206-07:58:30: [ERROR]: (line 43 column 50): {E211} Base URI is null, but there are relative URIs to resolve.: <EVAWF1PackageVCV1> [com.hp.hpl.jena.rdf.model.impl.RDFDefaultErrorHandler]
20191206-07:58:30: [WARN]: (line 43 column 50): {W136} Relative URIs are not permitted in RDF: specifically <EVAWF1PackageVCV1> [com.hp.hpl.jena.rdf.model.impl.RDFDefaultErrorHandler]
20191206-07:58:30: [ERROR]: (line 15 column 55): {E211} Base URI is null, but there are relative URIs to resolve.: <EVAWF1PackageVCV10> [com.hp.hpl.jena.rdf.model.impl.RDFDefaultErrorHandler]
20191206-07:58:30: [WARN]: (line 15 column 55): {W136} Relative URIs are not permitted in RDF: specifically <EVAWF1PackageVCV10> [com.hp.hpl.jena.rdf.model.impl.RDFDefaultErrorHandler]
20191206-07:58:30: [ERROR]: (line 33 column 51): {E211} Base URI is null, but there are relative URIs to resolve.: <EVAWF1PackageVCV10> [com.hp.hpl.jena.rdf.model.impl.RDFDefaultErrorHandler]
20191206-07:58:30: [WARN]: (line 33 column 51): {W136} Relative URIs are not permitted in RDF: specifically <EVAWF1PackageVCV10> [com.hp.hpl.jena.rdf.model.impl.RDFDefaultErrorHandler]
20191206-07:58:30: [ERROR]: (line 32 column 54): {E211} Base URI is null, but there are relative URIs to resolve.: <EVAWF1PackageVCV2> [com.hp.hpl.jena.rdf.model.impl.RDFDefaultErrorHandler]
20191206-07:58:30: [WARN]: (line 32 column 54): {W136} Relative URIs are not permitted in RDF: specifically <EVAWF1PackageVCV2> [com.hp.hpl.jena.rdf.model.impl.RDFDefaultErrorHandler]
20191206-07:58:30: [ERROR]: (line 44 column 50): {E211} Base URI is null, but there are relative URIs to resolve.: <EVAWF1PackageVCV2> [com.hp.hpl.jena.rdf.model.impl.RDFDefaultErrorHandler]
20191206-07:58:30: [WARN]: (line 44 column 50): {W136} Relative URIs are not permitted in RDF: specifically <EVAWF1PackageVCV2> [com.hp.hpl.jena.rdf.model.impl.RDFDefaultErrorHandler]
20191206-07:58:30: [ERROR]: (line 30 column 50): {E211} Base URI is null, but there are relative URIs to resolve.: <EVAWF1PackageVCV3> [com.hp.hpl.jena.rdf.model.impl.RDFDefaultErrorHandler]
20191206-07:58:30: [WARN]: (line 30 column 50): {W136} Relative URIs are not permitted in RDF: specifically <EVAWF1PackageVCV3> [com.hp.hpl.jena.rdf.model.impl.RDFDefaultErrorHandler]
20191206-07:58:30: [ERROR]: (line 47 column 54): {E211} Base URI is null, but there are relative URIs to resolve.: <EVAWF1PackageVCV3> [com.hp.hpl.jena.rdf.model.impl.RDFDefaultErrorHandler]
20191206-07:58:30: [WARN]: (line 47 column 54): {W136} Relative URIs are not permitted in RDF: specifically <EVAWF1PackageVCV3> [com.hp.hpl.jena.rdf.model.impl.RDFDefaultErrorHandler]
20191206-07:58:30: [ERROR]: (line 11 column 50): {E211} Base URI is null, but there are relative URIs to resolve.: <EVAWF1PackageVCV4> [com.hp.hpl.jena.rdf.model.impl.RDFDefaultErrorHandler]
20191206-07:58:30: [WARN]: (line 11 column 50): {W136} Relative URIs are not permitted in RDF: specifically <EVAWF1PackageVCV4> [com.hp.hpl.jena.rdf.model.impl.RDFDefaultErrorHandler]
20191206-07:58:30: [ERROR]: (line 27 column 54): {E211} Base URI is null, but there are relative URIs to resolve.: <EVAWF1PackageVCV4> [com.hp.hpl.jena.rdf.model.impl.RDFDefaultErrorHandler]
20191206-07:58:30: [WARN]: (line 27 column 54): {W136} Relative URIs are not permitted in RDF: specifically <EVAWF1PackageVCV4> [com.hp.hpl.jena.rdf.model.impl.RDFDefaultErrorHandler]
20191206-07:58:30: [ERROR]: (line 11 column 50): {E211} Base URI is null, but there are relative URIs to resolve.: <EVAWF1PackageVCV6> [com.hp.hpl.jena.rdf.model.impl.RDFDefaultErrorHandler]
20191206-07:58:30: [WARN]: (line 11 column 50): {W136} Relative URIs are not permitted in RDF: specifically <EVAWF1PackageVCV6> [com.hp.hpl.jena.rdf.model.impl.RDFDefaultErrorHandler]
20191206-07:58:30: [ERROR]: (line 20 column 54): {E211} Base URI is null, but there are relative URIs to resolve.: <EVAWF1PackageVCV6> [com.hp.hpl.jena.rdf.model.impl.RDFDefaultErrorHandler]
20191206-07:58:30: [WARN]: (line 20 column 54): {W136} Relative URIs are not permitted in RDF: specifically <EVAWF1PackageVCV6> [com.hp.hpl.jena.rdf.model.impl.RDFDefaultErrorHandler]
20191206-07:58:30: [ERROR]: (line 17 column 54): {E211} Base URI is null, but there are relative URIs to resolve.: <EVAWF1PackageVCV7> [com.hp.hpl.jena.rdf.model.impl.RDFDefaultErrorHandler]
20191206-07:58:30: [WARN]: (line 17 column 54): {W136} Relative URIs are not permitted in RDF: specifically <EVAWF1PackageVCV7> [com.hp.hpl.jena.rdf.model.impl.RDFDefaultErrorHandler]
20191206-07:58:30: [ERROR]: (line 20 column 50): {E211} Base URI is null, but there are relative URIs to resolve.: <EVAWF1PackageVCV7> [com.hp.hpl.jena.rdf.model.impl.RDFDefaultErrorHandler]
20191206-07:58:30: [WARN]: (line 20 column 50): {W136} Relative URIs are not permitted in RDF: specifically <EVAWF1PackageVCV7> [com.hp.hpl.jena.rdf.model.impl.RDFDefaultErrorHandler]
20191206-07:58:30: [ERROR]: (line 21 column 50): {E211} Base URI is null, but there are relative URIs to resolve.: <EVAWF1PackageVCV8> [com.hp.hpl.jena.rdf.model.impl.RDFDefaultErrorHandler]
20191206-07:58:30: [WARN]: (line 21 column 50): {W136} Relative URIs are not permitted in RDF: specifically <EVAWF1PackageVCV8> [com.hp.hpl.jena.rdf.model.impl.RDFDefaultErrorHandler]
20191206-07:58:30: [ERROR]: (line 39 column 54): {E211} Base URI is null, but there are relative URIs to resolve.: <EVAWF1PackageVCV8> [com.hp.hpl.jena.rdf.model.impl.RDFDefaultErrorHandler]
20191206-07:58:30: [WARN]: (line 39 column 54): {W136} Relative URIs are not permitted in RDF: specifically <EVAWF1PackageVCV8> [com.hp.hpl.jena.rdf.model.impl.RDFDefaultErrorHandler]
20191206-07:58:30: [ERROR]: (line 15 column 50): {E211} Base URI is null, but there are relative URIs to resolve.: <EVAWF1PackageVCV9> [com.hp.hpl.jena.rdf.model.impl.RDFDefaultErrorHandler]
20191206-07:58:30: [WARN]: (line 15 column 50): {W136} Relative URIs are not permitted in RDF: specifically <EVAWF1PackageVCV9> [com.hp.hpl.jena.rdf.model.impl.RDFDefaultErrorHandler]
20191206-07:58:30: [ERROR]: (line 38 column 54): {E211} Base URI is null, but there are relative URIs to resolve.: <EVAWF1PackageVCV9> [com.hp.hpl.jena.rdf.model.impl.RDFDefaultErrorHandler]
20191206-07:58:30: [WARN]: (line 38 column 54): {W136} Relative URIs are not permitted in RDF: specifically <EVAWF1PackageVCV9> [com.hp.hpl.jena.rdf.model.impl.RDFDefaultErrorHandler]
20191206-07:58:31: [ERROR]: (line 11 column 53): {E211} Base URI is null, but there are relative URIs to resolve.: <EVAWF1PaperPackage21> [com.hp.hpl.jena.rdf.model.impl.RDFDefaultErrorHandler]
20191206-07:58:31: [WARN]: (line 11 column 53): {W136} Relative URIs are not permitted in RDF: specifically <EVAWF1PaperPackage21> [com.hp.hpl.jena.rdf.model.impl.RDFDefaultErrorHandler]
20191206-07:58:31: [ERROR]: (line 32 column 57): {E211} Base URI is null, but there are relative URIs to resolve.: <EVAWF1PaperPackage21> [com.hp.hpl.jena.rdf.model.impl.RDFDefaultErrorHandler]
20191206-07:58:31: [WARN]: (line 32 column 57): {W136} Relative URIs are not permitted in RDF: specifically <EVAWF1PaperPackage21> [com.hp.hpl.jena.rdf.model.impl.RDFDefaultErrorHandler]
20191206-07:58:31: [ERROR]: (line 21 column 53): {E211} Base URI is null, but there are relative URIs to resolve.: <EVAWF1PaperPackage22> [com.hp.hpl.jena.rdf.model.impl.RDFDefaultErrorHandler]
20191206-07:58:31: [WARN]: (line 21 column 53): {W136} Relative URIs are not permitted in RDF: specifically <EVAWF1PaperPackage22> [com.hp.hpl.jena.rdf.model.impl.RDFDefaultErrorHandler]
20191206-07:58:31: [ERROR]: (line 47 column 57): {E211} Base URI is null, but there are relative URIs to resolve.: <EVAWF1PaperPackage22> [com.hp.hpl.jena.rdf.model.impl.RDFDefaultErrorHandler]
20191206-07:58:31: [WARN]: (line 47 column 57): {W136} Relative URIs are not permitted in RDF: specifically <EVAWF1PaperPackage22> [com.hp.hpl.jena.rdf.model.impl.RDFDefaultErrorHandler]
20191206-07:58:31: [ERROR]: (line 46 column 57): {E211} Base URI is null, but there are relative URIs to resolve.: <EVAWF1PaperPackage23> [com.hp.hpl.jena.rdf.model.impl.RDFDefaultErrorHandler]
20191206-07:58:31: [WARN]: (line 46 column 57): {W136} Relative URIs are not permitted in RDF: specifically <EVAWF1PaperPackage23> [com.hp.hpl.jena.rdf.model.impl.RDFDefaultErrorHandler]
20191206-07:58:31: [ERROR]: (line 48 column 53): {E211} Base URI is null, but there are relative URIs to resolve.: <EVAWF1PaperPackage23> [com.hp.hpl.jena.rdf.model.impl.RDFDefaultErrorHandler]
20191206-07:58:31: [WARN]: (line 48 column 53): {W136} Relative URIs are not permitted in RDF: specifically <EVAWF1PaperPackage23> [com.hp.hpl.jena.rdf.model.impl.RDFDefaultErrorHandler]
20191206-07:58:31: [ERROR]: (line 20 column 42): {E211} Base URI is null, but there are relative URIs to resolve.: <EVAWF1VCV> [com.hp.hpl.jena.rdf.model.impl.RDFDefaultErrorHandler]
20191206-07:58:31: [WARN]: (line 20 column 42): {W136} Relative URIs are not permitted in RDF: specifically <EVAWF1VCV> [com.hp.hpl.jena.rdf.model.impl.RDFDefaultErrorHandler]
20191206-07:58:31: [ERROR]: (line 29 column 46): {E211} Base URI is null, but there are relative URIs to resolve.: <EVAWF1VCV> [com.hp.hpl.jena.rdf.model.impl.RDFDefaultErrorHandler]
20191206-07:58:31: [WARN]: (line 29 column 46): {W136} Relative URIs are not permitted in RDF: specifically <EVAWF1VCV> [com.hp.hpl.jena.rdf.model.impl.RDFDefaultErrorHandler]
~~~ Context is solo MemberNode: https://mn-demo-6.test.dataone.org/knb/d1/mn
20191206-07:58:32: [ERROR]: (line 17 column 52): {E211} Base URI is null, but there are relative URIs to resolve.: <dakoop_test-PKG> [com.hp.hpl.jena.rdf.model.impl.RDFDefaultErrorHandler]
20191206-07:58:32: [WARN]: (line 17 column 52): {W136} Relative URIs are not permitted in RDF: specifically <dakoop_test-PKG> [com.hp.hpl.jena.rdf.model.impl.RDFDefaultErrorHandler]
20191206-07:58:32: [ERROR]: (line 48 column 48): {E211} Base URI is null, but there are relative URIs to resolve.: <dakoop_test-PKG> [com.hp.hpl.jena.rdf.model.impl.RDFDefaultErrorHandler]
20191206-07:58:32: [WARN]: (line 48 column 48): {W136} Relative URIs are not permitted in RDF: specifically <dakoop_test-PKG> [com.hp.hpl.jena.rdf.model.impl.RDFDefaultErrorHandler]
20191206-07:58:32: [ERROR]: (line 33 column 53): {E211} Base URI is null, but there are relative URIs to resolve.: <EVAWF1PackageVCV> [com.hp.hpl.jena.rdf.model.impl.RDFDefaultErrorHandler]
20191206-07:58:32: [WARN]: (line 33 column 53): {W136} Relative URIs are not permitted in RDF: specifically <EVAWF1PackageVCV> [com.hp.hpl.jena.rdf.model.impl.RDFDefaultErrorHandler]
20191206-07:58:32: [ERROR]: (line 48 column 49): {E211} Base URI is null, but there are relative URIs to resolve.: <EVAWF1PackageVCV> [com.hp.hpl.jena.rdf.model.impl.RDFDefaultErrorHandler]
20191206-07:58:32: [WARN]: (line 48 column 49): {W136} Relative URIs are not permitted in RDF: specifically <EVAWF1PackageVCV> [com.hp.hpl.jena.rdf.model.impl.RDFDefaultErrorHandler]
20191206-07:58:32: [ERROR]: (line 19 column 54): {E211} Base URI is null, but there are relative URIs to resolve.: <EVAWF1PackageVCV1> [com.hp.hpl.jena.rdf.model.impl.RDFDefaultErrorHandler]
20191206-07:58:32: [WARN]: (line 19 column 54): {W136} Relative URIs are not permitted in RDF: specifically <EVAWF1PackageVCV1> [com.hp.hpl.jena.rdf.model.impl.RDFDefaultErrorHandler]
20191206-07:58:32: [ERROR]: (line 43 column 50): {E211} Base URI is null, but there are relative URIs to resolve.: <EVAWF1PackageVCV1> [com.hp.hpl.jena.rdf.model.impl.RDFDefaultErrorHandler]
20191206-07:58:32: [WARN]: (line 43 column 50): {W136} Relative URIs are not permitted in RDF: specifically <EVAWF1PackageVCV1> [com.hp.hpl.jena.rdf.model.impl.RDFDefaultErrorHandler]
20191206-07:58:32: [ERROR]: (line 15 column 55): {E211} Base URI is null, but there are relative URIs to resolve.: <EVAWF1PackageVCV10> [com.hp.hpl.jena.rdf.model.impl.RDFDefaultErrorHandler]
20191206-07:58:32: [WARN]: (line 15 column 55): {W136} Relative URIs are not permitted in RDF: specifically <EVAWF1PackageVCV10> [com.hp.hpl.jena.rdf.model.impl.RDFDefaultErrorHandler]
20191206-07:58:32: [ERROR]: (line 33 column 51): {E211} Base URI is null, but there are relative URIs to resolve.: <EVAWF1PackageVCV10> [com.hp.hpl.jena.rdf.model.impl.RDFDefaultErrorHandler]
20191206-07:58:32: [WARN]: (line 33 column 51): {W136} Relative URIs are not permitted in RDF: specifically <EVAWF1PackageVCV10> [com.hp.hpl.jena.rdf.model.impl.RDFDefaultErrorHandler]
20191206-07:58:32: [ERROR]: (line 32 column 54): {E211} Base URI is null, but there are relative URIs to resolve.: <EVAWF1PackageVCV2> [com.hp.hpl.jena.rdf.model.impl.RDFDefaultErrorHandler]
20191206-07:58:32: [WARN]: (line 32 column 54): {W136} Relative URIs are not permitted in RDF: specifically <EVAWF1PackageVCV2> [com.hp.hpl.jena.rdf.model.impl.RDFDefaultErrorHandler]
20191206-07:58:32: [ERROR]: (line 44 column 50): {E211} Base URI is null, but there are relative URIs to resolve.: <EVAWF1PackageVCV2> [com.hp.hpl.jena.rdf.model.impl.RDFDefaultErrorHandler]
20191206-07:58:32: [WARN]: (line 44 column 50): {W136} Relative URIs are not permitted in RDF: specifically <EVAWF1PackageVCV2> [com.hp.hpl.jena.rdf.model.impl.RDFDefaultErrorHandler]
20191206-07:58:32: [ERROR]: (line 30 column 50): {E211} Base URI is null, but there are relative URIs to resolve.: <EVAWF1PackageVCV3> [com.hp.hpl.jena.rdf.model.impl.RDFDefaultErrorHandler]
20191206-07:58:32: [WARN]: (line 30 column 50): {W136} Relative URIs are not permitted in RDF: specifically <EVAWF1PackageVCV3> [com.hp.hpl.jena.rdf.model.impl.RDFDefaultErrorHandler]
20191206-07:58:32: [ERROR]: (line 47 column 54): {E211} Base URI is null, but there are relative URIs to resolve.: <EVAWF1PackageVCV3> [com.hp.hpl.jena.rdf.model.impl.RDFDefaultErrorHandler]
20191206-07:58:32: [WARN]: (line 47 column 54): {W136} Relative URIs are not permitted in RDF: specifically <EVAWF1PackageVCV3> [com.hp.hpl.jena.rdf.model.impl.RDFDefaultErrorHandler]
20191206-07:58:32: [ERROR]: (line 11 column 50): {E211} Base URI is null, but there are relative URIs to resolve.: <EVAWF1PackageVCV4> [com.hp.hpl.jena.rdf.model.impl.RDFDefaultErrorHandler]
20191206-07:58:32: [WARN]: (line 11 column 50): {W136} Relative URIs are not permitted in RDF: specifically <EVAWF1PackageVCV4> [com.hp.hpl.jena.rdf.model.impl.RDFDefaultErrorHandler]
20191206-07:58:32: [ERROR]: (line 27 column 54): {E211} Base URI is null, but there are relative URIs to resolve.: <EVAWF1PackageVCV4> [com.hp.hpl.jena.rdf.model.impl.RDFDefaultErrorHandler]
20191206-07:58:32: [WARN]: (line 27 column 54): {W136} Relative URIs are not permitted in RDF: specifically <EVAWF1PackageVCV4> [com.hp.hpl.jena.rdf.model.impl.RDFDefaultErrorHandler]
20191206-07:58:32: [ERROR]: (line 11 column 50): {E211} Base URI is null, but there are relative URIs to resolve.: <EVAWF1PackageVCV6> [com.hp.hpl.jena.rdf.model.impl.RDFDefaultErrorHandler]
20191206-07:58:32: [WARN]: (line 11 column 50): {W136} Relative URIs are not permitted in RDF: specifically <EVAWF1PackageVCV6> [com.hp.hpl.jena.rdf.model.impl.RDFDefaultErrorHandler]
20191206-07:58:32: [ERROR]: (line 20 column 54): {E211} Base URI is null, but there are relative URIs to resolve.: <EVAWF1PackageVCV6> [com.hp.hpl.jena.rdf.model.impl.RDFDefaultErrorHandler]
20191206-07:58:32: [WARN]: (line 20 column 54): {W136} Relative URIs are not permitted in RDF: specifically <EVAWF1PackageVCV6> [com.hp.hpl.jena.rdf.model.impl.RDFDefaultErrorHandler]
20191206-07:58:32: [ERROR]: (line 17 column 54): {E211} Base URI is null, but there are relative URIs to resolve.: <EVAWF1PackageVCV7> [com.hp.hpl.jena.rdf.model.impl.RDFDefaultErrorHandler]
20191206-07:58:32: [WARN]: (line 17 column 54): {W136} Relative URIs are not permitted in RDF: specifically <EVAWF1PackageVCV7> [com.hp.hpl.jena.rdf.model.impl.RDFDefaultErrorHandler]
20191206-07:58:32: [ERROR]: (line 20 column 50): {E211} Base URI is null, but there are relative URIs to resolve.: <EVAWF1PackageVCV7> [com.hp.hpl.jena.rdf.model.impl.RDFDefaultErrorHandler]
20191206-07:58:32: [WARN]: (line 20 column 50): {W136} Relative URIs are not permitted in RDF: specifically <EVAWF1PackageVCV7> [com.hp.hpl.jena.rdf.model.impl.RDFDefaultErrorHandler]
20191206-07:58:32: [ERROR]: (line 21 column 50): {E211} Base URI is null, but there are relative URIs to resolve.: <EVAWF1PackageVCV8> [com.hp.hpl.jena.rdf.model.impl.RDFDefaultErrorHandler]
20191206-07:58:32: [WARN]: (line 21 column 50): {W136} Relative URIs are not permitted in RDF: specifically <EVAWF1PackageVCV8> [com.hp.hpl.jena.rdf.model.impl.RDFDefaultErrorHandler]
20191206-07:58:32: [ERROR]: (line 39 column 54): {E211} Base URI is null, but there are relative URIs to resolve.: <EVAWF1PackageVCV8> [com.hp.hpl.jena.rdf.model.impl.RDFDefaultErrorHandler]
20191206-07:58:32: [WARN]: (line 39 column 54): {W136} Relative URIs are not permitted in RDF: specifically <EVAWF1PackageVCV8> [com.hp.hpl.jena.rdf.model.impl.RDFDefaultErrorHandler]
20191206-07:58:32: [ERROR]: (line 15 column 50): {E211} Base URI is null, but there are relative URIs to resolve.: <EVAWF1PackageVCV9> [com.hp.hpl.jena.rdf.model.impl.RDFDefaultErrorHandler]
20191206-07:58:32: [WARN]: (line 15 column 50): {W136} Relative URIs are not permitted in RDF: specifically <EVAWF1PackageVCV9> [com.hp.hpl.jena.rdf.model.impl.RDFDefaultErrorHandler]
20191206-07:58:32: [ERROR]: (line 38 column 54): {E211} Base URI is null, but there are relative URIs to resolve.: <EVAWF1PackageVCV9> [com.hp.hpl.jena.rdf.model.impl.RDFDefaultErrorHandler]
20191206-07:58:32: [WARN]: (line 38 column 54): {W136} Relative URIs are not permitted in RDF: specifically <EVAWF1PackageVCV9> [com.hp.hpl.jena.rdf.model.impl.RDFDefaultErrorHandler]
20191206-07:58:32: [ERROR]: (line 11 column 53): {E211} Base URI is null, but there are relative URIs to resolve.: <EVAWF1PaperPackage21> [com.hp.hpl.jena.rdf.model.impl.RDFDefaultErrorHandler]
20191206-07:58:32: [WARN]: (line 11 column 53): {W136} Relative URIs are not permitted in RDF: specifically <EVAWF1PaperPackage21> [com.hp.hpl.jena.rdf.model.impl.RDFDefaultErrorHandler]
20191206-07:58:32: [ERROR]: (line 32 column 57): {E211} Base URI is null, but there are relative URIs to resolve.: <EVAWF1PaperPackage21> [com.hp.hpl.jena.rdf.model.impl.RDFDefaultErrorHandler]
20191206-07:58:32: [WARN]: (line 32 column 57): {W136} Relative URIs are not permitted in RDF: specifically <EVAWF1PaperPackage21> [com.hp.hpl.jena.rdf.model.impl.RDFDefaultErrorHandler]
20191206-07:58:32: [ERROR]: (line 21 column 53): {E211} Base URI is null, but there are relative URIs to resolve.: <EVAWF1PaperPackage22> [com.hp.hpl.jena.rdf.model.impl.RDFDefaultErrorHandler]
20191206-07:58:32: [WARN]: (line 21 column 53): {W136} Relative URIs are not permitted in RDF: specifically <EVAWF1PaperPackage22> [com.hp.hpl.jena.rdf.model.impl.RDFDefaultErrorHandler]
20191206-07:58:32: [ERROR]: (line 47 column 57): {E211} Base URI is null, but there are relative URIs to resolve.: <EVAWF1PaperPackage22> [com.hp.hpl.jena.rdf.model.impl.RDFDefaultErrorHandler]
20191206-07:58:32: [WARN]: (line 47 column 57): {W136} Relative URIs are not permitted in RDF: specifically <EVAWF1PaperPackage22> [com.hp.hpl.jena.rdf.model.impl.RDFDefaultErrorHandler]
20191206-07:58:33: [ERROR]: (line 46 column 57): {E211} Base URI is null, but there are relative URIs to resolve.: <EVAWF1PaperPackage23> [com.hp.hpl.jena.rdf.model.impl.RDFDefaultErrorHandler]
20191206-07:58:33: [WARN]: (line 46 column 57): {W136} Relative URIs are not permitted in RDF: specifically <EVAWF1PaperPackage23> [com.hp.hpl.jena.rdf.model.impl.RDFDefaultErrorHandler]
20191206-07:58:33: [ERROR]: (line 48 column 53): {E211} Base URI is null, but there are relative URIs to resolve.: <EVAWF1PaperPackage23> [com.hp.hpl.jena.rdf.model.impl.RDFDefaultErrorHandler]
20191206-07:58:33: [WARN]: (line 48 column 53): {W136} Relative URIs are not permitted in RDF: specifically <EVAWF1PaperPackage23> [com.hp.hpl.jena.rdf.model.impl.RDFDefaultErrorHandler]
20191206-07:58:33: [ERROR]: (line 20 column 42): {E211} Base URI is null, but there are relative URIs to resolve.: <EVAWF1VCV> [com.hp.hpl.jena.rdf.model.impl.RDFDefaultErrorHandler]
20191206-07:58:33: [WARN]: (line 20 column 42): {W136} Relative URIs are not permitted in RDF: specifically <EVAWF1VCV> [com.hp.hpl.jena.rdf.model.impl.RDFDefaultErrorHandler]
20191206-07:58:33: [ERROR]: (line 29 column 46): {E211} Base URI is null, but there are relative URIs to resolve.: <EVAWF1VCV> [com.hp.hpl.jena.rdf.model.impl.RDFDefaultErrorHandler]
20191206-07:58:33: [WARN]: (line 29 column 46): {W136} Relative URIs are not permitted in RDF: specifically <EVAWF1VCV> [com.hp.hpl.jena.rdf.model.impl.RDFDefaultErrorHandler]
package: urn:uuid:29e8e14f-9f76-4b6d-b882-a6ca8996c84f
md: urn:uuid:b5473385-2f89-4067-a539-5a3f6f9dcfce
data: urn:uuid:3948db3a-fa77-4e54-b094-b60fc47f2d45
md: urn:uuid:d1eddb86-e8d6-4c47-addf-593f92c195e5
data: urn:uuid:2a6f1ea6-ba08-4ad5-92f8-47d03d0fa7c2
data: urn:uuid:9ab514e9-4678-4edd-b1cc-85097669a373
data: urn:uuid:23bcc964-2434-42f8-b72e-b2712cac4414
data: urn:uuid:7418a2e6-bb8f-4533-b796-3174004bf9c8
data: urn:uuid:8f94f0bb-0c04-43c3-9ee0-598ec84786cc
data: urn:uuid:b5473385-2f89-4067-a539-5a3f6f9dcfce
data: urn:uuid:af805d20-79f9-4a14-befa-57f31e656a7c
data: urn:uuid:d1eddb86-e8d6-4c47-addf-593f92c195e5
data: urn:uuid:7b0d97eb-ba1c-42b1-9612-bb06b7b0aa15
data: urn:uuid:3948db3a-fa77-4e54-b094-b60fc47f2d45
data: urn:uuid:75ca3c12-0189-44af-9e36-38f5c1183b62
~~~ Context is solo MemberNode: https://mn-demo-6.test.dataone.org/knb/d1/mn
<?xml version="1.0" encoding="UTF-8"?>
<error detailCode="0" errorCode="0" name="SynchronizationFailed" pid="TierTesting:mn-demo-6:Public_READ.14">
    <description>a message</description>
</error>

Tests run: 63, Failures: 41, Errors: 0, Skipped: 0, Time elapsed: 16.563 sec <<< FAILURE!
Running org.dataone.integration.it.MNodeTier0IT
~~~ Context is solo MemberNode: https://mn-demo-6.test.dataone.org/knb/d1/mn
Tests run: 1, Failures: 0, Errors: 0, Skipped: 0, Time elapsed: 0.057 sec
Running org.dataone.integration.it.MNodeTier4IT
~~~ Context is solo MemberNode: https://mn-demo-6.test.dataone.org/knb/d1/mn
~~~ Context is solo MemberNode: https://mn-demo-6.test.dataone.org/knb/d1/mn
~~~ Context is solo MemberNode: https://mn-demo-6.test.dataone.org/knb/d1/mn
Tests run: 4, Failures: 1, Errors: 0, Skipped: 1, Time elapsed: 0.129 sec <<< FAILURE!
Running org.dataone.integration.it.MNodeTier2IT
~~~ Context is solo MemberNode: https://mn-demo-6.test.dataone.org/knb/d1/mn
org.dataone.integration.ContextAwareTestCaseDataone$TestIterationEndingException: could not create a test object and listObjects() threw exception:: ServiceFailure :: class javax.net.ssl.SSLHandshakeException: Received fatal alert: certificate_expired
	at org.dataone.integration.ContextAwareTestCaseDataone.procurePublicReadableTestObject(ContextAwareTestCaseDataone.java:575)
	at org.dataone.integration.it.MNodeTier2IT.testIsAuthorized(MNodeTier2IT.java:110)
	at sun.reflect.NativeMethodAccessorImpl.invoke0(Native Method)
	at sun.reflect.NativeMethodAccessorImpl.invoke(NativeMethodAccessorImpl.java:62)
	at sun.reflect.DelegatingMethodAccessorImpl.invoke(DelegatingMethodAccessorImpl.java:43)
	at java.lang.reflect.Method.invoke(Method.java:498)
	at org.junit.runners.model.FrameworkMethod$1.runReflectiveCall(FrameworkMethod.java:44)
	at org.junit.internal.runners.model.ReflectiveCallable.run(ReflectiveCallable.java:15)
	at org.junit.runners.model.FrameworkMethod.invokeExplosively(FrameworkMethod.java:41)
	at org.junit.internal.runners.statements.InvokeMethod.evaluate(InvokeMethod.java:20)
	at org.junit.rules.Verifier$1.evaluate(Verifier.java:34)
	at org.junit.internal.runners.statements.RunBefores.evaluate(RunBefores.java:28)
	at org.junit.runners.BlockJUnit4ClassRunner.runChild(BlockJUnit4ClassRunner.java:76)
	at org.junit.runners.BlockJUnit4ClassRunner.runChild(BlockJUnit4ClassRunner.java:50)
	at org.junit.runners.ParentRunner$3.run(ParentRunner.java:193)
	at org.junit.runners.ParentRunner$1.schedule(ParentRunner.java:52)
	at org.junit.runners.ParentRunner.runChildren(ParentRunner.java:191)
	at org.junit.runners.ParentRunner.access$000(ParentRunner.java:42)
	at org.junit.runners.ParentRunner$2.evaluate(ParentRunner.java:184)
	at org.junit.runners.ParentRunner.run(ParentRunner.java:236)
	at org.apache.maven.surefire.junit4.JUnit4TestSet.execute(JUnit4TestSet.java:53)
	at org.apache.maven.surefire.junit4.JUnit4Provider.executeTestSet(JUnit4Provider.java:119)
	at org.apache.maven.surefire.junit4.JUnit4Provider.invoke(JUnit4Provider.java:101)
	at sun.reflect.NativeMethodAccessorImpl.invoke0(Native Method)
	at sun.reflect.NativeMethodAccessorImpl.invoke(NativeMethodAccessorImpl.java:62)
	at sun.reflect.DelegatingMethodAccessorImpl.invoke(DelegatingMethodAccessorImpl.java:43)
	at java.lang.reflect.Method.invoke(Method.java:498)
	at org.apache.maven.surefire.booter.ProviderFactory$ClassLoaderProxy.invoke(ProviderFactory.java:103)
	at com.sun.proxy.$Proxy0.invoke(Unknown Source)
	at org.apache.maven.surefire.booter.SurefireStarter.invokeProvider(SurefireStarter.java:150)
	at org.apache.maven.surefire.booter.SurefireStarter.runSuitesInProcess(SurefireStarter.java:91)
	at org.apache.maven.surefire.booter.ForkedBooter.main(ForkedBooter.java:69)
Caused by: org.dataone.service.exceptions.ServiceFailure: class javax.net.ssl.SSLHandshakeException: Received fatal alert: certificate_expired
	at sun.security.ssl.Alerts.getSSLException(Alerts.java:192)
	at sun.security.ssl.Alerts.getSSLException(Alerts.java:154)
	at sun.security.ssl.SSLSocketImpl.recvAlert(SSLSocketImpl.java:2020)
	at sun.security.ssl.SSLSocketImpl.readRecord(SSLSocketImpl.java:1127)
	at sun.security.ssl.SSLSocketImpl.waitForClose(SSLSocketImpl.java:1761)
	at sun.security.ssl.HandshakeOutStream.flush(HandshakeOutStream.java:124)
	at sun.security.ssl.Handshaker.sendChangeCipherSpec(Handshaker.java:1152)
	at sun.security.ssl.ClientHandshaker.sendChangeCipherAndFinish(ClientHandshaker.java:1280)
	at sun.security.ssl.ClientHandshaker.serverHelloDone(ClientHandshaker.java:1190)
	at sun.security.ssl.ClientHandshaker.processMessage(ClientHandshaker.java:369)
	at sun.security.ssl.Handshaker.processLoop(Handshaker.java:1037)
	at sun.security.ssl.Handshaker.process_record(Handshaker.java:965)
	at sun.security.ssl.SSLSocketImpl.readRecord(SSLSocketImpl.java:1064)
	at sun.security.ssl.SSLSocketImpl.performInitialHandshake(SSLSocketImpl.java:1367)
	at sun.security.ssl.SSLSocketImpl.startHandshake(SSLSocketImpl.java:1395)
	at sun.security.ssl.SSLSocketImpl.startHandshake(SSLSocketImpl.java:1379)
	at org.apache.http.conn.ssl.SSLSocketFactory.connectSocket(SSLSocketFactory.java:436)
	at org.apache.http.impl.conn.DefaultClientConnectionOperator.openConnection(DefaultClientConnectionOperator.java:180)
	at org.apache.http.impl.conn.ManagedClientConnectionImpl.open(ManagedClientConnectionImpl.java:294)
	at org.apache.http.impl.client.DefaultRequestDirector.tryConnect(DefaultRequestDirector.java:643)
	at org.apache.http.impl.client.DefaultRequestDirector.execute(DefaultRequestDirector.java:479)
	at org.apache.http.impl.client.AbstractHttpClient.execute(AbstractHttpClient.java:906)
	at org.apache.http.impl.client.AbstractHttpClient.execute(AbstractHttpClient.java:805)
	at org.apache.http.impl.client.AbstractHttpClient.execute(AbstractHttpClient.java:784)
	at org.dataone.client.RestClient.doRequest(RestClient.java:340)
	at org.dataone.client.RestClient.doRequestNoBody(RestClient.java:266)
	at org.dataone.client.RestClient.doGetRequest(RestClient.java:181)
	at org.dataone.client.D1RestClient.doGetRequest(D1RestClient.java:233)
	at org.dataone.client.D1RestClient.doGetRequest(D1RestClient.java:223)
	at org.dataone.client.D1Node.listObjects(D1Node.java:276)
	at org.dataone.client.MNode.listObjects(MNode.java:265)
	at org.dataone.client.D1Node.listObjects(D1Node.java:231)
	at org.dataone.client.MNode.listObjects(MNode.java:241)
	at org.dataone.integration.ContextAwareTestCaseDataone.procurePublicReadableTestObject(ContextAwareTestCaseDataone.java:518)
	... 31 more
Caused by: javax.net.ssl.SSLHandshakeException: Received fatal alert: certificate_expired
	... 65 more
~~~ Context is solo MemberNode: https://mn-demo-6.test.dataone.org/knb/d1/mn
org.dataone.integration.ContextAwareTestCaseDataone$TestIterationEndingException: could not create a test object and listObjects() threw exception:: ServiceFailure :: class javax.net.ssl.SSLHandshakeException: Received fatal alert: certificate_expired
	at org.dataone.integration.ContextAwareTestCaseDataone.procurePublicReadableTestObject(ContextAwareTestCaseDataone.java:575)
	at org.dataone.integration.it.MNodeTier2IT.testSystemMetadataChanged(MNodeTier2IT.java:156)
	at sun.reflect.NativeMethodAccessorImpl.invoke0(Native Method)
	at sun.reflect.NativeMethodAccessorImpl.invoke(NativeMethodAccessorImpl.java:62)
	at sun.reflect.DelegatingMethodAccessorImpl.invoke(DelegatingMethodAccessorImpl.java:43)
	at java.lang.reflect.Method.invoke(Method.java:498)
	at org.junit.runners.model.FrameworkMethod$1.runReflectiveCall(FrameworkMethod.java:44)
	at org.junit.internal.runners.model.ReflectiveCallable.run(ReflectiveCallable.java:15)
	at org.junit.runners.model.FrameworkMethod.invokeExplosively(FrameworkMethod.java:41)
	at org.junit.internal.runners.statements.InvokeMethod.evaluate(InvokeMethod.java:20)
	at org.junit.rules.Verifier$1.evaluate(Verifier.java:34)
	at org.junit.internal.runners.statements.RunBefores.evaluate(RunBefores.java:28)
	at org.junit.runners.BlockJUnit4ClassRunner.runChild(BlockJUnit4ClassRunner.java:76)
	at org.junit.runners.BlockJUnit4ClassRunner.runChild(BlockJUnit4ClassRunner.java:50)
	at org.junit.runners.ParentRunner$3.run(ParentRunner.java:193)
	at org.junit.runners.ParentRunner$1.schedule(ParentRunner.java:52)
	at org.junit.runners.ParentRunner.runChildren(ParentRunner.java:191)
	at org.junit.runners.ParentRunner.access$000(ParentRunner.java:42)
	at org.junit.runners.ParentRunner$2.evaluate(ParentRunner.java:184)
	at org.junit.runners.ParentRunner.run(ParentRunner.java:236)
	at org.apache.maven.surefire.junit4.JUnit4TestSet.execute(JUnit4TestSet.java:53)
	at org.apache.maven.surefire.junit4.JUnit4Provider.executeTestSet(JUnit4Provider.java:119)
	at org.apache.maven.surefire.junit4.JUnit4Provider.invoke(JUnit4Provider.java:101)
	at sun.reflect.NativeMethodAccessorImpl.invoke0(Native Method)
	at sun.reflect.NativeMethodAccessorImpl.invoke(NativeMethodAccessorImpl.java:62)
	at sun.reflect.DelegatingMethodAccessorImpl.invoke(DelegatingMethodAccessorImpl.java:43)
	at java.lang.reflect.Method.invoke(Method.java:498)
	at org.apache.maven.surefire.booter.ProviderFactory$ClassLoaderProxy.invoke(ProviderFactory.java:103)
	at com.sun.proxy.$Proxy0.invoke(Unknown Source)
	at org.apache.maven.surefire.booter.SurefireStarter.invokeProvider(SurefireStarter.java:150)
	at org.apache.maven.surefire.booter.SurefireStarter.runSuitesInProcess(SurefireStarter.java:91)
	at org.apache.maven.surefire.booter.ForkedBooter.main(ForkedBooter.java:69)
Caused by: org.dataone.service.exceptions.ServiceFailure: class javax.net.ssl.SSLHandshakeException: Received fatal alert: certificate_expired
	at sun.security.ssl.Alerts.getSSLException(Alerts.java:192)
	at sun.security.ssl.Alerts.getSSLException(Alerts.java:154)
	at sun.security.ssl.SSLSocketImpl.recvAlert(SSLSocketImpl.java:2020)
	at sun.security.ssl.SSLSocketImpl.readRecord(SSLSocketImpl.java:1127)
	at sun.security.ssl.SSLSocketImpl.waitForClose(SSLSocketImpl.java:1761)
	at sun.security.ssl.HandshakeOutStream.flush(HandshakeOutStream.java:124)
	at sun.security.ssl.Handshaker.sendChangeCipherSpec(Handshaker.java:1152)
	at sun.security.ssl.ClientHandshaker.sendChangeCipherAndFinish(ClientHandshaker.java:1280)
	at sun.security.ssl.ClientHandshaker.serverHelloDone(ClientHandshaker.java:1190)
	at sun.security.ssl.ClientHandshaker.processMessage(ClientHandshaker.java:369)
	at sun.security.ssl.Handshaker.processLoop(Handshaker.java:1037)
	at sun.security.ssl.Handshaker.process_record(Handshaker.java:965)
	at sun.security.ssl.SSLSocketImpl.readRecord(SSLSocketImpl.java:1064)
	at sun.security.ssl.SSLSocketImpl.performInitialHandshake(SSLSocketImpl.java:1367)
	at sun.security.ssl.SSLSocketImpl.startHandshake(SSLSocketImpl.java:1395)
	at sun.security.ssl.SSLSocketImpl.startHandshake(SSLSocketImpl.java:1379)
	at org.apache.http.conn.ssl.SSLSocketFactory.connectSocket(SSLSocketFactory.java:436)
	at org.apache.http.impl.conn.DefaultClientConnectionOperator.openConnection(DefaultClientConnectionOperator.java:180)
	at org.apache.http.impl.conn.ManagedClientConnectionImpl.open(ManagedClientConnectionImpl.java:294)
	at org.apache.http.impl.client.DefaultRequestDirector.tryConnect(DefaultRequestDirector.java:643)
	at org.apache.http.impl.client.DefaultRequestDirector.execute(DefaultRequestDirector.java:479)
	at org.apache.http.impl.client.AbstractHttpClient.execute(AbstractHttpClient.java:906)
	at org.apache.http.impl.client.AbstractHttpClient.execute(AbstractHttpClient.java:805)
	at org.apache.http.impl.client.AbstractHttpClient.execute(AbstractHttpClient.java:784)
	at org.dataone.client.RestClient.doRequest(RestClient.java:340)
	at org.dataone.client.RestClient.doRequestNoBody(RestClient.java:266)
	at org.dataone.client.RestClient.doGetRequest(RestClient.java:181)
	at org.dataone.client.D1RestClient.doGetRequest(D1RestClient.java:233)
	at org.dataone.client.D1RestClient.doGetRequest(D1RestClient.java:223)
	at org.dataone.client.D1Node.listObjects(D1Node.java:276)
	at org.dataone.client.MNode.listObjects(MNode.java:265)
	at org.dataone.client.D1Node.listObjects(D1Node.java:231)
	at org.dataone.client.MNode.listObjects(MNode.java:241)
	at org.dataone.integration.ContextAwareTestCaseDataone.procurePublicReadableTestObject(ContextAwareTestCaseDataone.java:518)
	... 31 more
Caused by: javax.net.ssl.SSLHandshakeException: Received fatal alert: certificate_expired
	... 65 more
~~~ Context is solo MemberNode: https://mn-demo-6.test.dataone.org/knb/d1/mn
~~~ Context is solo MemberNode: https://mn-demo-6.test.dataone.org/knb/d1/mn
~~~ Context is solo MemberNode: https://mn-demo-6.test.dataone.org/knb/d1/mn
~~~ Context is solo MemberNode: https://mn-demo-6.test.dataone.org/knb/d1/mn
~~~ Context is solo MemberNode: https://mn-demo-6.test.dataone.org/knb/d1/mn
~~~ Context is solo MemberNode: https://mn-demo-6.test.dataone.org/knb/d1/mn
~~~ Context is solo MemberNode: https://mn-demo-6.test.dataone.org/knb/d1/mn
~~~ Context is solo MemberNode: https://mn-demo-6.test.dataone.org/knb/d1/mn
~~~ Context is solo MemberNode: https://mn-demo-6.test.dataone.org/knb/d1/mn
~~~ Context is solo MemberNode: https://mn-demo-6.test.dataone.org/knb/d1/mn
~~~ Context is solo MemberNode: https://mn-demo-6.test.dataone.org/knb/d1/mn
~~~ Context is solo MemberNode: https://mn-demo-6.test.dataone.org/knb/d1/mn
~~~ Context is solo MemberNode: https://mn-demo-6.test.dataone.org/knb/d1/mn
~~~ Context is solo MemberNode: https://mn-demo-6.test.dataone.org/knb/d1/mn
~~~ Context is solo MemberNode: https://mn-demo-6.test.dataone.org/knb/d1/mn
~~~ Context is solo MemberNode: https://mn-demo-6.test.dataone.org/knb/d1/mn
Tests run: 19, Failures: 16, Errors: 0, Skipped: 1, Time elapsed: 0.586 sec <<< FAILURE!
Running org.dataone.integration.it.MNodeTier3IT
~~~ Context is solo MemberNode: https://mn-demo-6.test.dataone.org/knb/d1/mn
~~~ Context is solo MemberNode: https://mn-demo-6.test.dataone.org/knb/d1/mn
~~~ Context is solo MemberNode: https://mn-demo-6.test.dataone.org/knb/d1/mn
~~~ Context is solo MemberNode: https://mn-demo-6.test.dataone.org/knb/d1/mn
~~~ Context is solo MemberNode: https://mn-demo-6.test.dataone.org/knb/d1/mn
~~~ Context is solo MemberNode: https://mn-demo-6.test.dataone.org/knb/d1/mn
~~~ Context is solo MemberNode: https://mn-demo-6.test.dataone.org/knb/d1/mn
~~~ Context is solo MemberNode: https://mn-demo-6.test.dataone.org/knb/d1/mn
~~~ Context is solo MemberNode: https://mn-demo-6.test.dataone.org/knb/d1/mn
~~~ Context is solo MemberNode: https://mn-demo-6.test.dataone.org/knb/d1/mn
~~~ Context is solo MemberNode: https://mn-demo-6.test.dataone.org/knb/d1/mn
Tests run: 12, Failures: 10, Errors: 0, Skipped: 1, Time elapsed: 0.366 sec <<< FAILURE!
Running org.dataone.integration.it.MNodeTier1SlowIT
~~~ Context is solo MemberNode: https://mn-demo-6.test.dataone.org/knb/d1/mn
~~~ Context is solo MemberNode: https://mn-demo-6.test.dataone.org/knb/d1/mn
~~~ Context is solo MemberNode: https://mn-demo-6.test.dataone.org/knb/d1/mn
~~~ Context is solo MemberNode: https://mn-demo-6.test.dataone.org/knb/d1/mn
~~~ Context is solo MemberNode: https://mn-demo-6.test.dataone.org/knb/d1/mn
~~~ Context is solo MemberNode: https://mn-demo-6.test.dataone.org/knb/d1/mn
Tests run: 6, Failures: 6, Errors: 0, Skipped: 0, Time elapsed: 0.45 sec <<< FAILURE!

Results :

Failed tests: 
  testGetReplica_PublicObject(org.dataone.integration.it.MNodeTier1IT): Should be able to retrieve a public object (as subject urn:node:cnStageUNM1).  If the node is checking the client subject against the CN for all getReplica requests, and the node is not registered to an environment, this failure can be ignored.  Got:InvalidToken: 2183:: No session was provided.  [for host GET https://mn-demo-6.test.dataone.org/knb/d1/mn/v1/replica/TierTesting:mn-demo-6:Public_READ.14 ]
  testMetadata_Checksum_Size_Consistency(org.dataone.integration.it.MNodeTier1IT): ServiceFailure: 1090:: Could not get CNode from the underlying context (D1Client.CN_URL)  [for host GET https://mn-demo-6.test.dataone.org/knb/d1/mn/v1/meta/john.15271.1 ]
  testResourceMapParsing(org.dataone.integration.it.MNodeTier1IT): Should be able to parse the serialized resourceMap.  Got exception: OREException: Null resource map returned from OREParser (format: RDF/XML)at line number 351  [for host GET https://mn-demo-6.test.dataone.org/knb/d1/mn/v1/object/dakoop_test-PKG ]
  testResourceMapParsing(org.dataone.integration.it.MNodeTier1IT): Should be able to parse the serialized resourceMap.  Got exception: OREException: Null resource map returned from OREParser (format: RDF/XML)at line number 351  [for host GET https://mn-demo-6.test.dataone.org/knb/d1/mn/v1/object/EVAWF1PackageVCV ]
  testResourceMapParsing(org.dataone.integration.it.MNodeTier1IT): Should be able to parse the serialized resourceMap.  Got exception: OREException: Null resource map returned from OREParser (format: RDF/XML)at line number 351  [for host GET https://mn-demo-6.test.dataone.org/knb/d1/mn/v1/object/EVAWF1PackageVCV1 ]
  testResourceMapParsing(org.dataone.integration.it.MNodeTier1IT): Should be able to parse the serialized resourceMap.  Got exception: OREException: Null resource map returned from OREParser (format: RDF/XML)at line number 351  [for host GET https://mn-demo-6.test.dataone.org/knb/d1/mn/v1/object/EVAWF1PackageVCV10 ]
  testResourceMapParsing(org.dataone.integration.it.MNodeTier1IT): Should be able to parse the serialized resourceMap.  Got exception: OREException: Null resource map returned from OREParser (format: RDF/XML)at line number 351  [for host GET https://mn-demo-6.test.dataone.org/knb/d1/mn/v1/object/EVAWF1PackageVCV2 ]
  testResourceMapParsing(org.dataone.integration.it.MNodeTier1IT): Should be able to parse the serialized resourceMap.  Got exception: OREException: Null resource map returned from OREParser (format: RDF/XML)at line number 351  [for host GET https://mn-demo-6.test.dataone.org/knb/d1/mn/v1/object/EVAWF1PackageVCV3 ]
  testResourceMapParsing(org.dataone.integration.it.MNodeTier1IT): Should be able to parse the serialized resourceMap.  Got exception: OREException: Null resource map returned from OREParser (format: RDF/XML)at line number 351  [for host GET https://mn-demo-6.test.dataone.org/knb/d1/mn/v1/object/EVAWF1PackageVCV4 ]
  testResourceMapParsing(org.dataone.integration.it.MNodeTier1IT): Should be able to parse the serialized resourceMap.  Got exception: OREException: Null resource map returned from OREParser (format: RDF/XML)at line number 351  [for host GET https://mn-demo-6.test.dataone.org/knb/d1/mn/v1/object/EVAWF1PackageVCV6 ]
  testResourceMapParsing(org.dataone.integration.it.MNodeTier1IT): Should be able to parse the serialized resourceMap.  Got exception: OREException: Null resource map returned from OREParser (format: RDF/XML)at line number 351  [for host GET https://mn-demo-6.test.dataone.org/knb/d1/mn/v1/object/EVAWF1PackageVCV7 ]
  testResourceMapParsing(org.dataone.integration.it.MNodeTier1IT): Should be able to parse the serialized resourceMap.  Got exception: OREException: Null resource map returned from OREParser (format: RDF/XML)at line number 351  [for host GET https://mn-demo-6.test.dataone.org/knb/d1/mn/v1/object/EVAWF1PackageVCV8 ]
  testResourceMapParsing(org.dataone.integration.it.MNodeTier1IT): Should be able to parse the serialized resourceMap.  Got exception: OREException: Null resource map returned from OREParser (format: RDF/XML)at line number 351  [for host GET https://mn-demo-6.test.dataone.org/knb/d1/mn/v1/object/EVAWF1PackageVCV9 ]
  testResourceMapParsing(org.dataone.integration.it.MNodeTier1IT): Should be able to parse the serialized resourceMap.  Got exception: NotFound: The object specified by EVAWF1PaperPackage19 does not exist at this node. The object with the PID has been deleted from the node.at line number 620  [for host GET https://mn-demo-6.test.dataone.org/knb/d1/mn/v1/object/EVAWF1PaperPackage19 ]
  testResourceMapParsing(org.dataone.integration.it.MNodeTier1IT): Should be able to parse the serialized resourceMap.  Got exception: OREException: Null resource map returned from OREParser (format: RDF/XML)at line number 351  [for host GET https://mn-demo-6.test.dataone.org/knb/d1/mn/v1/object/EVAWF1PaperPackage21 ]
  testResourceMapParsing(org.dataone.integration.it.MNodeTier1IT): Should be able to parse the serialized resourceMap.  Got exception: OREException: Null resource map returned from OREParser (format: RDF/XML)at line number 351  [for host GET https://mn-demo-6.test.dataone.org/knb/d1/mn/v1/object/EVAWF1PaperPackage22 ]
  testResourceMapParsing(org.dataone.integration.it.MNodeTier1IT): Should be able to parse the serialized resourceMap.  Got exception: OREException: Null resource map returned from OREParser (format: RDF/XML)at line number 351  [for host GET https://mn-demo-6.test.dataone.org/knb/d1/mn/v1/object/EVAWF1PaperPackage23 ]
  testResourceMapParsing(org.dataone.integration.it.MNodeTier1IT): Should be able to parse the serialized resourceMap.  Got exception: OREException: Null resource map returned from OREParser (format: RDF/XML)at line number 351  [for host GET https://mn-demo-6.test.dataone.org/knb/d1/mn/v1/object/EVAWF1VCV ]
  testResourceMapParsing(org.dataone.integration.it.MNodeTier1IT): Should be able to parse the serialized resourceMap.  Got exception: ServiceFailure: Could not get CNode from the underlying context (D1Client.CN_URL)at line number 624  [for host GET https://mn-demo-6.test.dataone.org/knb/d1/mn/v1/object/ore:%2F%2FtestGetPackage_resourceMap_2015161111139160 ]
  testResourceMapParsing(org.dataone.integration.it.MNodeTier1IT): Should be able to parse the serialized resourceMap.  Got exception: ServiceFailure: Could not get CNode from the underlying context (D1Client.CN_URL)at line number 624  [for host GET https://mn-demo-6.test.dataone.org/knb/d1/mn/v1/object/ore:%2F%2FtestGetPackage_resourceMap_2015161112045814 ]
  testResourceMapParsing(org.dataone.integration.it.MNodeTier1IT): Should be able to parse the serialized resourceMap.  Got exception: ServiceFailure: Could not get CNode from the underlying context (D1Client.CN_URL)at line number 624  [for host GET https://mn-demo-6.test.dataone.org/knb/d1/mn/v1/object/ore:%2F%2FtestGetPackage_resourceMap_2015161112145629 ]
  testResourceMap_ResolveURL(org.dataone.integration.it.MNodeTier1IT): Should be able to parse the serialized resourceMap.  Got exception: OREException: Null resource map returned from OREParser (format: RDF/XML)  [for host GET https://mn-demo-6.test.dataone.org/knb/d1/mn/v1/object/dakoop_test-PKG ]
  testResourceMap_ResolveURL(org.dataone.integration.it.MNodeTier1IT): Should be able to parse the serialized resourceMap.  Got exception: OREException: Null resource map returned from OREParser (format: RDF/XML)  [for host GET https://mn-demo-6.test.dataone.org/knb/d1/mn/v1/object/EVAWF1PackageVCV ]
  testResourceMap_ResolveURL(org.dataone.integration.it.MNodeTier1IT): Should be able to parse the serialized resourceMap.  Got exception: OREException: Null resource map returned from OREParser (format: RDF/XML)  [for host GET https://mn-demo-6.test.dataone.org/knb/d1/mn/v1/object/EVAWF1PackageVCV1 ]
  testResourceMap_ResolveURL(org.dataone.integration.it.MNodeTier1IT): Should be able to parse the serialized resourceMap.  Got exception: OREException: Null resource map returned from OREParser (format: RDF/XML)  [for host GET https://mn-demo-6.test.dataone.org/knb/d1/mn/v1/object/EVAWF1PackageVCV10 ]
  testResourceMap_ResolveURL(org.dataone.integration.it.MNodeTier1IT): Should be able to parse the serialized resourceMap.  Got exception: OREException: Null resource map returned from OREParser (format: RDF/XML)  [for host GET https://mn-demo-6.test.dataone.org/knb/d1/mn/v1/object/EVAWF1PackageVCV2 ]
  testResourceMap_ResolveURL(org.dataone.integration.it.MNodeTier1IT): Should be able to parse the serialized resourceMap.  Got exception: OREException: Null resource map returned from OREParser (format: RDF/XML)  [for host GET https://mn-demo-6.test.dataone.org/knb/d1/mn/v1/object/EVAWF1PackageVCV3 ]
  testResourceMap_ResolveURL(org.dataone.integration.it.MNodeTier1IT): Should be able to parse the serialized resourceMap.  Got exception: OREException: Null resource map returned from OREParser (format: RDF/XML)  [for host GET https://mn-demo-6.test.dataone.org/knb/d1/mn/v1/object/EVAWF1PackageVCV4 ]
  testResourceMap_ResolveURL(org.dataone.integration.it.MNodeTier1IT): Should be able to parse the serialized resourceMap.  Got exception: OREException: Null resource map returned from OREParser (format: RDF/XML)  [for host GET https://mn-demo-6.test.dataone.org/knb/d1/mn/v1/object/EVAWF1PackageVCV6 ]
  testResourceMap_ResolveURL(org.dataone.integration.it.MNodeTier1IT): Should be able to parse the serialized resourceMap.  Got exception: OREException: Null resource map returned from OREParser (format: RDF/XML)  [for host GET https://mn-demo-6.test.dataone.org/knb/d1/mn/v1/object/EVAWF1PackageVCV7 ]
  testResourceMap_ResolveURL(org.dataone.integration.it.MNodeTier1IT): Should be able to parse the serialized resourceMap.  Got exception: OREException: Null resource map returned from OREParser (format: RDF/XML)  [for host GET https://mn-demo-6.test.dataone.org/knb/d1/mn/v1/object/EVAWF1PackageVCV8 ]
  testResourceMap_ResolveURL(org.dataone.integration.it.MNodeTier1IT): Should be able to parse the serialized resourceMap.  Got exception: OREException: Null resource map returned from OREParser (format: RDF/XML)  [for host GET https://mn-demo-6.test.dataone.org/knb/d1/mn/v1/object/EVAWF1PackageVCV9 ]
  testResourceMap_ResolveURL(org.dataone.integration.it.MNodeTier1IT): Should be able to parse the serialized resourceMap.  Got exception: NotFound: The object specified by EVAWF1PaperPackage19 does not exist at this node. The object with the PID has been deleted from the node.  [for host GET https://mn-demo-6.test.dataone.org/knb/d1/mn/v1/object/EVAWF1PaperPackage19 ]
  testResourceMap_ResolveURL(org.dataone.integration.it.MNodeTier1IT): Should be able to parse the serialized resourceMap.  Got exception: OREException: Null resource map returned from OREParser (format: RDF/XML)  [for host GET https://mn-demo-6.test.dataone.org/knb/d1/mn/v1/object/EVAWF1PaperPackage21 ]
  testResourceMap_ResolveURL(org.dataone.integration.it.MNodeTier1IT): Should be able to parse the serialized resourceMap.  Got exception: OREException: Null resource map returned from OREParser (format: RDF/XML)  [for host GET https://mn-demo-6.test.dataone.org/knb/d1/mn/v1/object/EVAWF1PaperPackage22 ]
  testResourceMap_ResolveURL(org.dataone.integration.it.MNodeTier1IT): Should be able to parse the serialized resourceMap.  Got exception: OREException: Null resource map returned from OREParser (format: RDF/XML)  [for host GET https://mn-demo-6.test.dataone.org/knb/d1/mn/v1/object/EVAWF1PaperPackage23 ]
  testResourceMap_ResolveURL(org.dataone.integration.it.MNodeTier1IT): Should be able to parse the serialized resourceMap.  Got exception: OREException: Null resource map returned from OREParser (format: RDF/XML)  [for host GET https://mn-demo-6.test.dataone.org/knb/d1/mn/v1/object/EVAWF1VCV ]
  testResourceMap_ResolveURL(org.dataone.integration.it.MNodeTier1IT): Should be able to parse the serialized resourceMap.  Got exception: ServiceFailure: Could not get CNode from the underlying context (D1Client.CN_URL)  [for host GET https://mn-demo-6.test.dataone.org/knb/d1/mn/v1/object/ore:%2F%2FtestGetPackage_resourceMap_2015161111139160 ]
  testResourceMap_ResolveURL(org.dataone.integration.it.MNodeTier1IT): Should be able to parse the serialized resourceMap.  Got exception: ServiceFailure: Could not get CNode from the underlying context (D1Client.CN_URL)  [for host GET https://mn-demo-6.test.dataone.org/knb/d1/mn/v1/object/ore:%2F%2FtestGetPackage_resourceMap_2015161112045814 ]
  testResourceMap_ResolveURL(org.dataone.integration.it.MNodeTier1IT): Should be able to parse the serialized resourceMap.  Got exception: ServiceFailure: Could not get CNode from the underlying context (D1Client.CN_URL)  [for host GET https://mn-demo-6.test.dataone.org/knb/d1/mn/v1/object/ore:%2F%2FtestGetPackage_resourceMap_2015161112145629 ]
  testSynchronizationFailed_NoCert(org.dataone.integration.it.MNodeTier1IT): ServiceFailure:: 2161 Could not get CNode from the underlying context (D1Client.CN_URL)  [for host POST https://mn-demo-6.test.dataone.org/knb/d1/mn/v1/error; MMP message has: FilePart:message = /tmp/mmp.output.3674421777471904965.tmp (198 bytes);  ]
  testReplicate_ValidCertificate_NotCN(org.dataone.integration.it.MNodeTier4IT): Expected NotAuthorized, got: ServiceFailure: 0 Client_Error: class javax.net.ssl.SSLHandshakeException: Received fatal alert: certificate_expired  [for host POST https://mn-demo-6.test.dataone.org/knb/d1/mn/v1/replicate; MMP message has: ParamPart:sourceNode = bad; FilePart:sysmeta = /tmp/mmp.output.4863558205016955495.tmp (729 bytes);  ]
  testIsAuthorized(org.dataone.integration.it.MNodeTier2IT): org.dataone.integration.ContextAwareTestCaseDataone$TestIterationEndingException: could not create a test object and listObjects() threw exception:: ServiceFailure :: class javax.net.ssl.SSLHandshakeException: Received fatal alert: certificate_expired  [for host https://mn-demo-6.test.dataone.org/knb/d1/mn/v1 ]
  testSystemMetadataChanged(org.dataone.integration.it.MNodeTier2IT): org.dataone.integration.ContextAwareTestCaseDataone$TestIterationEndingException: could not create a test object and listObjects() threw exception:: ServiceFailure :: class javax.net.ssl.SSLHandshakeException: Received fatal alert: certificate_expired  [for host https://mn-demo-6.test.dataone.org/knb/d1/mn/v1 ]
  testSystemMetadataChanged_authenticatedITKuser(org.dataone.integration.it.MNodeTier2IT): Expect an ITK client to receive NotAuthorized, got: ServiceFailure: 0 Client_Error: class javax.net.ssl.SSLHandshakeException: Received fatal alert: certificate_expired  [for host POST https://mn-demo-6.test.dataone.org/knb/d1/mn/v1/object; MMP message has: ParamPart:pid = mNodeTier32019339235833855; FilePart:object = /tmp/mmp.output.3715876804187356990.tmp (684336 bytes); FilePart:sysmeta = /tmp/mmp.output.2737774807882042593.tmp (729 bytes);  ]
  testIsAuthorized_NullPolicy_testPerson_is_RightsHolder(org.dataone.integration.it.MNodeTier2IT): ServiceFailure: 0 Client_Error: class javax.net.ssl.SSLHandshakeException: Received fatal alert: certificate_expired  [for host GET https://mn-demo-6.test.dataone.org/knb/d1/mn/v1/meta/TierTesting:mn-demo-6:RightsHolder_testPerson.14 ]
  testIsAuthorized_NullPolicy_testGroup_is_RightsHolder(org.dataone.integration.it.MNodeTier2IT): ServiceFailure: 0 Client_Error: class javax.net.ssl.SSLHandshakeException: Received fatal alert: certificate_expired  [for host GET https://mn-demo-6.test.dataone.org/knb/d1/mn/v1/meta/TierTesting:mn-demo-6:RightsHolder_testGroup.14 ]
  testIsAuthorized_AccessPolicy_is_Public_can_Read(org.dataone.integration.it.MNodeTier2IT): ServiceFailure: 0 Client_Error: class javax.net.ssl.SSLHandshakeException: Received fatal alert: certificate_expired  [for host GET https://mn-demo-6.test.dataone.org/knb/d1/mn/v1/meta/TierTesting:mn-demo-6:Public_READ.14 ]
  testIsAuthorized_AccessPolicy_is_AuthenticatedUser_can_Read(org.dataone.integration.it.MNodeTier2IT): ServiceFailure: 0 Client_Error: class javax.net.ssl.SSLHandshakeException: Received fatal alert: certificate_expired  [for host GET https://mn-demo-6.test.dataone.org/knb/d1/mn/v1/meta/TierTesting:mn-demo-6:Authenticated_READ.14 ]
  testIsAuthorized_AccessPolicy_is_VerifiedUser_can_Read(org.dataone.integration.it.MNodeTier2IT): ServiceFailure: 0 Client_Error: class javax.net.ssl.SSLHandshakeException: Received fatal alert: certificate_expired  [for host GET https://mn-demo-6.test.dataone.org/knb/d1/mn/v1/meta/TierTesting:mn-demo-6:Verified_READ.14 ]
  testIsAuthorized_AccessPolicy_is_testPerson_can_Read(org.dataone.integration.it.MNodeTier2IT): ServiceFailure: 0 Client_Error: class javax.net.ssl.SSLHandshakeException: Received fatal alert: certificate_expired  [for host GET https://mn-demo-6.test.dataone.org/knb/d1/mn/v1/meta/TierTesting:mn-demo-6:testPerson_READ.14 ]
  testIsAuthorized_AccessPolicy_is_testPerson_can_Write(org.dataone.integration.it.MNodeTier2IT): ServiceFailure: 0 Client_Error: class javax.net.ssl.SSLHandshakeException: Received fatal alert: certificate_expired  [for host GET https://mn-demo-6.test.dataone.org/knb/d1/mn/v1/meta/TierTesting:mn-demo-6:testPerson_WRITE.14 ]
  testIsAuthorized_AccessPolicy_is_testPerson_can_ChangePerm(org.dataone.integration.it.MNodeTier2IT): ServiceFailure: 0 Client_Error: class javax.net.ssl.SSLHandshakeException: Received fatal alert: certificate_expired  [for host GET https://mn-demo-6.test.dataone.org/knb/d1/mn/v1/meta/TierTesting:mn-demo-6:testPerson_CHANGE.14 ]
  testIsAuthorized_AccessPolicy_is_testGroup_can_Read(org.dataone.integration.it.MNodeTier2IT): ServiceFailure: 0 Client_Error: class javax.net.ssl.SSLHandshakeException: Received fatal alert: certificate_expired  [for host GET https://mn-demo-6.test.dataone.org/knb/d1/mn/v1/meta/TierTesting:mn-demo-6:testGroup_READ.14 ]
  testIsAuthorized_AccessPolicy_is_testGroup_can_Write(org.dataone.integration.it.MNodeTier2IT): ServiceFailure: 0 Client_Error: class javax.net.ssl.SSLHandshakeException: Received fatal alert: certificate_expired  [for host GET https://mn-demo-6.test.dataone.org/knb/d1/mn/v1/meta/TierTesting:mn-demo-6:testGroup_WRITE.14 ]
  testIsAuthorized_AccessPolicy_is_testGroup_can_ChangePerm(org.dataone.integration.it.MNodeTier2IT): ServiceFailure: 0 Client_Error: class javax.net.ssl.SSLHandshakeException: Received fatal alert: certificate_expired  [for host GET https://mn-demo-6.test.dataone.org/knb/d1/mn/v1/meta/TierTesting:mn-demo-6:testGroup_CHANGE.14 ]
  testIsAuthorized_AccessPolicy_is_legacyAccount_can_Write(org.dataone.integration.it.MNodeTier2IT): ServiceFailure: 0 Client_Error: class javax.net.ssl.SSLHandshakeException: Received fatal alert: certificate_expired  [for host GET https://mn-demo-6.test.dataone.org/knb/d1/mn/v1/meta/TierTesting:mn-demo-6:legacyAcct_WRITE.14 ]
  testIsAuthorized_ComplicatedAccessPolicy(org.dataone.integration.it.MNodeTier2IT): ServiceFailure: 0 Client_Error: class javax.net.ssl.SSLHandshakeException: Received fatal alert: certificate_expired  [for host GET https://mn-demo-6.test.dataone.org/knb/d1/mn/v1/meta/TierTesting:mn-demo-6:ComplicatedPolicy.14 ]
  testUpdate_badObsoletedByInfo(org.dataone.integration.it.MNodeTier3IT): ServiceFailure: 0 Client_Error: class javax.net.ssl.SSLHandshakeException: Received fatal alert: certificate_expired  [for host POST https://mn-demo-6.test.dataone.org/knb/d1/mn/v1/object; MMP message has: ParamPart:pid = mNodeTier3TestUpdate2019339235834376; FilePart:object = /tmp/mmp.output.4099428226993829343.tmp (684336 bytes); FilePart:sysmeta = /tmp/mmp.output.5168422154629093599.tmp (745 bytes);  ]
  testUpdate_badObsoletesInfo(org.dataone.integration.it.MNodeTier3IT): ServiceFailure: 0 Client_Error: class javax.net.ssl.SSLHandshakeException: Received fatal alert: certificate_expired  [for host POST https://mn-demo-6.test.dataone.org/knb/d1/mn/v1/object; MMP message has: ParamPart:pid = mNodeTier3TestUpdate2019339235834405; FilePart:object = /tmp/mmp.output.8645985099130603807.tmp (684336 bytes); FilePart:sysmeta = /tmp/mmp.output.5674874864534860921.tmp (745 bytes);  ]
  testUpdate_NoCert(org.dataone.integration.it.MNodeTier3IT): Exception while setting up test (mn.create): ServiceFailure: 0 Client_Error: class javax.net.ssl.SSLHandshakeException: Received fatal alert: certificate_expired  [for host POST https://mn-demo-6.test.dataone.org/knb/d1/mn/v1/object; MMP message has: ParamPart:pid = mNodeTier3TestUpdate2019339235834431; FilePart:object = /tmp/mmp.output.6034617752676623376.tmp (684336 bytes); FilePart:sysmeta = /tmp/mmp.output.8288560265399181120.tmp (745 bytes);  ]
  testUpdate_NoRightsOnObsoleted(org.dataone.integration.it.MNodeTier3IT): ServiceFailure: 0 Client_Error: class javax.net.ssl.SSLHandshakeException: Received fatal alert: certificate_expired  [for host POST https://mn-demo-6.test.dataone.org/knb/d1/mn/v1/object; MMP message has: ParamPart:pid = mNodeTier3TestUpdate2019339235834458; FilePart:object = /tmp/mmp.output.966524133385369241.tmp (684336 bytes); FilePart:sysmeta = /tmp/mmp.output.1347718432014280518.tmp (745 bytes);  ]
  testArchive(org.dataone.integration.it.MNodeTier3IT): ServiceFailure: 0 Client_Error: class javax.net.ssl.SSLHandshakeException: Received fatal alert: certificate_expired  [for host POST https://mn-demo-6.test.dataone.org/knb/d1/mn/v1/object; MMP message has: ParamPart:pid = mNodeTier3TestDelete2019339235834485; FilePart:object = /tmp/mmp.output.5764851816824374191.tmp (684336 bytes); FilePart:sysmeta = /tmp/mmp.output.7883660722144888542.tmp (745 bytes);  ]
  testArchive_NotFound(org.dataone.integration.it.MNodeTier3IT): Expected NotFound, got: ServiceFailure: 0 Client_Error: class javax.net.ssl.SSLHandshakeException: Received fatal alert: certificate_expired  [for host PUT https://mn-demo-6.test.dataone.org/knb/d1/mn/v1/archive/fakeID.2019339235834511; MMP entity is null ]
  testArchive_NoCert(org.dataone.integration.it.MNodeTier3IT): Expected InvalidToken or NotAuthorized, got: ServiceFailure: 0 Client_Error: class javax.net.ssl.SSLHandshakeException: Received fatal alert: certificate_expired  [for host POST https://mn-demo-6.test.dataone.org/knb/d1/mn/v1/object; MMP message has: ParamPart:pid = mNodeTier3TestArchive2019339235834529; FilePart:object = /tmp/mmp.output.1363914974725607818.tmp (684336 bytes); FilePart:sysmeta = /tmp/mmp.output.840281057599639619.tmp (746 bytes);  ]
  testDelete_NoCert(org.dataone.integration.it.MNodeTier3IT): Expected InvalidToken, got: ServiceFailure: 0 Client_Error: class javax.net.ssl.SSLHandshakeException: Received fatal alert: certificate_expired  [for host POST https://mn-demo-6.test.dataone.org/knb/d1/mn/v1/object; MMP message has: ParamPart:pid = mNodeTier3TestDelete2019339235834555; FilePart:object = /tmp/mmp.output.2824328598927110916.tmp (684336 bytes); FilePart:sysmeta = /tmp/mmp.output.4799325217209028550.tmp (745 bytes);  ]
  testCreate(org.dataone.integration.it.MNodeTier3IT): ServiceFailure: 0 Client_Error: class javax.net.ssl.SSLHandshakeException: Received fatal alert: certificate_expired  [for host POST https://mn-demo-6.test.dataone.org/knb/d1/mn/v1/object; MMP message has: ParamPart:pid = mNodeTier3TestCreate2019339235834587; FilePart:object = /tmp/mmp.output.8176737490458118035.tmp (684336 bytes); FilePart:sysmeta = /tmp/mmp.output.2996975125252916379.tmp (745 bytes);  ]
  testUpdate(org.dataone.integration.it.MNodeTier3IT): ServiceFailure: 0 Client_Error: class javax.net.ssl.SSLHandshakeException: Received fatal alert: certificate_expired  [for host POST https://mn-demo-6.test.dataone.org/knb/d1/mn/v1/object; MMP message has: ParamPart:pid = mNodeTier3TestUpdate2019339235834619; FilePart:object = /tmp/mmp.output.629446834596864340.tmp (684336 bytes); FilePart:sysmeta = /tmp/mmp.output.391598719561297911.tmp (745 bytes);  ]
  testGetLogRecords_AccessRestriction(org.dataone.integration.it.MNodeTier1SlowIT): ServiceFailure: 1490: Could not get CNode from the underlying context (D1Client.CN_URL)  [for host GET https://mn-demo-6.test.dataone.org/knb/d1/mn/v1/log ]
  testGetLogRecords(org.dataone.integration.it.MNodeTier1SlowIT): ServiceFailure: 1490: Could not get CNode from the underlying context (D1Client.CN_URL)  [for host GET https://mn-demo-6.test.dataone.org/knb/d1/mn/v1/log ]
  testGetLogRecords_Slicing(org.dataone.integration.it.MNodeTier1SlowIT): ServiceFailure: 1490: Could not get CNode from the underlying context (D1Client.CN_URL)  [for host GET https://mn-demo-6.test.dataone.org/knb/d1/mn/v1/log ]
  testGetLogRecords_eventFiltering(org.dataone.integration.it.MNodeTier1SlowIT): ServiceFailure: 1490: Could not get CNode from the underlying context (D1Client.CN_URL)  [for host GET https://mn-demo-6.test.dataone.org/knb/d1/mn/v1/log?toDate=2019-12-06T07:58:34.914%2B00:00 ]
  testGetLogRecords_pidFiltering(org.dataone.integration.it.MNodeTier1SlowIT): ServiceFailure: 1490: Could not get CNode from the underlying context (D1Client.CN_URL)  [for host GET https://mn-demo-6.test.dataone.org/knb/d1/mn/v1/log?toDate=2019-12-06T07:58:34.977%2B00:00 ]
  testGetLogRecords_DateFiltering(org.dataone.integration.it.MNodeTier1SlowIT): ServiceFailure: 1490: Could not get CNode from the underlying context (D1Client.CN_URL)  [for host GET https://mn-demo-6.test.dataone.org/knb/d1/mn/v1/log ]

Tests run: 105, Failures: 74, Errors: 0, Skipped: 3

[WARNING] File encoding has not been set, using platform encoding UTF-8, i.e. build is platform dependent!
[JENKINS] Recording test results
[INFO] 
[INFO] --- maven-failsafe-plugin:2.8.1:verify (verify) @ d1_integration ---
[INFO] Failsafe report directory: /var/lib/jenkins/jobs/d1_integration_STAGE/workspace/D1_INTEGRATION_v1.1/target/failsafe-reports
[WARNING] File encoding has not been set, using platform encoding UTF-8, i.e. build is platform dependent!
[ERROR] There are test failures.

Please refer to /var/lib/jenkins/jobs/d1_integration_STAGE/workspace/D1_INTEGRATION_v1.1/target/failsafe-reports for the individual test results.
[JENKINS] Recording test results
Notifying upstream projects of job completion
Join notifier requires a CauseAction
[INFO] ------------------------------------------------------------------------
[INFO] BUILD SUCCESS
[INFO] ------------------------------------------------------------------------
[INFO] Total time:  30.837 s
[INFO] Finished at: 2019-12-06T07:58:35Z
[INFO] ------------------------------------------------------------------------
Waiting for Jenkins to finish collecting data
[JENKINS] Archiving /var/lib/jenkins/jobs/d1_integration_STAGE/workspace/D1_INTEGRATION_v1.1/pom.xml to org.dataone/d1_integration/1.1-SNAPSHOT/d1_integration-1.1-SNAPSHOT.pom
channel stopped
Notifying upstream projects of job completion
Sending e-mails to: rnahf@dataone.unm.edu
ERROR: Could not connect to SMTP host: localhost, port: 25
javax.mail.MessagingException: Could not connect to SMTP host: localhost, port: 25;
  nested exception is:
	java.net.ConnectException: Connection refused (Connection refused)
	at com.sun.mail.smtp.SMTPTransport.openServer(SMTPTransport.java:1934)
	at com.sun.mail.smtp.SMTPTransport.protocolConnect(SMTPTransport.java:638)
	at javax.mail.Service.connect(Service.java:295)
	at javax.mail.Service.connect(Service.java:176)
	at javax.mail.Service.connect(Service.java:125)
	at javax.mail.Transport.send0(Transport.java:194)
	at javax.mail.Transport.send(Transport.java:124)
	at hudson.tasks.MailSender.run(MailSender.java:130)
	at hudson.tasks.MailSender.execute(MailSender.java:105)
	at hudson.maven.MavenModuleSetBuild$MavenModuleSetBuildExecution.cleanUp(MavenModuleSetBuild.java:1095)
	at hudson.model.Run.execute(Run.java:1863)
	at hudson.maven.MavenModuleSetBuild.run(MavenModuleSetBuild.java:543)
	at hudson.model.ResourceController.execute(ResourceController.java:97)
	at hudson.model.Executor.run(Executor.java:429)
Caused by: java.net.ConnectException: Connection refused (Connection refused)
	at java.net.PlainSocketImpl.socketConnect(Native Method)
	at java.net.AbstractPlainSocketImpl.doConnect(AbstractPlainSocketImpl.java:350)
	at java.net.AbstractPlainSocketImpl.connectToAddress(AbstractPlainSocketImpl.java:206)
	at java.net.AbstractPlainSocketImpl.connect(AbstractPlainSocketImpl.java:188)
	at java.net.SocksSocketImpl.connect(SocksSocketImpl.java:392)
	at java.net.Socket.connect(Socket.java:589)
	at com.sun.mail.util.SocketFetcher.createSocket(SocketFetcher.java:286)
	at com.sun.mail.util.SocketFetcher.getSocket(SocketFetcher.java:231)
	at com.sun.mail.smtp.SMTPTransport.openServer(SMTPTransport.java:1900)
	... 13 more
Finished: UNSTABLE