UnstableConsole Output

Skipping 508 KB.. Full Log
abcdefghijklmnopqrstuvwxyz [org.dataone.integration.it.testImplementations.ReadTestImplementations]
20200805-05:18:50: [INFO]: RestClient.doRequestNoBody, thread(1) call Info: GET https://cn-dev-ucsb-1.test.dataone.org/cn/v1/checksum/Test2020217221850186_common-unicode-ascii-safe-abcdefghijklmnopqrstuvwxyz [org.dataone.client.rest.RestClient]
20200805-05:18:50: [INFO]:  [org.dataone.integration.it.testImplementations.ReadTestImplementations]
20200805-05:18:50: [INFO]: 2    unicode String:: common-unicode-ascii-safe-0123456789 [org.dataone.integration.it.testImplementations.ReadTestImplementations]
20200805-05:18:50: [INFO]: RestClient.doRequestNoBody, thread(1) call Info: GET https://cn-dev-ucsb-1.test.dataone.org/cn/v1/checksum/Test2020217221850190_common-unicode-ascii-safe-0123456789 [org.dataone.client.rest.RestClient]
20200805-05:18:50: [INFO]:  [org.dataone.integration.it.testImplementations.ReadTestImplementations]
20200805-05:18:50: [INFO]: 3    unicode String:: common-unicode-ascii-safe-:@$-_.!*()',~ [org.dataone.integration.it.testImplementations.ReadTestImplementations]
20200805-05:18:50: [INFO]: RestClient.doRequestNoBody, thread(1) call Info: GET https://cn-dev-ucsb-1.test.dataone.org/cn/v1/checksum/Test2020217221850193_common-unicode-ascii-safe-:@$-_.!*()',~ [org.dataone.client.rest.RestClient]
20200805-05:18:50: [INFO]:  [org.dataone.integration.it.testImplementations.ReadTestImplementations]
20200805-05:18:50: [INFO]: 4    unicode String:: common-unicode-ascii-safe-unreserved-._~ [org.dataone.integration.it.testImplementations.ReadTestImplementations]
20200805-05:18:50: [INFO]: RestClient.doRequestNoBody, thread(1) call Info: GET https://cn-dev-ucsb-1.test.dataone.org/cn/v1/checksum/Test2020217221850196_common-unicode-ascii-safe-unreserved-._~ [org.dataone.client.rest.RestClient]
20200805-05:18:50: [INFO]:  [org.dataone.integration.it.testImplementations.ReadTestImplementations]
20200805-05:18:50: [INFO]: 5    unicode String:: common-unicode-ascii-safe-sub-delims-$!*()', [org.dataone.integration.it.testImplementations.ReadTestImplementations]
20200805-05:18:50: [INFO]: RestClient.doRequestNoBody, thread(1) call Info: GET https://cn-dev-ucsb-1.test.dataone.org/cn/v1/checksum/Test2020217221850199_common-unicode-ascii-safe-sub-delims-$!*()', [org.dataone.client.rest.RestClient]
20200805-05:18:50: [INFO]:  [org.dataone.integration.it.testImplementations.ReadTestImplementations]
20200805-05:18:50: [INFO]: 6    unicode String:: common-unicode-ascii-safe-gen-delims-:@ [org.dataone.integration.it.testImplementations.ReadTestImplementations]
20200805-05:18:50: [INFO]: RestClient.doRequestNoBody, thread(1) call Info: GET https://cn-dev-ucsb-1.test.dataone.org/cn/v1/checksum/Test2020217221850202_common-unicode-ascii-safe-gen-delims-:@ [org.dataone.client.rest.RestClient]
20200805-05:18:50: [INFO]:  [org.dataone.integration.it.testImplementations.ReadTestImplementations]
20200805-05:18:50: [INFO]: 7    unicode String:: common-unicode-ascii-escaped-"#<>[]^`{}| [org.dataone.integration.it.testImplementations.ReadTestImplementations]
20200805-05:18:50: [INFO]: RestClient.doRequestNoBody, thread(1) call Info: GET https://cn-dev-ucsb-1.test.dataone.org/cn/v1/checksum/Test2020217221850205_common-unicode-ascii-escaped-%22%23%3C%3E%5B%5D%5E%60%7B%7D%7C [org.dataone.client.rest.RestClient]
20200805-05:18:50: [INFO]:  [org.dataone.integration.it.testImplementations.ReadTestImplementations]
20200805-05:18:50: [INFO]: 8    unicode String:: common-unicode-ascii-escaped-tomcatBlocked-\ [org.dataone.integration.it.testImplementations.ReadTestImplementations]
20200805-05:18:50: [INFO]: RestClient.doRequestNoBody, thread(1) call Info: GET https://cn-dev-ucsb-1.test.dataone.org/cn/v1/checksum/Test2020217221850208_common-unicode-ascii-escaped-tomcatBlocked-%5C [org.dataone.client.rest.RestClient]
20200805-05:18:50: [INFO]:  [org.dataone.integration.it.testImplementations.ReadTestImplementations]
20200805-05:18:50: [INFO]: 9    unicode String:: common-unicode-ascii-escaped-tomcatBlocked-%5C [org.dataone.integration.it.testImplementations.ReadTestImplementations]
20200805-05:18:50: [INFO]: RestClient.doRequestNoBody, thread(1) call Info: GET https://cn-dev-ucsb-1.test.dataone.org/cn/v1/checksum/Test2020217221850211_common-unicode-ascii-escaped-tomcatBlocked-%255C [org.dataone.client.rest.RestClient]
20200805-05:18:50: [INFO]:  [org.dataone.integration.it.testImplementations.ReadTestImplementations]
20200805-05:18:50: [INFO]: 10    unicode String:: common-unicode-ascii-semi-colon-test-%3B [org.dataone.integration.it.testImplementations.ReadTestImplementations]
20200805-05:18:50: [INFO]: RestClient.doRequestNoBody, thread(1) call Info: GET https://cn-dev-ucsb-1.test.dataone.org/cn/v1/checksum/Test2020217221850213_common-unicode-ascii-semi-colon-test-%253B [org.dataone.client.rest.RestClient]
20200805-05:18:50: [INFO]:  [org.dataone.integration.it.testImplementations.ReadTestImplementations]
20200805-05:18:50: [INFO]: 11    unicode String:: common-unicode-ascii-escaped-% [org.dataone.integration.it.testImplementations.ReadTestImplementations]
20200805-05:18:50: [INFO]: RestClient.doRequestNoBody, thread(1) call Info: GET https://cn-dev-ucsb-1.test.dataone.org/cn/v1/checksum/Test2020217221850216_common-unicode-ascii-escaped-%25 [org.dataone.client.rest.RestClient]
20200805-05:18:50: [INFO]:  [org.dataone.integration.it.testImplementations.ReadTestImplementations]
20200805-05:18:50: [INFO]: 12    unicode String:: common-unicode-ascii-escape-anyway-+ [org.dataone.integration.it.testImplementations.ReadTestImplementations]
20200805-05:18:50: [INFO]: RestClient.doRequestNoBody, thread(1) call Info: GET https://cn-dev-ucsb-1.test.dataone.org/cn/v1/checksum/Test2020217221850219_common-unicode-ascii-escape-anyway-%2B [org.dataone.client.rest.RestClient]
20200805-05:18:50: [INFO]:  [org.dataone.integration.it.testImplementations.ReadTestImplementations]
20200805-05:18:50: [INFO]: 13    unicode String:: path-unicode-ascii-safe-&=&= [org.dataone.integration.it.testImplementations.ReadTestImplementations]
20200805-05:18:50: [INFO]: RestClient.doRequestNoBody, thread(1) call Info: GET https://cn-dev-ucsb-1.test.dataone.org/cn/v1/checksum/Test2020217221850222_path-unicode-ascii-safe-&=&= [org.dataone.client.rest.RestClient]
20200805-05:18:50: [INFO]:  [org.dataone.integration.it.testImplementations.ReadTestImplementations]
20200805-05:18:50: [INFO]: 14    unicode String:: path-unicode-ascii-escaped-; [org.dataone.integration.it.testImplementations.ReadTestImplementations]
20200805-05:18:50: [INFO]: RestClient.doRequestNoBody, thread(1) call Info: GET https://cn-dev-ucsb-1.test.dataone.org/cn/v1/checksum/Test2020217221850225_path-unicode-ascii-escaped-%3B [org.dataone.client.rest.RestClient]
20200805-05:18:50: [INFO]:  [org.dataone.integration.it.testImplementations.ReadTestImplementations]
20200805-05:18:50: [INFO]: 15    unicode String:: path-unicode-ascii-escaped-? [org.dataone.integration.it.testImplementations.ReadTestImplementations]
20200805-05:18:50: [INFO]: RestClient.doRequestNoBody, thread(1) call Info: GET https://cn-dev-ucsb-1.test.dataone.org/cn/v1/checksum/Test2020217221850229_path-unicode-ascii-escaped-%3F [org.dataone.client.rest.RestClient]
20200805-05:18:50: [INFO]:  [org.dataone.integration.it.testImplementations.ReadTestImplementations]
20200805-05:18:50: [INFO]: 16    unicode String:: path-unicode-ascii-escaped-/ [org.dataone.integration.it.testImplementations.ReadTestImplementations]
20200805-05:18:50: [INFO]: RestClient.doRequestNoBody, thread(1) call Info: GET https://cn-dev-ucsb-1.test.dataone.org/cn/v1/checksum/Test2020217221850231_path-unicode-ascii-escaped-%2F [org.dataone.client.rest.RestClient]
20200805-05:18:50: [INFO]:  [org.dataone.integration.it.testImplementations.ReadTestImplementations]
20200805-05:18:50: [INFO]: 17    unicode String:: path-unicode-ascii-escaped-%3F [org.dataone.integration.it.testImplementations.ReadTestImplementations]
20200805-05:18:50: [INFO]: RestClient.doRequestNoBody, thread(1) call Info: GET https://cn-dev-ucsb-1.test.dataone.org/cn/v1/checksum/Test2020217221850235_path-unicode-ascii-escaped-%253F [org.dataone.client.rest.RestClient]
20200805-05:18:50: [INFO]:  [org.dataone.integration.it.testImplementations.ReadTestImplementations]
20200805-05:18:50: [INFO]: 18    unicode String:: path-unicode-ascii-escaped-%2F [org.dataone.integration.it.testImplementations.ReadTestImplementations]
20200805-05:18:50: [INFO]: RestClient.doRequestNoBody, thread(1) call Info: GET https://cn-dev-ucsb-1.test.dataone.org/cn/v1/checksum/Test2020217221850239_path-unicode-ascii-escaped-%252F [org.dataone.client.rest.RestClient]
20200805-05:18:50: [INFO]:  [org.dataone.integration.it.testImplementations.ReadTestImplementations]
20200805-05:18:50: [INFO]: 19    unicode String:: path-unicode-ascii-escaped-double-//case [org.dataone.integration.it.testImplementations.ReadTestImplementations]
20200805-05:18:50: [INFO]: RestClient.doRequestNoBody, thread(1) call Info: GET https://cn-dev-ucsb-1.test.dataone.org/cn/v1/checksum/Test2020217221850242_path-unicode-ascii-escaped-double-%2F%2Fcase [org.dataone.client.rest.RestClient]
20200805-05:18:50: [INFO]:  [org.dataone.integration.it.testImplementations.ReadTestImplementations]
20200805-05:18:50: [INFO]: 20    unicode String:: path-unicode-ascii-escaped-double-trailing// [org.dataone.integration.it.testImplementations.ReadTestImplementations]
20200805-05:18:50: [INFO]: RestClient.doRequestNoBody, thread(1) call Info: GET https://cn-dev-ucsb-1.test.dataone.org/cn/v1/checksum/Test2020217221850245_path-unicode-ascii-escaped-double-trailing%2F%2F [org.dataone.client.rest.RestClient]
20200805-05:18:50: [INFO]:  [org.dataone.integration.it.testImplementations.ReadTestImplementations]
20200805-05:18:50: [INFO]: 21    unicode String:: path-unicode-ascii-escaped-double-%2F%2Fcase [org.dataone.integration.it.testImplementations.ReadTestImplementations]
20200805-05:18:50: [INFO]: RestClient.doRequestNoBody, thread(1) call Info: GET https://cn-dev-ucsb-1.test.dataone.org/cn/v1/checksum/Test2020217221850247_path-unicode-ascii-escaped-double-%252F%252Fcase [org.dataone.client.rest.RestClient]
20200805-05:18:50: [INFO]:  [org.dataone.integration.it.testImplementations.ReadTestImplementations]
20200805-05:18:50: [INFO]: 22    unicode String:: path-unicode-ascii-escaped-double-trailing%2F%2F [org.dataone.integration.it.testImplementations.ReadTestImplementations]
20200805-05:18:50: [INFO]: RestClient.doRequestNoBody, thread(1) call Info: GET https://cn-dev-ucsb-1.test.dataone.org/cn/v1/checksum/Test2020217221850250_path-unicode-ascii-escaped-double-trailing%252F%252F [org.dataone.client.rest.RestClient]
20200805-05:18:50: [INFO]:  [org.dataone.integration.it.testImplementations.ReadTestImplementations]
20200805-05:18:50: [INFO]: 23    unicode String:: common-unicode-bmp-1byte-escaped-¡¢£ [org.dataone.integration.it.testImplementations.ReadTestImplementations]
20200805-05:18:50: [INFO]: RestClient.doRequestNoBody, thread(1) call Info: GET https://cn-dev-ucsb-1.test.dataone.org/cn/v1/checksum/Test2020217221850253_common-unicode-bmp-1byte-escaped-%C2%A1%C2%A2%C2%A3 [org.dataone.client.rest.RestClient]
20200805-05:18:50: [INFO]:  [org.dataone.integration.it.testImplementations.ReadTestImplementations]
20200805-05:18:50: [INFO]: 24    unicode String:: common-unicode-bmp-2byte-escaped-䦹䦺 [org.dataone.integration.it.testImplementations.ReadTestImplementations]
20200805-05:18:50: [INFO]: RestClient.doRequestNoBody, thread(1) call Info: GET https://cn-dev-ucsb-1.test.dataone.org/cn/v1/checksum/Test2020217221850256_common-unicode-bmp-2byte-escaped-%E4%A6%B9%E4%A6%BA [org.dataone.client.rest.RestClient]
20200805-05:18:50: [INFO]:  [org.dataone.integration.it.testImplementations.ReadTestImplementations]
20200805-05:18:50: [INFO]: 25    unicode String:: common-ascii-doc-example-urn:lsid:ubio.org:namebank:11815 [org.dataone.integration.it.testImplementations.ReadTestImplementations]
20200805-05:18:50: [INFO]: RestClient.doRequestNoBody, thread(1) call Info: GET https://cn-dev-ucsb-1.test.dataone.org/cn/v1/checksum/Test2020217221850260_common-ascii-doc-example-urn:lsid:ubio.org:namebank:11815 [org.dataone.client.rest.RestClient]
20200805-05:18:50: [INFO]:  [org.dataone.integration.it.testImplementations.ReadTestImplementations]
20200805-05:18:50: [INFO]: 26    unicode String:: path-ascii-doc-example-10.1000/182 [org.dataone.integration.it.testImplementations.ReadTestImplementations]
20200805-05:18:50: [INFO]: RestClient.doRequestNoBody, thread(1) call Info: GET https://cn-dev-ucsb-1.test.dataone.org/cn/v1/checksum/Test2020217221850263_path-ascii-doc-example-10.1000%2F182 [org.dataone.client.rest.RestClient]
20200805-05:18:50: [INFO]:  [org.dataone.integration.it.testImplementations.ReadTestImplementations]
20200805-05:18:50: [INFO]: 27    unicode String:: path-ascii-doc-example-http://example.com/data/mydata?row=24 [org.dataone.integration.it.testImplementations.ReadTestImplementations]
20200805-05:18:50: [INFO]: RestClient.doRequestNoBody, thread(1) call Info: GET https://cn-dev-ucsb-1.test.dataone.org/cn/v1/checksum/Test2020217221850266_path-ascii-doc-example-http:%2F%2Fexample.com%2Fdata%2Fmydata%3Frow=24 [org.dataone.client.rest.RestClient]
20200805-05:18:50: [INFO]:  [org.dataone.integration.it.testImplementations.ReadTestImplementations]
20200805-05:18:50: [INFO]: 28    unicode String:: common-bmp-doc-example-ฉันกินกระจกได้ [org.dataone.integration.it.testImplementations.ReadTestImplementations]
20200805-05:18:50: [INFO]: RestClient.doRequestNoBody, thread(1) call Info: GET https://cn-dev-ucsb-1.test.dataone.org/cn/v1/checksum/Test2020217221850270_common-bmp-doc-example-%E0%B8%89%E0%B8%B1%E0%B8%99%E0%B8%81%E0%B8%B4%E0%B8%99%E0%B8%81%E0%B8%A3%E0%B8%B0%E0%B8%88%E0%B8%81%E0%B9%84%E0%B8%94%E0%B9%89 [org.dataone.client.rest.RestClient]
20200805-05:18:50: [INFO]:  [org.dataone.integration.it.testImplementations.ReadTestImplementations]
20200805-05:18:50: [INFO]: 29    unicode String:: common-bmp-doc-example-Is_féidir_liom_ithe_gloine [org.dataone.integration.it.testImplementations.ReadTestImplementations]
20200805-05:18:50: [INFO]: RestClient.doRequestNoBody, thread(1) call Info: GET https://cn-dev-ucsb-1.test.dataone.org/cn/v1/checksum/Test2020217221850273_common-bmp-doc-example-Is_f%C3%A9idir_liom_ithe_gloine [org.dataone.client.rest.RestClient]
20200805-05:18:50: [INFO]: **************************************************** [org.dataone.integration.ContextAwareTestCaseDataone]
20200805-05:18:50: [INFO]: ***  context label:   SINGLE_CN [org.dataone.integration.ContextAwareTestCaseDataone]
20200805-05:18:50: [INFO]: **************************************************** [org.dataone.integration.ContextAwareTestCaseDataone]
~~~ Context is solo CoordinatingNode: https://cn-dev-ucsb-1.test.dataone.org/cn
20200805-05:18:50: [INFO]: **************************************************** [org.dataone.integration.ContextAwareTestCaseDataone]
                          nodeId  key                       value
=============================================================================================================
20200805-05:18:50: [INFO]: 
***************** running test for testGet() vs. node: https://cn-dev-ucsb-1.test.dataone.org/cn/v1 ***************** [org.dataone.integration.ContextAwareTestCaseDataone]
20200805-05:18:50: [INFO]: RestClient.doRequestNoBody, thread(1) call Info: GET https://cn-dev-ucsb-1.test.dataone.org/cn/v1/object/TestingNotFound:2020217221850278 [org.dataone.client.rest.RestClient]
20200805-05:18:50: [INFO]: **************************************************** [org.dataone.integration.ContextAwareTestCaseDataone]
20200805-05:18:50: [INFO]: ***  context label:   SINGLE_CN [org.dataone.integration.ContextAwareTestCaseDataone]
20200805-05:18:50: [INFO]: **************************************************** [org.dataone.integration.ContextAwareTestCaseDataone]
~~~ Context is solo CoordinatingNode: https://cn-dev-ucsb-1.test.dataone.org/cn
20200805-05:18:50: [INFO]: **************************************************** [org.dataone.integration.ContextAwareTestCaseDataone]
                          nodeId  key                       value
=============================================================================================================
20200805-05:18:50: [INFO]: 
***************** running test for testGetSystemMetadata() vs. node: https://cn-dev-ucsb-1.test.dataone.org/cn/v1 ***************** [org.dataone.integration.ContextAwareTestCaseDataone]
20200805-05:18:50: [INFO]: RestClient.doRequestNoBody, thread(1) call Info: GET https://cn-dev-ucsb-1.test.dataone.org/cn/v1/meta/TestingNotFound:2020217221850281 [org.dataone.client.rest.RestClient]
20200805-05:18:50: [INFO]: **************************************************** [org.dataone.integration.ContextAwareTestCaseDataone]
20200805-05:18:50: [INFO]: ***  context label:   SINGLE_CN [org.dataone.integration.ContextAwareTestCaseDataone]
20200805-05:18:50: [INFO]: **************************************************** [org.dataone.integration.ContextAwareTestCaseDataone]
~~~ Context is solo CoordinatingNode: https://cn-dev-ucsb-1.test.dataone.org/cn
20200805-05:18:50: [INFO]: **************************************************** [org.dataone.integration.ContextAwareTestCaseDataone]
                          nodeId  key                       value
=============================================================================================================
20200805-05:18:50: [INFO]: 
***************** running test for testGetSystemMetadata_IdentifierEncoding() vs. node: https://cn-dev-ucsb-1.test.dataone.org/cn/v1 ***************** [org.dataone.integration.ContextAwareTestCaseDataone]
20200805-05:18:50: [INFO]: 
***************** running test for   Node:: https://cn-dev-ucsb-1.test.dataone.org/cn/v1 ***************** [org.dataone.integration.ContextAwareTestCaseDataone]
20200805-05:18:50: [INFO]:  [org.dataone.integration.it.testImplementations.ReadTestImplementations]
20200805-05:18:50: [INFO]: 0    unicode String:: common-unicode-ascii-safe-ABCDEFGHIJKLMNOPQRSTUVWXYZ [org.dataone.integration.it.testImplementations.ReadTestImplementations]
20200805-05:18:50: [INFO]: RestClient.doRequestNoBody, thread(1) call Info: GET https://cn-dev-ucsb-1.test.dataone.org/cn/v1/meta/Test2020217221850285_common-unicode-ascii-safe-ABCDEFGHIJKLMNOPQRSTUVWXYZ [org.dataone.client.rest.RestClient]
20200805-05:18:50: [INFO]:  [org.dataone.integration.it.testImplementations.ReadTestImplementations]
20200805-05:18:50: [INFO]: 1    unicode String:: common-unicode-ascii-safe-abcdefghijklmnopqrstuvwxyz [org.dataone.integration.it.testImplementations.ReadTestImplementations]
20200805-05:18:50: [INFO]: RestClient.doRequestNoBody, thread(1) call Info: GET https://cn-dev-ucsb-1.test.dataone.org/cn/v1/meta/Test2020217221850288_common-unicode-ascii-safe-abcdefghijklmnopqrstuvwxyz [org.dataone.client.rest.RestClient]
20200805-05:18:50: [INFO]:  [org.dataone.integration.it.testImplementations.ReadTestImplementations]
20200805-05:18:50: [INFO]: 2    unicode String:: common-unicode-ascii-safe-0123456789 [org.dataone.integration.it.testImplementations.ReadTestImplementations]
20200805-05:18:50: [INFO]: RestClient.doRequestNoBody, thread(1) call Info: GET https://cn-dev-ucsb-1.test.dataone.org/cn/v1/meta/Test2020217221850291_common-unicode-ascii-safe-0123456789 [org.dataone.client.rest.RestClient]
20200805-05:18:50: [INFO]:  [org.dataone.integration.it.testImplementations.ReadTestImplementations]
20200805-05:18:50: [INFO]: 3    unicode String:: common-unicode-ascii-safe-:@$-_.!*()',~ [org.dataone.integration.it.testImplementations.ReadTestImplementations]
20200805-05:18:50: [INFO]: RestClient.doRequestNoBody, thread(1) call Info: GET https://cn-dev-ucsb-1.test.dataone.org/cn/v1/meta/Test2020217221850293_common-unicode-ascii-safe-:@$-_.!*()',~ [org.dataone.client.rest.RestClient]
20200805-05:18:50: [INFO]:  [org.dataone.integration.it.testImplementations.ReadTestImplementations]
20200805-05:18:50: [INFO]: 4    unicode String:: common-unicode-ascii-safe-unreserved-._~ [org.dataone.integration.it.testImplementations.ReadTestImplementations]
20200805-05:18:50: [INFO]: RestClient.doRequestNoBody, thread(1) call Info: GET https://cn-dev-ucsb-1.test.dataone.org/cn/v1/meta/Test2020217221850296_common-unicode-ascii-safe-unreserved-._~ [org.dataone.client.rest.RestClient]
20200805-05:18:50: [INFO]:  [org.dataone.integration.it.testImplementations.ReadTestImplementations]
20200805-05:18:50: [INFO]: 5    unicode String:: common-unicode-ascii-safe-sub-delims-$!*()', [org.dataone.integration.it.testImplementations.ReadTestImplementations]
20200805-05:18:50: [INFO]: RestClient.doRequestNoBody, thread(1) call Info: GET https://cn-dev-ucsb-1.test.dataone.org/cn/v1/meta/Test2020217221850299_common-unicode-ascii-safe-sub-delims-$!*()', [org.dataone.client.rest.RestClient]
20200805-05:18:50: [INFO]:  [org.dataone.integration.it.testImplementations.ReadTestImplementations]
20200805-05:18:50: [INFO]: 6    unicode String:: common-unicode-ascii-safe-gen-delims-:@ [org.dataone.integration.it.testImplementations.ReadTestImplementations]
20200805-05:18:50: [INFO]: RestClient.doRequestNoBody, thread(1) call Info: GET https://cn-dev-ucsb-1.test.dataone.org/cn/v1/meta/Test2020217221850302_common-unicode-ascii-safe-gen-delims-:@ [org.dataone.client.rest.RestClient]
20200805-05:18:50: [INFO]:  [org.dataone.integration.it.testImplementations.ReadTestImplementations]
20200805-05:18:50: [INFO]: 7    unicode String:: common-unicode-ascii-escaped-"#<>[]^`{}| [org.dataone.integration.it.testImplementations.ReadTestImplementations]
20200805-05:18:50: [INFO]: RestClient.doRequestNoBody, thread(1) call Info: GET https://cn-dev-ucsb-1.test.dataone.org/cn/v1/meta/Test2020217221850304_common-unicode-ascii-escaped-%22%23%3C%3E%5B%5D%5E%60%7B%7D%7C [org.dataone.client.rest.RestClient]
20200805-05:18:50: [INFO]:  [org.dataone.integration.it.testImplementations.ReadTestImplementations]
20200805-05:18:50: [INFO]: 8    unicode String:: common-unicode-ascii-escaped-tomcatBlocked-\ [org.dataone.integration.it.testImplementations.ReadTestImplementations]
20200805-05:18:50: [INFO]: RestClient.doRequestNoBody, thread(1) call Info: GET https://cn-dev-ucsb-1.test.dataone.org/cn/v1/meta/Test2020217221850308_common-unicode-ascii-escaped-tomcatBlocked-%5C [org.dataone.client.rest.RestClient]
20200805-05:18:50: [INFO]:  [org.dataone.integration.it.testImplementations.ReadTestImplementations]
20200805-05:18:50: [INFO]: 9    unicode String:: common-unicode-ascii-escaped-tomcatBlocked-%5C [org.dataone.integration.it.testImplementations.ReadTestImplementations]
20200805-05:18:50: [INFO]: RestClient.doRequestNoBody, thread(1) call Info: GET https://cn-dev-ucsb-1.test.dataone.org/cn/v1/meta/Test2020217221850311_common-unicode-ascii-escaped-tomcatBlocked-%255C [org.dataone.client.rest.RestClient]
20200805-05:18:50: [INFO]:  [org.dataone.integration.it.testImplementations.ReadTestImplementations]
20200805-05:18:50: [INFO]: 10    unicode String:: common-unicode-ascii-semi-colon-test-%3B [org.dataone.integration.it.testImplementations.ReadTestImplementations]
20200805-05:18:50: [INFO]: RestClient.doRequestNoBody, thread(1) call Info: GET https://cn-dev-ucsb-1.test.dataone.org/cn/v1/meta/Test2020217221850314_common-unicode-ascii-semi-colon-test-%253B [org.dataone.client.rest.RestClient]
20200805-05:18:50: [INFO]:  [org.dataone.integration.it.testImplementations.ReadTestImplementations]
20200805-05:18:50: [INFO]: 11    unicode String:: common-unicode-ascii-escaped-% [org.dataone.integration.it.testImplementations.ReadTestImplementations]
20200805-05:18:50: [INFO]: RestClient.doRequestNoBody, thread(1) call Info: GET https://cn-dev-ucsb-1.test.dataone.org/cn/v1/meta/Test2020217221850316_common-unicode-ascii-escaped-%25 [org.dataone.client.rest.RestClient]
20200805-05:18:50: [INFO]:  [org.dataone.integration.it.testImplementations.ReadTestImplementations]
20200805-05:18:50: [INFO]: 12    unicode String:: common-unicode-ascii-escape-anyway-+ [org.dataone.integration.it.testImplementations.ReadTestImplementations]
20200805-05:18:50: [INFO]: RestClient.doRequestNoBody, thread(1) call Info: GET https://cn-dev-ucsb-1.test.dataone.org/cn/v1/meta/Test2020217221850319_common-unicode-ascii-escape-anyway-%2B [org.dataone.client.rest.RestClient]
20200805-05:18:50: [INFO]:  [org.dataone.integration.it.testImplementations.ReadTestImplementations]
20200805-05:18:50: [INFO]: 13    unicode String:: path-unicode-ascii-safe-&=&= [org.dataone.integration.it.testImplementations.ReadTestImplementations]
20200805-05:18:50: [INFO]: RestClient.doRequestNoBody, thread(1) call Info: GET https://cn-dev-ucsb-1.test.dataone.org/cn/v1/meta/Test2020217221850322_path-unicode-ascii-safe-&=&= [org.dataone.client.rest.RestClient]
20200805-05:18:50: [INFO]:  [org.dataone.integration.it.testImplementations.ReadTestImplementations]
20200805-05:18:50: [INFO]: 14    unicode String:: path-unicode-ascii-escaped-; [org.dataone.integration.it.testImplementations.ReadTestImplementations]
20200805-05:18:50: [INFO]: RestClient.doRequestNoBody, thread(1) call Info: GET https://cn-dev-ucsb-1.test.dataone.org/cn/v1/meta/Test2020217221850324_path-unicode-ascii-escaped-%3B [org.dataone.client.rest.RestClient]
20200805-05:18:50: [INFO]:  [org.dataone.integration.it.testImplementations.ReadTestImplementations]
20200805-05:18:50: [INFO]: 15    unicode String:: path-unicode-ascii-escaped-? [org.dataone.integration.it.testImplementations.ReadTestImplementations]
20200805-05:18:50: [INFO]: RestClient.doRequestNoBody, thread(1) call Info: GET https://cn-dev-ucsb-1.test.dataone.org/cn/v1/meta/Test2020217221850327_path-unicode-ascii-escaped-%3F [org.dataone.client.rest.RestClient]
20200805-05:18:50: [INFO]:  [org.dataone.integration.it.testImplementations.ReadTestImplementations]
20200805-05:18:50: [INFO]: 16    unicode String:: path-unicode-ascii-escaped-/ [org.dataone.integration.it.testImplementations.ReadTestImplementations]
20200805-05:18:50: [INFO]: RestClient.doRequestNoBody, thread(1) call Info: GET https://cn-dev-ucsb-1.test.dataone.org/cn/v1/meta/Test2020217221850330_path-unicode-ascii-escaped-%2F [org.dataone.client.rest.RestClient]
20200805-05:18:50: [INFO]:  [org.dataone.integration.it.testImplementations.ReadTestImplementations]
20200805-05:18:50: [INFO]: 17    unicode String:: path-unicode-ascii-escaped-%3F [org.dataone.integration.it.testImplementations.ReadTestImplementations]
20200805-05:18:50: [INFO]: RestClient.doRequestNoBody, thread(1) call Info: GET https://cn-dev-ucsb-1.test.dataone.org/cn/v1/meta/Test2020217221850332_path-unicode-ascii-escaped-%253F [org.dataone.client.rest.RestClient]
20200805-05:18:50: [INFO]:  [org.dataone.integration.it.testImplementations.ReadTestImplementations]
20200805-05:18:50: [INFO]: 18    unicode String:: path-unicode-ascii-escaped-%2F [org.dataone.integration.it.testImplementations.ReadTestImplementations]
20200805-05:18:50: [INFO]: RestClient.doRequestNoBody, thread(1) call Info: GET https://cn-dev-ucsb-1.test.dataone.org/cn/v1/meta/Test2020217221850335_path-unicode-ascii-escaped-%252F [org.dataone.client.rest.RestClient]
20200805-05:18:50: [INFO]:  [org.dataone.integration.it.testImplementations.ReadTestImplementations]
20200805-05:18:50: [INFO]: 19    unicode String:: path-unicode-ascii-escaped-double-//case [org.dataone.integration.it.testImplementations.ReadTestImplementations]
20200805-05:18:50: [INFO]: RestClient.doRequestNoBody, thread(1) call Info: GET https://cn-dev-ucsb-1.test.dataone.org/cn/v1/meta/Test2020217221850338_path-unicode-ascii-escaped-double-%2F%2Fcase [org.dataone.client.rest.RestClient]
20200805-05:18:50: [INFO]:  [org.dataone.integration.it.testImplementations.ReadTestImplementations]
20200805-05:18:50: [INFO]: 20    unicode String:: path-unicode-ascii-escaped-double-trailing// [org.dataone.integration.it.testImplementations.ReadTestImplementations]
20200805-05:18:50: [INFO]: RestClient.doRequestNoBody, thread(1) call Info: GET https://cn-dev-ucsb-1.test.dataone.org/cn/v1/meta/Test2020217221850341_path-unicode-ascii-escaped-double-trailing%2F%2F [org.dataone.client.rest.RestClient]
20200805-05:18:50: [INFO]:  [org.dataone.integration.it.testImplementations.ReadTestImplementations]
20200805-05:18:50: [INFO]: 21    unicode String:: path-unicode-ascii-escaped-double-%2F%2Fcase [org.dataone.integration.it.testImplementations.ReadTestImplementations]
20200805-05:18:50: [INFO]: RestClient.doRequestNoBody, thread(1) call Info: GET https://cn-dev-ucsb-1.test.dataone.org/cn/v1/meta/Test2020217221850344_path-unicode-ascii-escaped-double-%252F%252Fcase [org.dataone.client.rest.RestClient]
20200805-05:18:50: [INFO]:  [org.dataone.integration.it.testImplementations.ReadTestImplementations]
20200805-05:18:50: [INFO]: 22    unicode String:: path-unicode-ascii-escaped-double-trailing%2F%2F [org.dataone.integration.it.testImplementations.ReadTestImplementations]
20200805-05:18:50: [INFO]: RestClient.doRequestNoBody, thread(1) call Info: GET https://cn-dev-ucsb-1.test.dataone.org/cn/v1/meta/Test2020217221850346_path-unicode-ascii-escaped-double-trailing%252F%252F [org.dataone.client.rest.RestClient]
20200805-05:18:50: [INFO]:  [org.dataone.integration.it.testImplementations.ReadTestImplementations]
20200805-05:18:50: [INFO]: 23    unicode String:: common-unicode-bmp-1byte-escaped-¡¢£ [org.dataone.integration.it.testImplementations.ReadTestImplementations]
20200805-05:18:50: [INFO]: RestClient.doRequestNoBody, thread(1) call Info: GET https://cn-dev-ucsb-1.test.dataone.org/cn/v1/meta/Test2020217221850349_common-unicode-bmp-1byte-escaped-%C2%A1%C2%A2%C2%A3 [org.dataone.client.rest.RestClient]
20200805-05:18:50: [INFO]:  [org.dataone.integration.it.testImplementations.ReadTestImplementations]
20200805-05:18:50: [INFO]: 24    unicode String:: common-unicode-bmp-2byte-escaped-䦹䦺 [org.dataone.integration.it.testImplementations.ReadTestImplementations]
20200805-05:18:50: [INFO]: RestClient.doRequestNoBody, thread(1) call Info: GET https://cn-dev-ucsb-1.test.dataone.org/cn/v1/meta/Test2020217221850352_common-unicode-bmp-2byte-escaped-%E4%A6%B9%E4%A6%BA [org.dataone.client.rest.RestClient]
20200805-05:18:50: [INFO]:  [org.dataone.integration.it.testImplementations.ReadTestImplementations]
20200805-05:18:50: [INFO]: 25    unicode String:: common-ascii-doc-example-urn:lsid:ubio.org:namebank:11815 [org.dataone.integration.it.testImplementations.ReadTestImplementations]
20200805-05:18:50: [INFO]: RestClient.doRequestNoBody, thread(1) call Info: GET https://cn-dev-ucsb-1.test.dataone.org/cn/v1/meta/Test2020217221850355_common-ascii-doc-example-urn:lsid:ubio.org:namebank:11815 [org.dataone.client.rest.RestClient]
20200805-05:18:50: [INFO]:  [org.dataone.integration.it.testImplementations.ReadTestImplementations]
20200805-05:18:50: [INFO]: 26    unicode String:: path-ascii-doc-example-10.1000/182 [org.dataone.integration.it.testImplementations.ReadTestImplementations]
20200805-05:18:50: [INFO]: RestClient.doRequestNoBody, thread(1) call Info: GET https://cn-dev-ucsb-1.test.dataone.org/cn/v1/meta/Test2020217221850357_path-ascii-doc-example-10.1000%2F182 [org.dataone.client.rest.RestClient]
20200805-05:18:50: [INFO]:  [org.dataone.integration.it.testImplementations.ReadTestImplementations]
20200805-05:18:50: [INFO]: 27    unicode String:: path-ascii-doc-example-http://example.com/data/mydata?row=24 [org.dataone.integration.it.testImplementations.ReadTestImplementations]
20200805-05:18:50: [INFO]: RestClient.doRequestNoBody, thread(1) call Info: GET https://cn-dev-ucsb-1.test.dataone.org/cn/v1/meta/Test2020217221850360_path-ascii-doc-example-http:%2F%2Fexample.com%2Fdata%2Fmydata%3Frow=24 [org.dataone.client.rest.RestClient]
20200805-05:18:50: [INFO]:  [org.dataone.integration.it.testImplementations.ReadTestImplementations]
20200805-05:18:50: [INFO]: 28    unicode String:: common-bmp-doc-example-ฉันกินกระจกได้ [org.dataone.integration.it.testImplementations.ReadTestImplementations]
20200805-05:18:50: [INFO]: RestClient.doRequestNoBody, thread(1) call Info: GET https://cn-dev-ucsb-1.test.dataone.org/cn/v1/meta/Test2020217221850363_common-bmp-doc-example-%E0%B8%89%E0%B8%B1%E0%B8%99%E0%B8%81%E0%B8%B4%E0%B8%99%E0%B8%81%E0%B8%A3%E0%B8%B0%E0%B8%88%E0%B8%81%E0%B9%84%E0%B8%94%E0%B9%89 [org.dataone.client.rest.RestClient]
20200805-05:18:50: [INFO]:  [org.dataone.integration.it.testImplementations.ReadTestImplementations]
20200805-05:18:50: [INFO]: 29    unicode String:: common-bmp-doc-example-Is_féidir_liom_ithe_gloine [org.dataone.integration.it.testImplementations.ReadTestImplementations]
20200805-05:18:50: [INFO]: RestClient.doRequestNoBody, thread(1) call Info: GET https://cn-dev-ucsb-1.test.dataone.org/cn/v1/meta/Test2020217221850367_common-bmp-doc-example-Is_f%C3%A9idir_liom_ithe_gloine [org.dataone.client.rest.RestClient]
20200805-05:18:50: [INFO]: **************************************************** [org.dataone.integration.ContextAwareTestCaseDataone]
20200805-05:18:50: [INFO]: ***  context label:   SINGLE_CN [org.dataone.integration.ContextAwareTestCaseDataone]
20200805-05:18:50: [INFO]: **************************************************** [org.dataone.integration.ContextAwareTestCaseDataone]
~~~ Context is solo CoordinatingNode: https://cn-dev-ucsb-1.test.dataone.org/cn
20200805-05:18:50: [INFO]: **************************************************** [org.dataone.integration.ContextAwareTestCaseDataone]
                          nodeId  key                       value
=============================================================================================================
20200805-05:18:50: [INFO]: 
***************** running test for testGetChecksum() vs. node: https://cn-dev-ucsb-1.test.dataone.org/cn/v1 ***************** [org.dataone.integration.ContextAwareTestCaseDataone]
20200805-05:18:50: [INFO]: RestClient.doRequestNoBody, thread(1) call Info: GET https://cn-dev-ucsb-1.test.dataone.org/cn/v1/meta/TierTesting:cn-dev-ucsb-1:Public_READ.15 [org.dataone.client.rest.RestClient]
20200805-05:18:50: [INFO]: RestClient.doRequestNoBody, thread(1) call Info: GET https://cn-dev-ucsb-1.test.dataone.org/cn/v1/object [org.dataone.client.rest.RestClient]
org.dataone.integration.TestIterationEndingException: could not create a test object and listObjects() threw exception:: ServiceFailure :: class org.dataone.client.exception.ClientSideException: /Connect to cn-dev-ucsb-1.test.dataone.org:443 [cn-dev-ucsb-1.test.dataone.org/128.111.85.178] failed: Connection refused (Connection refused)
	at org.dataone.integration.ContextAwareTestCaseDataone.findPublicReadableObject(ContextAwareTestCaseDataone.java:935)
	at org.dataone.integration.ContextAwareTestCaseDataone.procurePublicReadableTestObject(ContextAwareTestCaseDataone.java:876)
	at org.dataone.integration.it.testImplementations.ReadTestImplementations.testGetChecksum(ReadTestImplementations.java:482)
	at org.dataone.integration.it.testImplementations.ReadTestImplementations.testGetChecksum(ReadTestImplementations.java:469)
	at org.dataone.integration.it.apiTests.CNReadV1IT.testGetChecksum(CNReadV1IT.java:92)
	at sun.reflect.NativeMethodAccessorImpl.invoke0(Native Method)
	at sun.reflect.NativeMethodAccessorImpl.invoke(NativeMethodAccessorImpl.java:62)
	at sun.reflect.DelegatingMethodAccessorImpl.invoke(DelegatingMethodAccessorImpl.java:43)
	at java.lang.reflect.Method.invoke(Method.java:498)
	at org.junit.runners.model.FrameworkMethod$1.runReflectiveCall(FrameworkMethod.java:44)
	at org.junit.internal.runners.model.ReflectiveCallable.run(ReflectiveCallable.java:15)
	at org.junit.runners.model.FrameworkMethod.invokeExplosively(FrameworkMethod.java:41)
	at org.junit.internal.runners.statements.InvokeMethod.evaluate(InvokeMethod.java:20)
	at org.junit.rules.Verifier$1.evaluate(Verifier.java:34)
	at org.junit.internal.runners.statements.RunBefores.evaluate(RunBefores.java:28)
	at org.junit.runners.BlockJUnit4ClassRunner.runChild(BlockJUnit4ClassRunner.java:76)
	at org.junit.runners.BlockJUnit4ClassRunner.runChild(BlockJUnit4ClassRunner.java:50)
	at org.junit.runners.ParentRunner$3.run(ParentRunner.java:193)
	at org.junit.runners.ParentRunner$1.schedule(ParentRunner.java:52)
	at org.junit.runners.ParentRunner.runChildren(ParentRunner.java:191)
	at org.junit.runners.ParentRunner.access$000(ParentRunner.java:42)
	at org.junit.runners.ParentRunner$2.evaluate(ParentRunner.java:184)
	at org.junit.runners.ParentRunner.run(ParentRunner.java:236)
	at org.junit.runners.Suite.runChild(Suite.java:128)
	at org.junit.runners.Suite.runChild(Suite.java:24)
	at org.junit.runners.ParentRunner$3.run(ParentRunner.java:193)
	at org.junit.runners.ParentRunner$1.schedule(ParentRunner.java:52)
	at org.junit.runners.ParentRunner.runChildren(ParentRunner.java:191)
	at org.junit.runners.ParentRunner.access$000(ParentRunner.java:42)
	at org.junit.runners.ParentRunner$2.evaluate(ParentRunner.java:184)
	at org.junit.runners.ParentRunner.run(ParentRunner.java:236)
	at org.apache.maven.surefire.junit4.JUnit4TestSet.execute(JUnit4TestSet.java:53)
	at org.apache.maven.surefire.junit4.JUnit4Provider.executeTestSet(JUnit4Provider.java:119)
	at org.apache.maven.surefire.junit4.JUnit4Provider.invoke(JUnit4Provider.java:101)
	at sun.reflect.NativeMethodAccessorImpl.invoke0(Native Method)
	at sun.reflect.NativeMethodAccessorImpl.invoke(NativeMethodAccessorImpl.java:62)
	at sun.reflect.DelegatingMethodAccessorImpl.invoke(DelegatingMethodAccessorImpl.java:43)
	at java.lang.reflect.Method.invoke(Method.java:498)
	at org.apache.maven.surefire.booter.ProviderFactory$ClassLoaderProxy.invoke(ProviderFactory.java:103)
	at com.sun.proxy.$Proxy0.invoke(Unknown Source)
	at org.apache.maven.surefire.booter.SurefireStarter.invokeProvider(SurefireStarter.java:150)
	at org.apache.maven.surefire.booter.SurefireStarter.runSuitesInProcess(SurefireStarter.java:91)
	at org.apache.maven.surefire.booter.ForkedBooter.main(ForkedBooter.java:69)
Caused by: org.dataone.service.exceptions.ServiceFailure: class org.dataone.client.exception.ClientSideException: /Connect to cn-dev-ucsb-1.test.dataone.org:443 [cn-dev-ucsb-1.test.dataone.org/128.111.85.178] failed: Connection refused (Connection refused)
	at org.dataone.client.rest.HttpMultipartRestClient.doGetRequest(HttpMultipartRestClient.java:349)
	at org.dataone.client.rest.HttpMultipartRestClient.doGetRequest(HttpMultipartRestClient.java:328)
	at org.dataone.client.v1.impl.MultipartCNode.listObjects(MultipartCNode.java:450)
	at org.dataone.integration.adapters.CommonCallAdapter.listObjects(CommonCallAdapter.java:377)
	at org.dataone.integration.adapters.CommonCallAdapter.listObjects(CommonCallAdapter.java:344)
	at org.dataone.integration.ContextAwareTestCaseDataone.findPublicReadableObject(ContextAwareTestCaseDataone.java:931)
	... 42 more
Caused by: org.dataone.client.exception.ClientSideException: /Connect to cn-dev-ucsb-1.test.dataone.org:443 [cn-dev-ucsb-1.test.dataone.org/128.111.85.178] failed: Connection refused (Connection refused)
	... 48 more
Caused by: org.apache.http.conn.HttpHostConnectException: Connect to cn-dev-ucsb-1.test.dataone.org:443 [cn-dev-ucsb-1.test.dataone.org/128.111.85.178] failed: Connection refused (Connection refused)
	at org.apache.http.impl.conn.HttpClientConnectionOperator.connect(HttpClientConnectionOperator.java:142)
	at org.apache.http.impl.conn.PoolingHttpClientConnectionManager.connect(PoolingHttpClientConnectionManager.java:319)
	at org.apache.http.impl.execchain.MainClientExec.establishRoute(MainClientExec.java:363)
	at org.apache.http.impl.execchain.MainClientExec.execute(MainClientExec.java:219)
	at org.apache.http.impl.client.cache.CachingExec.callBackend(CachingExec.java:578)
	at org.apache.http.impl.client.cache.CachingExec.handleCacheMiss(CachingExec.java:346)
	at org.apache.http.impl.client.cache.CachingExec.execute(CachingExec.java:265)
	at org.apache.http.impl.execchain.ProtocolExec.execute(ProtocolExec.java:195)
	at org.apache.http.impl.execchain.RetryExec.execute(RetryExec.java:86)
	at org.apache.http.impl.execchain.RedirectExec.execute(RedirectExec.java:108)
	at org.apache.http.impl.client.InternalHttpClient.doExecute(InternalHttpClient.java:184)
	at org.apache.http.impl.client.CloseableHttpClient.execute(CloseableHttpClient.java:82)
	at org.apache.http.impl.client.CloseableHttpClient.execute(CloseableHttpClient.java:106)
	at org.apache.http.impl.client.CloseableHttpClient.execute(CloseableHttpClient.java:57)
	at org.dataone.client.rest.RestClient.doRequest(RestClient.java:330)
	at org.dataone.client.rest.RestClient.doRequestNoBody(RestClient.java:264)
	at org.dataone.client.rest.RestClient.doGetRequest(RestClient.java:182)
	at org.dataone.client.rest.HttpMultipartRestClient.doGetRequest(HttpMultipartRestClient.java:339)
	... 47 more
Caused by: java.net.ConnectException: Connection refused (Connection refused)
	at java.net.PlainSocketImpl.socketConnect(Native Method)
	at java.net.AbstractPlainSocketImpl.doConnect(AbstractPlainSocketImpl.java:350)
	at java.net.AbstractPlainSocketImpl.connectToAddress(AbstractPlainSocketImpl.java:206)
	at java.net.AbstractPlainSocketImpl.connect(AbstractPlainSocketImpl.java:188)
	at java.net.SocksSocketImpl.connect(SocksSocketImpl.java:392)
	at java.net.Socket.connect(Socket.java:607)
	at org.apache.http.conn.ssl.SSLConnectionSocketFactory.connectSocket(SSLConnectionSocketFactory.java:244)
	at org.apache.http.impl.conn.HttpClientConnectionOperator.connect(HttpClientConnectionOperator.java:125)
	... 64 more
20200805-05:18:50: [INFO]: **************************************************** [org.dataone.integration.ContextAwareTestCaseDataone]
20200805-05:18:50: [INFO]: ***  context label:   SINGLE_CN [org.dataone.integration.ContextAwareTestCaseDataone]
20200805-05:18:50: [INFO]: **************************************************** [org.dataone.integration.ContextAwareTestCaseDataone]
~~~ Context is solo CoordinatingNode: https://cn-dev-ucsb-1.test.dataone.org/cn
20200805-05:18:50: [INFO]: **************************************************** [org.dataone.integration.ContextAwareTestCaseDataone]
                          nodeId  key                       value
=============================================================================================================
20200805-05:18:50: [INFO]: 
***************** running test for testResolve(...) vs. node: https://cn-dev-ucsb-1.test.dataone.org/cn ***************** [org.dataone.integration.ContextAwareTestCaseDataone]
20200805-05:18:50: [INFO]: RestClient.doRequestNoBody, thread(1) call Info: GET https://cn-dev-ucsb-1.test.dataone.org/cn/v1/node [org.dataone.client.rest.RestClient]
20200805-05:18:50: [INFO]: RestClient.doRequestNoBody, thread(1) call Info: GET https://cn-dev-ucsb-1.test.dataone.org/cn/v1/object [org.dataone.client.rest.RestClient]
org.dataone.integration.TestIterationEndingException: unexpected error thrown by listObjects(): class org.dataone.client.exception.ClientSideException: /Connect to cn-dev-ucsb-1.test.dataone.org:443 [cn-dev-ucsb-1.test.dataone.org/128.111.85.178] failed: Connection refused (Connection refused)
	at org.dataone.integration.ContextAwareTestCaseDataone.procureObjectList(ContextAwareTestCaseDataone.java:790)
	at org.dataone.integration.ContextAwareTestCaseDataone.procureObjectList(ContextAwareTestCaseDataone.java:760)
	at org.dataone.integration.it.testImplementations.CNReadTestImplementations.testResolve(CNReadTestImplementations.java:69)
	at org.dataone.integration.it.testImplementations.CNReadTestImplementations.testResolve(CNReadTestImplementations.java:51)
	at org.dataone.integration.it.apiTests.CNReadV1IT.testResolve(CNReadV1IT.java:140)
	at sun.reflect.NativeMethodAccessorImpl.invoke0(Native Method)
	at sun.reflect.NativeMethodAccessorImpl.invoke(NativeMethodAccessorImpl.java:62)
	at sun.reflect.DelegatingMethodAccessorImpl.invoke(DelegatingMethodAccessorImpl.java:43)
	at java.lang.reflect.Method.invoke(Method.java:498)
	at org.junit.runners.model.FrameworkMethod$1.runReflectiveCall(FrameworkMethod.java:44)
	at org.junit.internal.runners.model.ReflectiveCallable.run(ReflectiveCallable.java:15)
	at org.junit.runners.model.FrameworkMethod.invokeExplosively(FrameworkMethod.java:41)
	at org.junit.internal.runners.statements.InvokeMethod.evaluate(InvokeMethod.java:20)
	at org.junit.rules.Verifier$1.evaluate(Verifier.java:34)
	at org.junit.internal.runners.statements.RunBefores.evaluate(RunBefores.java:28)
	at org.junit.runners.BlockJUnit4ClassRunner.runChild(BlockJUnit4ClassRunner.java:76)
	at org.junit.runners.BlockJUnit4ClassRunner.runChild(BlockJUnit4ClassRunner.java:50)
	at org.junit.runners.ParentRunner$3.run(ParentRunner.java:193)
	at org.junit.runners.ParentRunner$1.schedule(ParentRunner.java:52)
	at org.junit.runners.ParentRunner.runChildren(ParentRunner.java:191)
	at org.junit.runners.ParentRunner.access$000(ParentRunner.java:42)
	at org.junit.runners.ParentRunner$2.evaluate(ParentRunner.java:184)
	at org.junit.runners.ParentRunner.run(ParentRunner.java:236)
	at org.junit.runners.Suite.runChild(Suite.java:128)
	at org.junit.runners.Suite.runChild(Suite.java:24)
	at org.junit.runners.ParentRunner$3.run(ParentRunner.java:193)
	at org.junit.runners.ParentRunner$1.schedule(ParentRunner.java:52)
	at org.junit.runners.ParentRunner.runChildren(ParentRunner.java:191)
	at org.junit.runners.ParentRunner.access$000(ParentRunner.java:42)
	at org.junit.runners.ParentRunner$2.evaluate(ParentRunner.java:184)
	at org.junit.runners.ParentRunner.run(ParentRunner.java:236)
	at org.apache.maven.surefire.junit4.JUnit4TestSet.execute(JUnit4TestSet.java:53)
	at org.apache.maven.surefire.junit4.JUnit4Provider.executeTestSet(JUnit4Provider.java:119)
	at org.apache.maven.surefire.junit4.JUnit4Provider.invoke(JUnit4Provider.java:101)
	at sun.reflect.NativeMethodAccessorImpl.invoke0(Native Method)
	at sun.reflect.NativeMethodAccessorImpl.invoke(NativeMethodAccessorImpl.java:62)
	at sun.reflect.DelegatingMethodAccessorImpl.invoke(DelegatingMethodAccessorImpl.java:43)
	at java.lang.reflect.Method.invoke(Method.java:498)
	at org.apache.maven.surefire.booter.ProviderFactory$ClassLoaderProxy.invoke(ProviderFactory.java:103)
	at com.sun.proxy.$Proxy0.invoke(Unknown Source)
	at org.apache.maven.surefire.booter.SurefireStarter.invokeProvider(SurefireStarter.java:150)
	at org.apache.maven.surefire.booter.SurefireStarter.runSuitesInProcess(SurefireStarter.java:91)
	at org.apache.maven.surefire.booter.ForkedBooter.main(ForkedBooter.java:69)
Caused by: org.dataone.service.exceptions.ServiceFailure: class org.dataone.client.exception.ClientSideException: /Connect to cn-dev-ucsb-1.test.dataone.org:443 [cn-dev-ucsb-1.test.dataone.org/128.111.85.178] failed: Connection refused (Connection refused)
	at org.dataone.client.rest.HttpMultipartRestClient.doGetRequest(HttpMultipartRestClient.java:349)
	at org.dataone.client.rest.HttpMultipartRestClient.doGetRequest(HttpMultipartRestClient.java:328)
	at org.dataone.client.v1.impl.MultipartCNode.listObjects(MultipartCNode.java:450)
	at org.dataone.integration.adapters.CommonCallAdapter.listObjects(CommonCallAdapter.java:377)
	at org.dataone.integration.adapters.CommonCallAdapter.listObjects(CommonCallAdapter.java:344)
	at org.dataone.integration.ContextAwareTestCaseDataone.procureObjectList(ContextAwareTestCaseDataone.java:787)
	... 42 more
Caused by: org.dataone.client.exception.ClientSideException: /Connect to cn-dev-ucsb-1.test.dataone.org:443 [cn-dev-ucsb-1.test.dataone.org/128.111.85.178] failed: Connection refused (Connection refused)
	... 48 more
Caused by: org.apache.http.conn.HttpHostConnectException: Connect to cn-dev-ucsb-1.test.dataone.org:443 [cn-dev-ucsb-1.test.dataone.org/128.111.85.178] failed: Connection refused (Connection refused)
	at org.apache.http.impl.conn.HttpClientConnectionOperator.connect(HttpClientConnectionOperator.java:142)
	at org.apache.http.impl.conn.PoolingHttpClientConnectionManager.connect(PoolingHttpClientConnectionManager.java:319)
	at org.apache.http.impl.execchain.MainClientExec.establishRoute(MainClientExec.java:363)
	at org.apache.http.impl.execchain.MainClientExec.execute(MainClientExec.java:219)
	at org.apache.http.impl.client.cache.CachingExec.callBackend(CachingExec.java:578)
	at org.apache.http.impl.client.cache.CachingExec.handleCacheMiss(CachingExec.java:346)
	at org.apache.http.impl.client.cache.CachingExec.execute(CachingExec.java:265)
	at org.apache.http.impl.execchain.ProtocolExec.execute(ProtocolExec.java:195)
	at org.apache.http.impl.execchain.RetryExec.execute(RetryExec.java:86)
	at org.apache.http.impl.execchain.RedirectExec.execute(RedirectExec.java:108)
	at org.apache.http.impl.client.InternalHttpClient.doExecute(InternalHttpClient.java:184)
	at org.apache.http.impl.client.CloseableHttpClient.execute(CloseableHttpClient.java:82)
	at org.apache.http.impl.client.CloseableHttpClient.execute(CloseableHttpClient.java:106)
	at org.apache.http.impl.client.CloseableHttpClient.execute(CloseableHttpClient.java:57)
	at org.dataone.client.rest.RestClient.doRequest(RestClient.java:330)
	at org.dataone.client.rest.RestClient.doRequestNoBody(RestClient.java:264)
	at org.dataone.client.rest.RestClient.doGetRequest(RestClient.java:182)
	at org.dataone.client.rest.HttpMultipartRestClient.doGetRequest(HttpMultipartRestClient.java:339)
	... 47 more
Caused by: java.net.ConnectException: Connection refused (Connection refused)
	at java.net.PlainSocketImpl.socketConnect(Native Method)
	at java.net.AbstractPlainSocketImpl.doConnect(AbstractPlainSocketImpl.java:350)
	at java.net.AbstractPlainSocketImpl.connectToAddress(AbstractPlainSocketImpl.java:206)
	at java.net.AbstractPlainSocketImpl.connect(AbstractPlainSocketImpl.java:188)
	at java.net.SocksSocketImpl.connect(SocksSocketImpl.java:392)
	at java.net.Socket.connect(Socket.java:607)
	at org.apache.http.conn.ssl.SSLConnectionSocketFactory.connectSocket(SSLConnectionSocketFactory.java:244)
	at org.apache.http.impl.conn.HttpClientConnectionOperator.connect(HttpClientConnectionOperator.java:125)
	... 64 more
20200805-05:18:50: [INFO]: **************************************************** [org.dataone.integration.ContextAwareTestCaseDataone]
20200805-05:18:50: [INFO]: ***  context label:   SINGLE_CN [org.dataone.integration.ContextAwareTestCaseDataone]
20200805-05:18:50: [INFO]: **************************************************** [org.dataone.integration.ContextAwareTestCaseDataone]
~~~ Context is solo CoordinatingNode: https://cn-dev-ucsb-1.test.dataone.org/cn
20200805-05:18:50: [INFO]: **************************************************** [org.dataone.integration.ContextAwareTestCaseDataone]
                          nodeId  key                       value
=============================================================================================================
20200805-05:18:50: [INFO]: 
***************** running test for testSearch(...) vs. node: https://cn-dev-ucsb-1.test.dataone.org/cn/v1 ***************** [org.dataone.integration.ContextAwareTestCaseDataone]
20200805-05:18:50: [INFO]: RestClient.doRequestNoBody, thread(1) call Info: GET https://cn-dev-ucsb-1.test.dataone.org/cn/v1/search/solr/?q=*:* [org.dataone.client.rest.RestClient]
org.dataone.service.exceptions.ServiceFailure: class org.dataone.client.exception.ClientSideException: /Connect to cn-dev-ucsb-1.test.dataone.org:443 [cn-dev-ucsb-1.test.dataone.org/128.111.85.178] failed: Connection refused (Connection refused)
	at org.dataone.client.rest.HttpMultipartRestClient.doGetRequest(HttpMultipartRestClient.java:349)
	at org.dataone.client.rest.HttpMultipartRestClient.doGetRequest(HttpMultipartRestClient.java:328)
	at org.dataone.client.v1.impl.MultipartCNode.search(MultipartCNode.java:1153)
	at org.dataone.integration.adapters.CNCallAdapter.search(CNCallAdapter.java:101)
	at org.dataone.integration.it.testImplementations.CNReadTestImplementations.testSearch(CNReadTestImplementations.java:129)
	at org.dataone.integration.it.testImplementations.CNReadTestImplementations.testSearch(CNReadTestImplementations.java:119)
	at org.dataone.integration.it.apiTests.CNReadV1IT.testSearch(CNReadV1IT.java:146)
	at sun.reflect.NativeMethodAccessorImpl.invoke0(Native Method)
	at sun.reflect.NativeMethodAccessorImpl.invoke(NativeMethodAccessorImpl.java:62)
	at sun.reflect.DelegatingMethodAccessorImpl.invoke(DelegatingMethodAccessorImpl.java:43)
	at java.lang.reflect.Method.invoke(Method.java:498)
	at org.junit.runners.model.FrameworkMethod$1.runReflectiveCall(FrameworkMethod.java:44)
	at org.junit.internal.runners.model.ReflectiveCallable.run(ReflectiveCallable.java:15)
	at org.junit.runners.model.FrameworkMethod.invokeExplosively(FrameworkMethod.java:41)
	at org.junit.internal.runners.statements.InvokeMethod.evaluate(InvokeMethod.java:20)
	at org.junit.rules.Verifier$1.evaluate(Verifier.java:34)
	at org.junit.internal.runners.statements.RunBefores.evaluate(RunBefores.java:28)
	at org.junit.runners.BlockJUnit4ClassRunner.runChild(BlockJUnit4ClassRunner.java:76)
	at org.junit.runners.BlockJUnit4ClassRunner.runChild(BlockJUnit4ClassRunner.java:50)
	at org.junit.runners.ParentRunner$3.run(ParentRunner.java:193)
	at org.junit.runners.ParentRunner$1.schedule(ParentRunner.java:52)
	at org.junit.runners.ParentRunner.runChildren(ParentRunner.java:191)
	at org.junit.runners.ParentRunner.access$000(ParentRunner.java:42)
	at org.junit.runners.ParentRunner$2.evaluate(ParentRunner.java:184)
	at org.junit.runners.ParentRunner.run(ParentRunner.java:236)
	at org.junit.runners.Suite.runChild(Suite.java:128)
	at org.junit.runners.Suite.runChild(Suite.java:24)
	at org.junit.runners.ParentRunner$3.run(ParentRunner.java:193)
	at org.junit.runners.ParentRunner$1.schedule(ParentRunner.java:52)
	at org.junit.runners.ParentRunner.runChildren(ParentRunner.java:191)
	at org.junit.runners.ParentRunner.access$000(ParentRunner.java:42)
	at org.junit.runners.ParentRunner$2.evaluate(ParentRunner.java:184)
	at org.junit.runners.ParentRunner.run(ParentRunner.java:236)
	at org.apache.maven.surefire.junit4.JUnit4TestSet.execute(JUnit4TestSet.java:53)
	at org.apache.maven.surefire.junit4.JUnit4Provider.executeTestSet(JUnit4Provider.java:119)
	at org.apache.maven.surefire.junit4.JUnit4Provider.invoke(JUnit4Provider.java:101)
	at sun.reflect.NativeMethodAccessorImpl.invoke0(Native Method)
	at sun.reflect.NativeMethodAccessorImpl.invoke(NativeMethodAccessorImpl.java:62)
	at sun.reflect.DelegatingMethodAccessorImpl.invoke(DelegatingMethodAccessorImpl.java:43)
	at java.lang.reflect.Method.invoke(Method.java:498)
	at org.apache.maven.surefire.booter.ProviderFactory$ClassLoaderProxy.invoke(ProviderFactory.java:103)
	at com.sun.proxy.$Proxy0.invoke(Unknown Source)
	at org.apache.maven.surefire.booter.SurefireStarter.invokeProvider(SurefireStarter.java:150)
	at org.apache.maven.surefire.booter.SurefireStarter.runSuitesInProcess(SurefireStarter.java:91)
	at org.apache.maven.surefire.booter.ForkedBooter.main(ForkedBooter.java:69)
Caused by: org.dataone.client.exception.ClientSideException: /Connect to cn-dev-ucsb-1.test.dataone.org:443 [cn-dev-ucsb-1.test.dataone.org/128.111.85.178] failed: Connection refused (Connection refused)
	... 45 more
Caused by: org.apache.http.conn.HttpHostConnectException: Connect to cn-dev-ucsb-1.test.dataone.org:443 [cn-dev-ucsb-1.test.dataone.org/128.111.85.178] failed: Connection refused (Connection refused)
	at org.apache.http.impl.conn.HttpClientConnectionOperator.connect(HttpClientConnectionOperator.java:142)
	at org.apache.http.impl.conn.PoolingHttpClientConnectionManager.connect(PoolingHttpClientConnectionManager.java:319)
	at org.apache.http.impl.execchain.MainClientExec.establishRoute(MainClientExec.java:363)
	at org.apache.http.impl.execchain.MainClientExec.execute(MainClientExec.java:219)
	at org.apache.http.impl.client.cache.CachingExec.callBackend(CachingExec.java:578)
	at org.apache.http.impl.client.cache.CachingExec.handleCacheMiss(CachingExec.java:346)
	at org.apache.http.impl.client.cache.CachingExec.execute(CachingExec.java:265)
	at org.apache.http.impl.execchain.ProtocolExec.execute(ProtocolExec.java:195)
	at org.apache.http.impl.execchain.RetryExec.execute(RetryExec.java:86)
	at org.apache.http.impl.execchain.RedirectExec.execute(RedirectExec.java:108)
	at org.apache.http.impl.client.InternalHttpClient.doExecute(InternalHttpClient.java:184)
	at org.apache.http.impl.client.CloseableHttpClient.execute(CloseableHttpClient.java:82)
	at org.apache.http.impl.client.CloseableHttpClient.execute(CloseableHttpClient.java:106)
	at org.apache.http.impl.client.CloseableHttpClient.execute(CloseableHttpClient.java:57)
	at org.dataone.client.rest.RestClient.doRequest(RestClient.java:330)
	at org.dataone.client.rest.RestClient.doRequestNoBody(RestClient.java:264)
	at org.dataone.client.rest.RestClient.doGetRequest(RestClient.java:182)
	at org.dataone.client.rest.HttpMultipartRestClient.doGetRequest(HttpMultipartRestClient.java:339)
	... 44 more
Caused by: java.net.ConnectException: Connection refused (Connection refused)
	at java.net.PlainSocketImpl.socketConnect(Native Method)
	at java.net.AbstractPlainSocketImpl.doConnect(AbstractPlainSocketImpl.java:350)
	at java.net.AbstractPlainSocketImpl.connectToAddress(AbstractPlainSocketImpl.java:206)
	at java.net.AbstractPlainSocketImpl.connect(AbstractPlainSocketImpl.java:188)
	at java.net.SocksSocketImpl.connect(SocksSocketImpl.java:392)
	at java.net.Socket.connect(Socket.java:607)
	at org.apache.http.conn.ssl.SSLConnectionSocketFactory.connectSocket(SSLConnectionSocketFactory.java:244)
	at org.apache.http.impl.conn.HttpClientConnectionOperator.connect(HttpClientConnectionOperator.java:125)
	... 61 more
20200805-05:18:50: [INFO]: **************************************************** [org.dataone.integration.ContextAwareTestCaseDataone]
20200805-05:18:50: [INFO]: ***  context label:   SINGLE_CN [org.dataone.integration.ContextAwareTestCaseDataone]
20200805-05:18:50: [INFO]: **************************************************** [org.dataone.integration.ContextAwareTestCaseDataone]
~~~ Context is solo CoordinatingNode: https://cn-dev-ucsb-1.test.dataone.org/cn
20200805-05:18:50: [INFO]: **************************************************** [org.dataone.integration.ContextAwareTestCaseDataone]
                          nodeId  key                       value
=============================================================================================================
20200805-05:18:50: [INFO]: 
***************** running test for testGet() vs. node: https://cn-dev-ucsb-1.test.dataone.org/cn/v1 ***************** [org.dataone.integration.ContextAwareTestCaseDataone]
20200805-05:18:50: [INFO]: RestClient.doRequestNoBody, thread(1) call Info: GET https://cn-dev-ucsb-1.test.dataone.org/cn/v1/meta/TierTesting:cn-dev-ucsb-1:Public_READ.15 [org.dataone.client.rest.RestClient]
20200805-05:18:50: [INFO]: RestClient.doRequestNoBody, thread(1) call Info: GET https://cn-dev-ucsb-1.test.dataone.org/cn/v1/object [org.dataone.client.rest.RestClient]
20200805-05:18:50: [INFO]: **************************************************** [org.dataone.integration.ContextAwareTestCaseDataone]
20200805-05:18:50: [INFO]: ***  context label:   SINGLE_CN [org.dataone.integration.ContextAwareTestCaseDataone]
20200805-05:18:50: [INFO]: **************************************************** [org.dataone.integration.ContextAwareTestCaseDataone]
~~~ Context is solo CoordinatingNode: https://cn-dev-ucsb-1.test.dataone.org/cn
20200805-05:18:50: [INFO]: **************************************************** [org.dataone.integration.ContextAwareTestCaseDataone]
                          nodeId  key                       value
=============================================================================================================
20200805-05:18:50: [INFO]: certificate directory: /etc/dataone/client/testClientCerts/ [org.dataone.integration.ContextAwareTestCaseDataone]
20200805-05:18:50: [INFO]: certificate filename: testPerson [org.dataone.integration.ContextAwareTestCaseDataone]
20200805-05:18:50: [INFO]: client setup as Subject: CN=testPerson,DC=dataone,DC=org [org.dataone.integration.ContextAwareTestCaseDataone]
20200805-05:18:50: [WARN]: registering ConnectionManager... [org.dataone.client.utils.HttpConnectionMonitorService]
20200805-05:18:50: [INFO]: created client for certificate file: testPerson with subject: CN=testPerson,DC=dataone,DC=org [org.dataone.integration.ContextAwareTestCaseDataone]
20200805-05:18:50: [INFO]: 
***************** running test for testIsAuthorized() vs. node: https://cn-dev-ucsb-1.test.dataone.org/cn/v1 ***************** [org.dataone.integration.ContextAwareTestCaseDataone]
org.dataone.integration.TestIterationEndingException: could not create a test object and listObjects() threw exception:: ServiceFailure :: Certificate is expired (or not yet valid): certificate expired on 20180519185322GMT+00:00
	at org.dataone.integration.ContextAwareTestCaseDataone.findPublicReadableObject(ContextAwareTestCaseDataone.java:935)
	at org.dataone.integration.ContextAwareTestCaseDataone.procurePublicReadableTestObject(ContextAwareTestCaseDataone.java:876)
	at org.dataone.integration.it.testImplementations.AuthAPITestImplementations.testIsAuthorized(AuthAPITestImplementations.java:46)
	at org.dataone.integration.it.testImplementations.AuthAPITestImplementations.testIsAuthorized(AuthAPITestImplementations.java:28)
	at org.dataone.integration.it.apiTests.CNAuthorizationV1IT.testIsAuthorized(CNAuthorizationV1IT.java:47)
	at sun.reflect.NativeMethodAccessorImpl.invoke0(Native Method)
	at sun.reflect.NativeMethodAccessorImpl.invoke(NativeMethodAccessorImpl.java:62)
	at sun.reflect.DelegatingMethodAccessorImpl.invoke(DelegatingMethodAccessorImpl.java:43)
	at java.lang.reflect.Method.invoke(Method.java:498)
	at org.junit.runners.model.FrameworkMethod$1.runReflectiveCall(FrameworkMethod.java:44)
	at org.junit.internal.runners.model.ReflectiveCallable.run(ReflectiveCallable.java:15)
	at org.junit.runners.model.FrameworkMethod.invokeExplosively(FrameworkMethod.java:41)
	at org.junit.internal.runners.statements.InvokeMethod.evaluate(InvokeMethod.java:20)
	at org.junit.rules.Verifier$1.evaluate(Verifier.java:34)
	at org.junit.internal.runners.statements.RunBefores.evaluate(RunBefores.java:28)
	at org.junit.runners.BlockJUnit4ClassRunner.runChild(BlockJUnit4ClassRunner.java:76)
	at org.junit.runners.BlockJUnit4ClassRunner.runChild(BlockJUnit4ClassRunner.java:50)
	at org.junit.runners.ParentRunner$3.run(ParentRunner.java:193)
	at org.junit.runners.ParentRunner$1.schedule(ParentRunner.java:52)
	at org.junit.runners.ParentRunner.runChildren(ParentRunner.java:191)
	at org.junit.runners.ParentRunner.access$000(ParentRunner.java:42)
	at org.junit.runners.ParentRunner$2.evaluate(ParentRunner.java:184)
	at org.junit.runners.ParentRunner.run(ParentRunner.java:236)
	at org.junit.runners.Suite.runChild(Suite.java:128)
	at org.junit.runners.Suite.runChild(Suite.java:24)
	at org.junit.runners.ParentRunner$3.run(ParentRunner.java:193)
	at org.junit.runners.ParentRunner$1.schedule(ParentRunner.java:52)
	at org.junit.runners.ParentRunner.runChildren(ParentRunner.java:191)
	at org.junit.runners.ParentRunner.access$000(ParentRunner.java:42)
	at org.junit.runners.ParentRunner$2.evaluate(ParentRunner.java:184)
	at org.junit.runners.ParentRunner.run(ParentRunner.java:236)
	at org.apache.maven.surefire.junit4.JUnit4TestSet.execute(JUnit4TestSet.java:53)
	at org.apache.maven.surefire.junit4.JUnit4Provider.executeTestSet(JUnit4Provider.java:119)
	at org.apache.maven.surefire.junit4.JUnit4Provider.invoke(JUnit4Provider.java:101)
	at sun.reflect.NativeMethodAccessorImpl.invoke0(Native Method)
	at sun.reflect.NativeMethodAccessorImpl.invoke(NativeMethodAccessorImpl.java:62)
	at sun.reflect.DelegatingMethodAccessorImpl.invoke(DelegatingMethodAccessorImpl.java:43)
	at java.lang.reflect.Method.invoke(Method.java:498)
	at org.apache.maven.surefire.booter.ProviderFactory$ClassLoaderProxy.invoke(ProviderFactory.java:103)
	at com.sun.proxy.$Proxy0.invoke(Unknown Source)
	at org.apache.maven.surefire.booter.SurefireStarter.invokeProvider(SurefireStarter.java:150)
	at org.apache.maven.surefire.booter.SurefireStarter.runSuitesInProcess(SurefireStarter.java:91)
	at org.apache.maven.surefire.booter.ForkedBooter.main(ForkedBooter.java:69)
Caused by: org.dataone.service.exceptions.ServiceFailure: Certificate is expired (or not yet valid): certificate expired on 20180519185322GMT+00:00
	at org.dataone.client.rest.MultipartD1Node.getRestClient(MultipartD1Node.java:161)
	at org.dataone.client.v1.impl.MultipartCNode.listObjects(MultipartCNode.java:450)
	at org.dataone.integration.adapters.CommonCallAdapter.listObjects(CommonCallAdapter.java:377)
	at org.dataone.integration.adapters.CommonCallAdapter.listObjects(CommonCallAdapter.java:344)
	at org.dataone.integration.ContextAwareTestCaseDataone.findPublicReadableObject(ContextAwareTestCaseDataone.java:931)
	... 42 more
20200805-05:18:50: [INFO]: **************************************************** [org.dataone.integration.ContextAwareTestCaseDataone]
20200805-05:18:50: [INFO]: ***  context label:   SINGLE_CN [org.dataone.integration.ContextAwareTestCaseDataone]
20200805-05:18:50: [INFO]: **************************************************** [org.dataone.integration.ContextAwareTestCaseDataone]
~~~ Context is solo CoordinatingNode: https://cn-dev-ucsb-1.test.dataone.org/cn
20200805-05:18:50: [INFO]: **************************************************** [org.dataone.integration.ContextAwareTestCaseDataone]
                          nodeId  key                       value
=============================================================================================================
20200805-05:18:50: [INFO]: 
***************** running test for testSetRightsHolder(...) vs. node: https://cn-dev-ucsb-1.test.dataone.org/cn ***************** [org.dataone.integration.ContextAwareTestCaseDataone]
20200805-05:18:50: [INFO]: created client for certificate file: cnStageUNM1 with subject: CN=urn:node:cnStageUNM1,DC=dataone,DC=org [org.dataone.integration.ContextAwareTestCaseDataone]
20200805-05:18:50: [INFO]: certificate directory: /etc/dataone/client/testClientCerts/ [org.dataone.integration.ContextAwareTestCaseDataone]
20200805-05:18:50: [INFO]: certificate filename: testRightsHolder [org.dataone.integration.ContextAwareTestCaseDataone]
20200805-05:18:50: [INFO]: client setup as Subject: CN=testRightsHolder,DC=dataone,DC=org [org.dataone.integration.ContextAwareTestCaseDataone]
20200805-05:18:50: [WARN]: registering ConnectionManager... [org.dataone.client.utils.HttpConnectionMonitorService]
20200805-05:18:50: [INFO]: created client for certificate file: testRightsHolder with subject: CN=testRightsHolder,DC=dataone,DC=org [org.dataone.integration.ContextAwareTestCaseDataone]
20200805-05:18:50: [INFO]: created client for certificate file: testPerson with subject: CN=testPerson,DC=dataone,DC=org [org.dataone.integration.ContextAwareTestCaseDataone]
20200805-05:18:50: [INFO]: certificate directory: /etc/dataone/client/testClientCerts/ [org.dataone.integration.ContextAwareTestCaseDataone]
20200805-05:18:50: [INFO]: certificate filename: cnStageUNM1 [org.dataone.integration.ContextAwareTestCaseDataone]
20200805-05:18:50: [INFO]: client setup as Subject: CN=urn:node:cnStageUNM1,DC=dataone,DC=org [org.dataone.integration.ContextAwareTestCaseDataone]
org.dataone.client.exception.ClientSideException: Unable to create test object!/Certificate is expired (or not yet valid): certificate expired on 20180430024028GMT+00:00
	at org.dataone.integration.ContextAwareTestCaseDataone.createTestObject(ContextAwareTestCaseDataone.java:1642)
	at org.dataone.integration.ContextAwareTestCaseDataone.createTestObject(ContextAwareTestCaseDataone.java:1462)
	at org.dataone.integration.ContextAwareTestCaseDataone.createTestObject(ContextAwareTestCaseDataone.java:1415)
	at org.dataone.integration.ContextAwareTestCaseDataone.createTestObject(ContextAwareTestCaseDataone.java:1374)
	at org.dataone.integration.ContextAwareTestCaseDataone.createTestObject(ContextAwareTestCaseDataone.java:1383)
	at org.dataone.integration.it.testImplementations.CNAuthTestImplementations.testSetRightsHolder(CNAuthTestImplementations.java:75)
	at org.dataone.integration.it.testImplementations.CNAuthTestImplementations.testSetRightsHolder(CNAuthTestImplementations.java:51)
	at org.dataone.integration.it.apiTests.CNAuthorizationV1IT.testSetRightsHolder(CNAuthorizationV1IT.java:53)
	at sun.reflect.NativeMethodAccessorImpl.invoke0(Native Method)
	at sun.reflect.NativeMethodAccessorImpl.invoke(NativeMethodAccessorImpl.java:62)
	at sun.reflect.DelegatingMethodAccessorImpl.invoke(DelegatingMethodAccessorImpl.java:43)
	at java.lang.reflect.Method.invoke(Method.java:498)
	at org.junit.runners.model.FrameworkMethod$1.runReflectiveCall(FrameworkMethod.java:44)
	at org.junit.internal.runners.model.ReflectiveCallable.run(ReflectiveCallable.java:15)
	at org.junit.runners.model.FrameworkMethod.invokeExplosively(FrameworkMethod.java:41)
	at org.junit.internal.runners.statements.InvokeMethod.evaluate(InvokeMethod.java:20)
	at org.junit.rules.Verifier$1.evaluate(Verifier.java:34)
	at org.junit.internal.runners.statements.RunBefores.evaluate(RunBefores.java:28)
	at org.junit.runners.BlockJUnit4ClassRunner.runChild(BlockJUnit4ClassRunner.java:76)
	at org.junit.runners.BlockJUnit4ClassRunner.runChild(BlockJUnit4ClassRunner.java:50)
	at org.junit.runners.ParentRunner$3.run(ParentRunner.java:193)
	at org.junit.runners.ParentRunner$1.schedule(ParentRunner.java:52)
	at org.junit.runners.ParentRunner.runChildren(ParentRunner.java:191)
	at org.junit.runners.ParentRunner.access$000(ParentRunner.java:42)
	at org.junit.runners.ParentRunner$2.evaluate(ParentRunner.java:184)
	at org.junit.runners.ParentRunner.run(ParentRunner.java:236)
	at org.junit.runners.Suite.runChild(Suite.java:128)
	at org.junit.runners.Suite.runChild(Suite.java:24)
	at org.junit.runners.ParentRunner$3.run(ParentRunner.java:193)
	at org.junit.runners.ParentRunner$1.schedule(ParentRunner.java:52)
	at org.junit.runners.ParentRunner.runChildren(ParentRunner.java:191)
	at org.junit.runners.ParentRunner.access$000(ParentRunner.java:42)
	at org.junit.runners.ParentRunner$2.evaluate(ParentRunner.java:184)
	at org.junit.runners.ParentRunner.run(ParentRunner.java:236)
	at org.apache.maven.surefire.junit4.JUnit4TestSet.execute(JUnit4TestSet.java:53)
	at org.apache.maven.surefire.junit4.JUnit4Provider.executeTestSet(JUnit4Provider.java:119)
	at org.apache.maven.surefire.junit4.JUnit4Provider.invoke(JUnit4Provider.java:101)
	at sun.reflect.NativeMethodAccessorImpl.invoke0(Native Method)
	at sun.reflect.NativeMethodAccessorImpl.invoke(NativeMethodAccessorImpl.java:62)
	at sun.reflect.DelegatingMethodAccessorImpl.invoke(DelegatingMethodAccessorImpl.java:43)
	at java.lang.reflect.Method.invoke(Method.java:498)
	at org.apache.maven.surefire.booter.ProviderFactory$ClassLoaderProxy.invoke(ProviderFactory.java:103)
	at com.sun.proxy.$Proxy0.invoke(Unknown Source)
	at org.apache.maven.surefire.booter.SurefireStarter.invokeProvider(SurefireStarter.java:150)
	at org.apache.maven.surefire.booter.SurefireStarter.runSuitesInProcess(SurefireStarter.java:91)
	at org.apache.maven.surefire.booter.ForkedBooter.main(ForkedBooter.java:69)
Caused by: org.dataone.service.exceptions.ServiceFailure: Certificate is expired (or not yet valid): certificate expired on 20180430024028GMT+00:00
	at org.dataone.client.rest.MultipartD1Node.getRestClient(MultipartD1Node.java:161)
	at org.dataone.client.v1.impl.MultipartCNode.listNodes(MultipartCNode.java:565)
	at org.dataone.integration.adapters.CNCallAdapter.listNodes(CNCallAdapter.java:497)
	at org.dataone.integration.ContextAwareTestCaseDataone.createTestObject(ContextAwareTestCaseDataone.java:1545)
	... 45 more
20200805-05:18:50: [INFO]: **************************************************** [org.dataone.integration.ContextAwareTestCaseDataone]
20200805-05:18:50: [INFO]: ***  context label:   SINGLE_CN [org.dataone.integration.ContextAwareTestCaseDataone]
20200805-05:18:50: [INFO]: **************************************************** [org.dataone.integration.ContextAwareTestCaseDataone]
~~~ Context is solo CoordinatingNode: https://cn-dev-ucsb-1.test.dataone.org/cn
20200805-05:18:50: [INFO]: **************************************************** [org.dataone.integration.ContextAwareTestCaseDataone]
                          nodeId  key                       value
=============================================================================================================
20200805-05:18:50: [INFO]: created client for certificate file: cnStageUNM1 with subject: CN=urn:node:cnStageUNM1,DC=dataone,DC=org [org.dataone.integration.ContextAwareTestCaseDataone]
20200805-05:18:50: [INFO]: created client for certificate file: testRightsHolder with subject: CN=testRightsHolder,DC=dataone,DC=org [org.dataone.integration.ContextAwareTestCaseDataone]
20200805-05:18:50: [INFO]: created client for certificate file: testPerson with subject: CN=testPerson,DC=dataone,DC=org [org.dataone.integration.ContextAwareTestCaseDataone]
20200805-05:18:50: [INFO]: created client for certificate file: testSubmitter with subject: public [org.dataone.integration.ContextAwareTestCaseDataone]
20200805-05:18:50: [INFO]: 
***************** running test for testSetAccessPolicy() vs. node: https://cn-dev-ucsb-1.test.dataone.org/cn/v1 ***************** [org.dataone.integration.ContextAwareTestCaseDataone]
20200805-05:18:50: [INFO]: **************************************************** [org.dataone.integration.ContextAwareTestCaseDataone]
20200805-05:18:50: [INFO]: ***  context label:   SINGLE_CN [org.dataone.integration.ContextAwareTestCaseDataone]
20200805-05:18:50: [INFO]: **************************************************** [org.dataone.integration.ContextAwareTestCaseDataone]
~~~ Context is solo CoordinatingNode: https://cn-dev-ucsb-1.test.dataone.org/cn
20200805-05:18:50: [INFO]: **************************************************** [org.dataone.integration.ContextAwareTestCaseDataone]
                          nodeId  key                       value
=============================================================================================================
20200805-05:18:50: [INFO]: created client for certificate file: cnStageUNM1 with subject: CN=urn:node:cnStageUNM1,DC=dataone,DC=org [org.dataone.integration.ContextAwareTestCaseDataone]
20200805-05:18:50: [INFO]: **************************************************** [org.dataone.integration.ContextAwareTestCaseDataone]
20200805-05:18:50: [INFO]: ***  context label:   SINGLE_CN [org.dataone.integration.ContextAwareTestCaseDataone]
20200805-05:18:50: [INFO]: **************************************************** [org.dataone.integration.ContextAwareTestCaseDataone]
~~~ Context is solo CoordinatingNode: https://cn-dev-ucsb-1.test.dataone.org/cn
20200805-05:18:50: [INFO]: **************************************************** [org.dataone.integration.ContextAwareTestCaseDataone]
                          nodeId  key                       value
=============================================================================================================
20200805-05:18:50: [INFO]: created client for certificate file: cnStageUNM1 with subject: CN=urn:node:cnStageUNM1,DC=dataone,DC=org [org.dataone.integration.ContextAwareTestCaseDataone]
20200805-05:18:50: [INFO]: **************************************************** [org.dataone.integration.ContextAwareTestCaseDataone]
20200805-05:18:50: [INFO]: ***  context label:   SINGLE_CN [org.dataone.integration.ContextAwareTestCaseDataone]
20200805-05:18:50: [INFO]: **************************************************** [org.dataone.integration.ContextAwareTestCaseDataone]
~~~ Context is solo CoordinatingNode: https://cn-dev-ucsb-1.test.dataone.org/cn
20200805-05:18:50: [INFO]: **************************************************** [org.dataone.integration.ContextAwareTestCaseDataone]
                          nodeId  key                       value
=============================================================================================================
20200805-05:18:50: [INFO]: created client for certificate file: cnStageUNM1 with subject: CN=urn:node:cnStageUNM1,DC=dataone,DC=org [org.dataone.integration.ContextAwareTestCaseDataone]
20200805-05:18:50: [INFO]: **************************************************** [org.dataone.integration.ContextAwareTestCaseDataone]
20200805-05:18:50: [INFO]: ***  context label:   SINGLE_CN [org.dataone.integration.ContextAwareTestCaseDataone]
20200805-05:18:50: [INFO]: **************************************************** [org.dataone.integration.ContextAwareTestCaseDataone]
~~~ Context is solo CoordinatingNode: https://cn-dev-ucsb-1.test.dataone.org/cn
20200805-05:18:50: [INFO]: **************************************************** [org.dataone.integration.ContextAwareTestCaseDataone]
                          nodeId  key                       value
=============================================================================================================
20200805-05:18:50: [INFO]: created client for certificate file: cnStageUNM1 with subject: CN=urn:node:cnStageUNM1,DC=dataone,DC=org [org.dataone.integration.ContextAwareTestCaseDataone]
20200805-05:18:50: [INFO]: **************************************************** [org.dataone.integration.ContextAwareTestCaseDataone]
20200805-05:18:50: [INFO]: ***  context label:   SINGLE_CN [org.dataone.integration.ContextAwareTestCaseDataone]
20200805-05:18:50: [INFO]: **************************************************** [org.dataone.integration.ContextAwareTestCaseDataone]
~~~ Context is solo CoordinatingNode: https://cn-dev-ucsb-1.test.dataone.org/cn
20200805-05:18:50: [INFO]: **************************************************** [org.dataone.integration.ContextAwareTestCaseDataone]
                          nodeId  key                       value
=============================================================================================================
20200805-05:18:50: [INFO]: created client for certificate file: cnStageUNM1 with subject: CN=urn:node:cnStageUNM1,DC=dataone,DC=org [org.dataone.integration.ContextAwareTestCaseDataone]
20200805-05:18:50: [INFO]: **************************************************** [org.dataone.integration.ContextAwareTestCaseDataone]
20200805-05:18:50: [INFO]: ***  context label:   SINGLE_CN [org.dataone.integration.ContextAwareTestCaseDataone]
20200805-05:18:50: [INFO]: **************************************************** [org.dataone.integration.ContextAwareTestCaseDataone]
~~~ Context is solo CoordinatingNode: https://cn-dev-ucsb-1.test.dataone.org/cn
20200805-05:18:50: [INFO]: **************************************************** [org.dataone.integration.ContextAwareTestCaseDataone]
                          nodeId  key                       value
=============================================================================================================
20200805-05:18:50: [INFO]: created client for certificate file: cnStageUNM1 with subject: CN=urn:node:cnStageUNM1,DC=dataone,DC=org [org.dataone.integration.ContextAwareTestCaseDataone]
20200805-05:18:50: [INFO]: **************************************************** [org.dataone.integration.ContextAwareTestCaseDataone]
20200805-05:18:50: [INFO]: ***  context label:   SINGLE_CN [org.dataone.integration.ContextAwareTestCaseDataone]
20200805-05:18:50: [INFO]: **************************************************** [org.dataone.integration.ContextAwareTestCaseDataone]
~~~ Context is solo CoordinatingNode: https://cn-dev-ucsb-1.test.dataone.org/cn
20200805-05:18:50: [INFO]: **************************************************** [org.dataone.integration.ContextAwareTestCaseDataone]
                          nodeId  key                       value
=============================================================================================================
20200805-05:18:50: [INFO]: created client for certificate file: cnStageUNM1 with subject: CN=urn:node:cnStageUNM1,DC=dataone,DC=org [org.dataone.integration.ContextAwareTestCaseDataone]
20200805-05:18:50: [INFO]: **************************************************** [org.dataone.integration.ContextAwareTestCaseDataone]
20200805-05:18:50: [INFO]: ***  context label:   SINGLE_CN [org.dataone.integration.ContextAwareTestCaseDataone]
20200805-05:18:50: [INFO]: **************************************************** [org.dataone.integration.ContextAwareTestCaseDataone]
~~~ Context is solo CoordinatingNode: https://cn-dev-ucsb-1.test.dataone.org/cn
20200805-05:18:50: [INFO]: **************************************************** [org.dataone.integration.ContextAwareTestCaseDataone]
                          nodeId  key                       value
=============================================================================================================
20200805-05:18:50: [INFO]: created client for certificate file: cnStageUNM1 with subject: CN=urn:node:cnStageUNM1,DC=dataone,DC=org [org.dataone.integration.ContextAwareTestCaseDataone]
20200805-05:18:50: [INFO]: **************************************************** [org.dataone.integration.ContextAwareTestCaseDataone]
20200805-05:18:50: [INFO]: ***  context label:   SINGLE_CN [org.dataone.integration.ContextAwareTestCaseDataone]
20200805-05:18:50: [INFO]: **************************************************** [org.dataone.integration.ContextAwareTestCaseDataone]
~~~ Context is solo CoordinatingNode: https://cn-dev-ucsb-1.test.dataone.org/cn
20200805-05:18:50: [INFO]: **************************************************** [org.dataone.integration.ContextAwareTestCaseDataone]
                          nodeId  key                       value
=============================================================================================================
20200805-05:18:50: [INFO]: created client for certificate file: cnStageUNM1 with subject: CN=urn:node:cnStageUNM1,DC=dataone,DC=org [org.dataone.integration.ContextAwareTestCaseDataone]
20200805-05:18:50: [INFO]: **************************************************** [org.dataone.integration.ContextAwareTestCaseDataone]
20200805-05:18:50: [INFO]: ***  context label:   SINGLE_CN [org.dataone.integration.ContextAwareTestCaseDataone]
20200805-05:18:50: [INFO]: **************************************************** [org.dataone.integration.ContextAwareTestCaseDataone]
~~~ Context is solo CoordinatingNode: https://cn-dev-ucsb-1.test.dataone.org/cn
20200805-05:18:50: [INFO]: **************************************************** [org.dataone.integration.ContextAwareTestCaseDataone]
                          nodeId  key                       value
=============================================================================================================
20200805-05:18:50: [INFO]: created client for certificate file: cnStageUNM1 with subject: CN=urn:node:cnStageUNM1,DC=dataone,DC=org [org.dataone.integration.ContextAwareTestCaseDataone]
20200805-05:18:50: [INFO]: **************************************************** [org.dataone.integration.ContextAwareTestCaseDataone]
20200805-05:18:50: [INFO]: ***  context label:   SINGLE_CN [org.dataone.integration.ContextAwareTestCaseDataone]
20200805-05:18:50: [INFO]: **************************************************** [org.dataone.integration.ContextAwareTestCaseDataone]
~~~ Context is solo CoordinatingNode: https://cn-dev-ucsb-1.test.dataone.org/cn
20200805-05:18:50: [INFO]: **************************************************** [org.dataone.integration.ContextAwareTestCaseDataone]
                          nodeId  key                       value
=============================================================================================================
20200805-05:18:50: [INFO]: created client for certificate file: cnStageUNM1 with subject: CN=urn:node:cnStageUNM1,DC=dataone,DC=org [org.dataone.integration.ContextAwareTestCaseDataone]
20200805-05:18:50: [INFO]: **************************************************** [org.dataone.integration.ContextAwareTestCaseDataone]
20200805-05:18:50: [INFO]: ***  context label:   SINGLE_CN [org.dataone.integration.ContextAwareTestCaseDataone]
20200805-05:18:50: [INFO]: **************************************************** [org.dataone.integration.ContextAwareTestCaseDataone]
~~~ Context is solo CoordinatingNode: https://cn-dev-ucsb-1.test.dataone.org/cn
20200805-05:18:50: [INFO]: **************************************************** [org.dataone.integration.ContextAwareTestCaseDataone]
                          nodeId  key                       value
=============================================================================================================
20200805-05:18:50: [INFO]: created client for certificate file: cnStageUNM1 with subject: CN=urn:node:cnStageUNM1,DC=dataone,DC=org [org.dataone.integration.ContextAwareTestCaseDataone]
20200805-05:18:50: [INFO]: **************************************************** [org.dataone.integration.ContextAwareTestCaseDataone]
20200805-05:18:50: [INFO]: ***  context label:   SINGLE_CN [org.dataone.integration.ContextAwareTestCaseDataone]
20200805-05:18:50: [INFO]: **************************************************** [org.dataone.integration.ContextAwareTestCaseDataone]
~~~ Context is solo CoordinatingNode: https://cn-dev-ucsb-1.test.dataone.org/cn
20200805-05:18:50: [INFO]: **************************************************** [org.dataone.integration.ContextAwareTestCaseDataone]
                          nodeId  key                       value
=============================================================================================================
20200805-05:18:50: [INFO]: created client for certificate file: cnStageUNM1 with subject: CN=urn:node:cnStageUNM1,DC=dataone,DC=org [org.dataone.integration.ContextAwareTestCaseDataone]
20200805-05:18:50: [INFO]: **************************************************** [org.dataone.integration.ContextAwareTestCaseDataone]
20200805-05:18:50: [INFO]: ***  context label:   SINGLE_CN [org.dataone.integration.ContextAwareTestCaseDataone]
20200805-05:18:50: [INFO]: **************************************************** [org.dataone.integration.ContextAwareTestCaseDataone]
~~~ Context is solo CoordinatingNode: https://cn-dev-ucsb-1.test.dataone.org/cn
20200805-05:18:50: [INFO]: **************************************************** [org.dataone.integration.ContextAwareTestCaseDataone]
                          nodeId  key                       value
=============================================================================================================
20200805-05:18:50: [INFO]: created client for certificate file: testPerson with subject: CN=testPerson,DC=dataone,DC=org [org.dataone.integration.ContextAwareTestCaseDataone]
20200805-05:18:50: [INFO]: 
***************** running test for testRegisterAccount(...) vs. node: https://cn-dev-ucsb-1.test.dataone.org/cn ***************** [org.dataone.integration.ContextAwareTestCaseDataone]
20200805-05:18:50: [INFO]: **************************************************** [org.dataone.integration.ContextAwareTestCaseDataone]
20200805-05:18:50: [INFO]: ***  context label:   SINGLE_CN [org.dataone.integration.ContextAwareTestCaseDataone]
20200805-05:18:50: [INFO]: **************************************************** [org.dataone.integration.ContextAwareTestCaseDataone]
~~~ Context is solo CoordinatingNode: https://cn-dev-ucsb-1.test.dataone.org/cn
20200805-05:18:50: [INFO]: **************************************************** [org.dataone.integration.ContextAwareTestCaseDataone]
                          nodeId  key                       value
=============================================================================================================
20200805-05:18:50: [INFO]: 
***************** running test for testUpdateAccount(...) vs. node: https://cn-dev-ucsb-1.test.dataone.org/cn ***************** [org.dataone.integration.ContextAwareTestCaseDataone]
20200805-05:18:50: [INFO]: **************************************************** [org.dataone.integration.ContextAwareTestCaseDataone]
20200805-05:18:50: [INFO]: ***  context label:   SINGLE_CN [org.dataone.integration.ContextAwareTestCaseDataone]
20200805-05:18:50: [INFO]: **************************************************** [org.dataone.integration.ContextAwareTestCaseDataone]
~~~ Context is solo CoordinatingNode: https://cn-dev-ucsb-1.test.dataone.org/cn
20200805-05:18:50: [INFO]: **************************************************** [org.dataone.integration.ContextAwareTestCaseDataone]
                          nodeId  key                       value
=============================================================================================================
20200805-05:18:50: [INFO]: 
***************** running test for testVerifyAccount_NotAuthorized(...) vs. node: https://cn-dev-ucsb-1.test.dataone.org/cn ***************** [org.dataone.integration.ContextAwareTestCaseDataone]
20200805-05:18:50: [INFO]: RestClient.doRequestNoBody, thread(1) call Info: GET https://cn-dev-ucsb-1.test.dataone.org/cn/v1/accounts [org.dataone.client.rest.RestClient]
org.dataone.service.exceptions.ServiceFailure: class org.dataone.client.exception.ClientSideException: /Connect to cn-dev-ucsb-1.test.dataone.org:443 [cn-dev-ucsb-1.test.dataone.org/128.111.85.178] failed: Connection refused (Connection refused)
	at org.dataone.client.rest.HttpMultipartRestClient.doGetRequest(HttpMultipartRestClient.java:349)
	at org.dataone.client.rest.HttpMultipartRestClient.doGetRequest(HttpMultipartRestClient.java:328)
	at org.dataone.client.v1.impl.MultipartCNode.listSubjects(MultipartCNode.java:1528)
	at org.dataone.integration.adapters.CNCallAdapter.listSubjects(CNCallAdapter.java:270)
	at org.dataone.integration.it.testImplementations.CNIdentityTestImplementations.testVerifyAccount_NotAuthorized(CNIdentityTestImplementations.java:182)
	at org.dataone.integration.it.testImplementations.CNIdentityTestImplementations.testVerifyAccount_NotAuthorized(CNIdentityTestImplementations.java:170)
	at org.dataone.integration.it.apiTests.CNIdentityV1IT.testVerifyAccount_NotAuthorized(CNIdentityV1IT.java:58)
	at sun.reflect.NativeMethodAccessorImpl.invoke0(Native Method)
	at sun.reflect.NativeMethodAccessorImpl.invoke(NativeMethodAccessorImpl.java:62)
	at sun.reflect.DelegatingMethodAccessorImpl.invoke(DelegatingMethodAccessorImpl.java:43)
	at java.lang.reflect.Method.invoke(Method.java:498)
	at org.junit.runners.model.FrameworkMethod$1.runReflectiveCall(FrameworkMethod.java:44)
	at org.junit.internal.runners.model.ReflectiveCallable.run(ReflectiveCallable.java:15)
	at org.junit.runners.model.FrameworkMethod.invokeExplosively(FrameworkMethod.java:41)
	at org.junit.internal.runners.statements.InvokeMethod.evaluate(InvokeMethod.java:20)
	at org.junit.rules.Verifier$1.evaluate(Verifier.java:34)
	at org.junit.internal.runners.statements.RunBefores.evaluate(RunBefores.java:28)
	at org.junit.runners.BlockJUnit4ClassRunner.runChild(BlockJUnit4ClassRunner.java:76)
	at org.junit.runners.BlockJUnit4ClassRunner.runChild(BlockJUnit4ClassRunner.java:50)
	at org.junit.runners.ParentRunner$3.run(ParentRunner.java:193)
	at org.junit.runners.ParentRunner$1.schedule(ParentRunner.java:52)
	at org.junit.runners.ParentRunner.runChildren(ParentRunner.java:191)
	at org.junit.runners.ParentRunner.access$000(ParentRunner.java:42)
	at org.junit.runners.ParentRunner$2.evaluate(ParentRunner.java:184)
	at org.junit.runners.ParentRunner.run(ParentRunner.java:236)
	at org.junit.runners.Suite.runChild(Suite.java:128)
	at org.junit.runners.Suite.runChild(Suite.java:24)
	at org.junit.runners.ParentRunner$3.run(ParentRunner.java:193)
	at org.junit.runners.ParentRunner$1.schedule(ParentRunner.java:52)
	at org.junit.runners.ParentRunner.runChildren(ParentRunner.java:191)
	at org.junit.runners.ParentRunner.access$000(ParentRunner.java:42)
	at org.junit.runners.ParentRunner$2.evaluate(ParentRunner.java:184)
	at org.junit.runners.ParentRunner.run(ParentRunner.java:236)
	at org.apache.maven.surefire.junit4.JUnit4TestSet.execute(JUnit4TestSet.java:53)
	at org.apache.maven.surefire.junit4.JUnit4Provider.executeTestSet(JUnit4Provider.java:119)
	at org.apache.maven.surefire.junit4.JUnit4Provider.invoke(JUnit4Provider.java:101)
	at sun.reflect.NativeMethodAccessorImpl.invoke0(Native Method)
	at sun.reflect.NativeMethodAccessorImpl.invoke(NativeMethodAccessorImpl.java:62)
	at sun.reflect.DelegatingMethodAccessorImpl.invoke(DelegatingMethodAccessorImpl.java:43)
	at java.lang.reflect.Method.invoke(Method.java:498)
	at org.apache.maven.surefire.booter.ProviderFactory$ClassLoaderProxy.invoke(ProviderFactory.java:103)
	at com.sun.proxy.$Proxy0.invoke(Unknown Source)
	at org.apache.maven.surefire.booter.SurefireStarter.invokeProvider(SurefireStarter.java:150)
	at org.apache.maven.surefire.booter.SurefireStarter.runSuitesInProcess(SurefireStarter.java:91)
	at org.apache.maven.surefire.booter.ForkedBooter.main(ForkedBooter.java:69)
Caused by: org.dataone.client.exception.ClientSideException: /Connect to cn-dev-ucsb-1.test.dataone.org:443 [cn-dev-ucsb-1.test.dataone.org/128.111.85.178] failed: Connection refused (Connection refused)
	... 45 more
Caused by: org.apache.http.conn.HttpHostConnectException: Connect to cn-dev-ucsb-1.test.dataone.org:443 [cn-dev-ucsb-1.test.dataone.org/128.111.85.178] failed: Connection refused (Connection refused)
	at org.apache.http.impl.conn.HttpClientConnectionOperator.connect(HttpClientConnectionOperator.java:142)
	at org.apache.http.impl.conn.PoolingHttpClientConnectionManager.connect(PoolingHttpClientConnectionManager.java:319)
	at org.apache.http.impl.execchain.MainClientExec.establishRoute(MainClientExec.java:363)
	at org.apache.http.impl.execchain.MainClientExec.execute(MainClientExec.java:219)
	at org.apache.http.impl.client.cache.CachingExec.callBackend(CachingExec.java:578)
	at org.apache.http.impl.client.cache.CachingExec.handleCacheMiss(CachingExec.java:346)
	at org.apache.http.impl.client.cache.CachingExec.execute(CachingExec.java:265)
	at org.apache.http.impl.execchain.ProtocolExec.execute(ProtocolExec.java:195)
	at org.apache.http.impl.execchain.RetryExec.execute(RetryExec.java:86)
	at org.apache.http.impl.execchain.RedirectExec.execute(RedirectExec.java:108)
	at org.apache.http.impl.client.InternalHttpClient.doExecute(InternalHttpClient.java:184)
	at org.apache.http.impl.client.CloseableHttpClient.execute(CloseableHttpClient.java:82)
	at org.apache.http.impl.client.CloseableHttpClient.execute(CloseableHttpClient.java:106)
	at org.apache.http.impl.client.CloseableHttpClient.execute(CloseableHttpClient.java:57)
	at org.dataone.client.rest.RestClient.doRequest(RestClient.java:330)
	at org.dataone.client.rest.RestClient.doRequestNoBody(RestClient.java:264)
	at org.dataone.client.rest.RestClient.doGetRequest(RestClient.java:182)
	at org.dataone.client.rest.HttpMultipartRestClient.doGetRequest(HttpMultipartRestClient.java:339)
	... 44 more
Caused by: java.net.ConnectException: Connection refused (Connection refused)
	at java.net.PlainSocketImpl.socketConnect(Native Method)
	at java.net.AbstractPlainSocketImpl.doConnect(AbstractPlainSocketImpl.java:350)
	at java.net.AbstractPlainSocketImpl.connectToAddress(AbstractPlainSocketImpl.java:206)
	at java.net.AbstractPlainSocketImpl.connect(AbstractPlainSocketImpl.java:188)
	at java.net.SocksSocketImpl.connect(SocksSocketImpl.java:392)
	at java.net.Socket.connect(Socket.java:607)
	at org.apache.http.conn.ssl.SSLConnectionSocketFactory.connectSocket(SSLConnectionSocketFactory.java:244)
	at org.apache.http.impl.conn.HttpClientConnectionOperator.connect(HttpClientConnectionOperator.java:125)
	... 61 more
20200805-05:18:50: [INFO]: **************************************************** [org.dataone.integration.ContextAwareTestCaseDataone]
20200805-05:18:50: [INFO]: ***  context label:   SINGLE_CN [org.dataone.integration.ContextAwareTestCaseDataone]
20200805-05:18:50: [INFO]: **************************************************** [org.dataone.integration.ContextAwareTestCaseDataone]
~~~ Context is solo CoordinatingNode: https://cn-dev-ucsb-1.test.dataone.org/cn
20200805-05:18:50: [INFO]: **************************************************** [org.dataone.integration.ContextAwareTestCaseDataone]
                          nodeId  key                       value
=============================================================================================================
20200805-05:18:50: [INFO]: 
***************** running test for testGetSubjectInfo(...) vs. node: https://cn-dev-ucsb-1.test.dataone.org/cn ***************** [org.dataone.integration.ContextAwareTestCaseDataone]
20200805-05:18:50: [INFO]: RestClient.doRequestNoBody, thread(1) call Info: GET https://cn-dev-ucsb-1.test.dataone.org/cn/v1/accounts [org.dataone.client.rest.RestClient]
20200805-05:18:50: [INFO]: **************************************************** [org.dataone.integration.ContextAwareTestCaseDataone]
20200805-05:18:50: [INFO]: ***  context label:   SINGLE_CN [org.dataone.integration.ContextAwareTestCaseDataone]
20200805-05:18:50: [INFO]: **************************************************** [org.dataone.integration.ContextAwareTestCaseDataone]
~~~ Context is solo CoordinatingNode: https://cn-dev-ucsb-1.test.dataone.org/cn
20200805-05:18:50: [INFO]: **************************************************** [org.dataone.integration.ContextAwareTestCaseDataone]
                          nodeId  key                       value
=============================================================================================================
20200805-05:18:50: [INFO]: 
***************** running test for testListSubjects_Slicing(...) vs. node: https://cn-dev-ucsb-1.test.dataone.org/cn ***************** [org.dataone.integration.ContextAwareTestCaseDataone]
20200805-05:18:50: [INFO]: RestClient.doRequestNoBody, thread(1) call Info: GET https://cn-dev-ucsb-1.test.dataone.org/cn/v1/accounts [org.dataone.client.rest.RestClient]
20200805-05:18:50: [INFO]: **************************************************** [org.dataone.integration.ContextAwareTestCaseDataone]
20200805-05:18:50: [INFO]: ***  context label:   SINGLE_CN [org.dataone.integration.ContextAwareTestCaseDataone]
20200805-05:18:50: [INFO]: **************************************************** [org.dataone.integration.ContextAwareTestCaseDataone]
~~~ Context is solo CoordinatingNode: https://cn-dev-ucsb-1.test.dataone.org/cn
20200805-05:18:50: [INFO]: **************************************************** [org.dataone.integration.ContextAwareTestCaseDataone]
                          nodeId  key                       value
=============================================================================================================
20200805-05:18:50: [INFO]: created client for certificate file: testPerson with subject: CN=testPerson,DC=dataone,DC=org [org.dataone.integration.ContextAwareTestCaseDataone]
20200805-05:18:50: [INFO]: 
***************** running test for testRegisterAccount(...) vs. node: https://cn-dev-ucsb-1.test.dataone.org/cn ***************** [org.dataone.integration.ContextAwareTestCaseDataone]
20200805-05:18:50: [INFO]: **************************************************** [org.dataone.integration.ContextAwareTestCaseDataone]
20200805-05:18:50: [INFO]: ***  context label:   SINGLE_CN [org.dataone.integration.ContextAwareTestCaseDataone]
20200805-05:18:50: [INFO]: **************************************************** [org.dataone.integration.ContextAwareTestCaseDataone]
~~~ Context is solo CoordinatingNode: https://cn-dev-ucsb-1.test.dataone.org/cn
20200805-05:18:50: [INFO]: **************************************************** [org.dataone.integration.ContextAwareTestCaseDataone]
                          nodeId  key                       value
=============================================================================================================
20200805-05:18:50: [INFO]: 
***************** running test for testVerifyAccount_AlreadyVerified(...) vs. node: https://cn-dev-ucsb-1.test.dataone.org/cn ***************** [org.dataone.integration.ContextAwareTestCaseDataone]
20200805-05:18:50: [INFO]: created client for certificate file: cnStageUNM1 with subject: CN=urn:node:cnStageUNM1,DC=dataone,DC=org [org.dataone.integration.ContextAwareTestCaseDataone]
org.dataone.service.exceptions.ServiceFailure: Certificate is expired (or not yet valid): certificate expired on 20180430024028GMT+00:00
	at org.dataone.client.rest.MultipartD1Node.getRestClient(MultipartD1Node.java:161)
	at org.dataone.client.v1.impl.MultipartCNode.listSubjects(MultipartCNode.java:1528)
	at org.dataone.integration.adapters.CNCallAdapter.listSubjects(CNCallAdapter.java:270)
	at org.dataone.integration.it.testImplementations.CNIdentityTestImplementations.testVerifyAccount_AlreadyVerified(CNIdentityTestImplementations.java:142)
	at org.dataone.integration.it.testImplementations.CNIdentityTestImplementations.testVerifyAccount_AlreadyVerified(CNIdentityTestImplementations.java:132)
	at org.dataone.integration.it.apiTests.CNIdentityV1IT.testVerifyAccount_AlreadyVerified(CNIdentityV1IT.java:52)
	at sun.reflect.NativeMethodAccessorImpl.invoke0(Native Method)
	at sun.reflect.NativeMethodAccessorImpl.invoke(NativeMethodAccessorImpl.java:62)
	at sun.reflect.DelegatingMethodAccessorImpl.invoke(DelegatingMethodAccessorImpl.java:43)
	at java.lang.reflect.Method.invoke(Method.java:498)
	at org.junit.runners.model.FrameworkMethod$1.runReflectiveCall(FrameworkMethod.java:44)
	at org.junit.internal.runners.model.ReflectiveCallable.run(ReflectiveCallable.java:15)
	at org.junit.runners.model.FrameworkMethod.invokeExplosively(FrameworkMethod.java:41)
	at org.junit.internal.runners.statements.InvokeMethod.evaluate(InvokeMethod.java:20)
	at org.junit.rules.Verifier$1.evaluate(Verifier.java:34)
	at org.junit.internal.runners.statements.RunBefores.evaluate(RunBefores.java:28)
	at org.junit.runners.BlockJUnit4ClassRunner.runChild(BlockJUnit4ClassRunner.java:76)
	at org.junit.runners.BlockJUnit4ClassRunner.runChild(BlockJUnit4ClassRunner.java:50)
	at org.junit.runners.ParentRunner$3.run(ParentRunner.java:193)
	at org.junit.runners.ParentRunner$1.schedule(ParentRunner.java:52)
	at org.junit.runners.ParentRunner.runChildren(ParentRunner.java:191)
	at org.junit.runners.ParentRunner.access$000(ParentRunner.java:42)
	at org.junit.runners.ParentRunner$2.evaluate(ParentRunner.java:184)
	at org.junit.runners.ParentRunner.run(ParentRunner.java:236)
	at org.junit.runners.Suite.runChild(Suite.java:128)
	at org.junit.runners.Suite.runChild(Suite.java:24)
	at org.junit.runners.ParentRunner$3.run(ParentRunner.java:193)
	at org.junit.runners.ParentRunner$1.schedule(ParentRunner.java:52)
	at org.junit.runners.ParentRunner.runChildren(ParentRunner.java:191)
	at org.junit.runners.ParentRunner.access$000(ParentRunner.java:42)
	at org.junit.runners.ParentRunner$2.evaluate(ParentRunner.java:184)
	at org.junit.runners.ParentRunner.run(ParentRunner.java:236)
	at org.apache.maven.surefire.junit4.JUnit4TestSet.execute(JUnit4TestSet.java:53)
	at org.apache.maven.surefire.junit4.JUnit4Provider.executeTestSet(JUnit4Provider.java:119)
	at org.apache.maven.surefire.junit4.JUnit4Provider.invoke(JUnit4Provider.java:101)
	at sun.reflect.NativeMethodAccessorImpl.invoke0(Native Method)
	at sun.reflect.NativeMethodAccessorImpl.invoke(NativeMethodAccessorImpl.java:62)
	at sun.reflect.DelegatingMethodAccessorImpl.invoke(DelegatingMethodAccessorImpl.java:43)
	at java.lang.reflect.Method.invoke(Method.java:498)
	at org.apache.maven.surefire.booter.ProviderFactory$ClassLoaderProxy.invoke(ProviderFactory.java:103)
	at com.sun.proxy.$Proxy0.invoke(Unknown Source)
	at org.apache.maven.surefire.booter.SurefireStarter.invokeProvider(SurefireStarter.java:150)
	at org.apache.maven.surefire.booter.SurefireStarter.runSuitesInProcess(SurefireStarter.java:91)
	at org.apache.maven.surefire.booter.ForkedBooter.main(ForkedBooter.java:69)
20200805-05:18:50: [INFO]: **************************************************** [org.dataone.integration.ContextAwareTestCaseDataone]
20200805-05:18:50: [INFO]: ***  context label:   SINGLE_CN [org.dataone.integration.ContextAwareTestCaseDataone]
20200805-05:18:50: [INFO]: **************************************************** [org.dataone.integration.ContextAwareTestCaseDataone]
~~~ Context is solo CoordinatingNode: https://cn-dev-ucsb-1.test.dataone.org/cn
20200805-05:18:50: [INFO]: **************************************************** [org.dataone.integration.ContextAwareTestCaseDataone]
                          nodeId  key                       value
=============================================================================================================
20200805-05:18:50: [INFO]: 
***************** running test for testGetSubjectInfo(...) vs. node: https://cn-dev-ucsb-1.test.dataone.org/cn ***************** [org.dataone.integration.ContextAwareTestCaseDataone]
20200805-05:18:50: [INFO]: RestClient.doRequestNoBody, thread(1) call Info: GET https://cn-dev-ucsb-1.test.dataone.org/cn/v1/accounts/CN=Duque%20de%20Alburquerque,%20DC=spain,%20DC=emp [org.dataone.client.rest.RestClient]
20200805-05:18:50: [INFO]: **************************************************** [org.dataone.integration.ContextAwareTestCaseDataone]
20200805-05:18:50: [INFO]: ***  context label:   SINGLE_CN [org.dataone.integration.ContextAwareTestCaseDataone]
20200805-05:18:50: [INFO]: **************************************************** [org.dataone.integration.ContextAwareTestCaseDataone]
~~~ Context is solo CoordinatingNode: https://cn-dev-ucsb-1.test.dataone.org/cn
20200805-05:18:50: [INFO]: **************************************************** [org.dataone.integration.ContextAwareTestCaseDataone]
                          nodeId  key                       value
=============================================================================================================
20200805-05:18:50: [INFO]: 
***************** running test for testListSubjects(...) vs. node: https://cn-dev-ucsb-1.test.dataone.org/cn ***************** [org.dataone.integration.ContextAwareTestCaseDataone]
20200805-05:18:50: [INFO]: RestClient.doRequestNoBody, thread(1) call Info: GET https://cn-dev-ucsb-1.test.dataone.org/cn/v1/accounts [org.dataone.client.rest.RestClient]
20200805-05:18:50: [INFO]: **************************************************** [org.dataone.integration.ContextAwareTestCaseDataone]
20200805-05:18:50: [INFO]: ***  context label:   SINGLE_CN [org.dataone.integration.ContextAwareTestCaseDataone]
20200805-05:18:50: [INFO]: **************************************************** [org.dataone.integration.ContextAwareTestCaseDataone]
~~~ Context is solo CoordinatingNode: https://cn-dev-ucsb-1.test.dataone.org/cn
20200805-05:18:50: [INFO]: **************************************************** [org.dataone.integration.ContextAwareTestCaseDataone]
                          nodeId  key                       value
=============================================================================================================
20200805-05:18:50: [INFO]: created client for certificate file: cnDevUNM1 with subject: CN=urn:node:cnDevUNM1,DC=dataone,DC=org [org.dataone.integration.ContextAwareTestCaseDataone]
20200805-05:18:50: [INFO]: 
***************** running test for testRegister(...) vs. node: https://cn-dev-ucsb-1.test.dataone.org/cn ***************** [org.dataone.integration.ContextAwareTestCaseDataone]
20200805-05:18:50: [INFO]: **************************************************** [org.dataone.integration.ContextAwareTestCaseDataone]
20200805-05:18:50: [INFO]: ***  context label:   SINGLE_CN [org.dataone.integration.ContextAwareTestCaseDataone]
20200805-05:18:50: [INFO]: **************************************************** [org.dataone.integration.ContextAwareTestCaseDataone]
~~~ Context is solo CoordinatingNode: https://cn-dev-ucsb-1.test.dataone.org/cn
20200805-05:18:50: [INFO]: **************************************************** [org.dataone.integration.ContextAwareTestCaseDataone]
                          nodeId  key                       value
=============================================================================================================
20200805-05:18:50: [INFO]: created client for certificate file: cnDevUNM1 with subject: CN=urn:node:cnDevUNM1,DC=dataone,DC=org [org.dataone.integration.ContextAwareTestCaseDataone]
20200805-05:18:50: [INFO]: 
***************** running test for testUpdateNodeCapabilities(...) vs. node: https://cn-dev-ucsb-1.test.dataone.org/cn ***************** [org.dataone.integration.ContextAwareTestCaseDataone]
20200805-05:18:50: [INFO]: **************************************************** [org.dataone.integration.ContextAwareTestCaseDataone]
20200805-05:18:50: [INFO]: ***  context label:   SINGLE_CN [org.dataone.integration.ContextAwareTestCaseDataone]
20200805-05:18:50: [INFO]: **************************************************** [org.dataone.integration.ContextAwareTestCaseDataone]
~~~ Context is solo CoordinatingNode: https://cn-dev-ucsb-1.test.dataone.org/cn
20200805-05:18:50: [INFO]: **************************************************** [org.dataone.integration.ContextAwareTestCaseDataone]
                          nodeId  key                       value
=============================================================================================================
20200805-05:18:50: [INFO]: created client for certificate file: cnDevUNM1 with subject: CN=urn:node:cnDevUNM1,DC=dataone,DC=org [org.dataone.integration.ContextAwareTestCaseDataone]
20200805-05:18:50: [INFO]: certificate directory: /etc/dataone/client/testClientCerts/ [org.dataone.integration.ContextAwareTestCaseDataone]
20200805-05:18:50: [INFO]: certificate filename: cnDevUNM1 [org.dataone.integration.ContextAwareTestCaseDataone]
20200805-05:18:50: [INFO]: client setup as Subject: CN=urn:node:cnDevUNM1,DC=dataone,DC=org [org.dataone.integration.ContextAwareTestCaseDataone]
20200805-05:18:50: [INFO]: 
***************** running test for testUpdateNodeCapabilities(...) vs. node: https://cn-dev-ucsb-1.test.dataone.org/cn ***************** [org.dataone.integration.ContextAwareTestCaseDataone]
20200805-05:18:50: [INFO]: **************************************************** [org.dataone.integration.ContextAwareTestCaseDataone]
20200805-05:18:50: [INFO]: ***  context label:   SINGLE_CN [org.dataone.integration.ContextAwareTestCaseDataone]
20200805-05:18:50: [INFO]: **************************************************** [org.dataone.integration.ContextAwareTestCaseDataone]
~~~ Context is solo CoordinatingNode: https://cn-dev-ucsb-1.test.dataone.org/cn
20200805-05:18:50: [INFO]: **************************************************** [org.dataone.integration.ContextAwareTestCaseDataone]
                          nodeId  key                       value
=============================================================================================================
20200805-05:18:50: [INFO]: 
***************** running test for testUpdateNodeCapabilities(...) vs. node: https://cn-dev-ucsb-1.test.dataone.org/cn ***************** [org.dataone.integration.ContextAwareTestCaseDataone]
20200805-05:18:50: [INFO]: RestClient.doRequestNoBody, thread(1) call Info: GET https://cn-dev-ucsb-1.test.dataone.org/cn/v1/node [org.dataone.client.rest.RestClient]
20200805-05:18:50: [INFO]: **************************************************** [org.dataone.integration.ContextAwareTestCaseDataone]
20200805-05:18:50: [INFO]: ***  context label:   SINGLE_CN [org.dataone.integration.ContextAwareTestCaseDataone]
20200805-05:18:50: [INFO]: **************************************************** [org.dataone.integration.ContextAwareTestCaseDataone]
~~~ Context is solo CoordinatingNode: https://cn-dev-ucsb-1.test.dataone.org/cn
20200805-05:18:50: [INFO]: **************************************************** [org.dataone.integration.ContextAwareTestCaseDataone]
                          nodeId  key                       value
=============================================================================================================
20200805-05:18:50: [INFO]: created client for certificate file: cnDevUNM1 with subject: CN=urn:node:cnDevUNM1,DC=dataone,DC=org [org.dataone.integration.ContextAwareTestCaseDataone]
20200805-05:18:50: [INFO]: 
***************** running test for testUpdateNodeCapabilities(...) vs. node: https://cn-dev-ucsb-1.test.dataone.org/cn ***************** [org.dataone.integration.ContextAwareTestCaseDataone]
20200805-05:18:50: [INFO]: **************************************************** [org.dataone.integration.ContextAwareTestCaseDataone]
20200805-05:18:50: [INFO]: ***  context label:   SINGLE_CN [org.dataone.integration.ContextAwareTestCaseDataone]
20200805-05:18:50: [INFO]: **************************************************** [org.dataone.integration.ContextAwareTestCaseDataone]
~~~ Context is solo CoordinatingNode: https://cn-dev-ucsb-1.test.dataone.org/cn
20200805-05:18:50: [INFO]: **************************************************** [org.dataone.integration.ContextAwareTestCaseDataone]
                          nodeId  key                       value
=============================================================================================================
20200805-05:18:50: [INFO]: certificate directory: /etc/dataone/client/testClientCerts/ [org.dataone.integration.ContextAwareTestCaseDataone]
20200805-05:18:50: [INFO]: certificate filename: urn_node_cnStageUNM1_SS1 [org.dataone.integration.ContextAwareTestCaseDataone]
20200805-05:18:50: [INFO]: client setup as Subject: public [org.dataone.integration.ContextAwareTestCaseDataone]
20200805-05:18:50: [WARN]: registering ConnectionManager... [org.dataone.client.utils.HttpConnectionMonitorService]
20200805-05:18:50: [INFO]: created client for certificate file: urn_node_cnStageUNM1_SS1 with subject: public [org.dataone.integration.ContextAwareTestCaseDataone]
20200805-05:18:50: [INFO]: RestClient.doRequestNoBody, thread(1) call Info: GET https://cn-dev-ucsb-1.test.dataone.org/cn/v1/log [org.dataone.client.rest.RestClient]
20200805-05:18:50: [INFO]: **************************************************** [org.dataone.integration.ContextAwareTestCaseDataone]
20200805-05:18:50: [INFO]: ***  context label:   SINGLE_CN [org.dataone.integration.ContextAwareTestCaseDataone]
20200805-05:18:50: [INFO]: **************************************************** [org.dataone.integration.ContextAwareTestCaseDataone]
~~~ Context is solo CoordinatingNode: https://cn-dev-ucsb-1.test.dataone.org/cn
20200805-05:18:50: [INFO]: **************************************************** [org.dataone.integration.ContextAwareTestCaseDataone]
                          nodeId  key                       value
=============================================================================================================
20200805-05:18:50: [INFO]: **************************************************** [org.dataone.integration.ContextAwareTestCaseDataone]
20200805-05:18:50: [INFO]: ***  context label:   SINGLE_CN [org.dataone.integration.ContextAwareTestCaseDataone]
20200805-05:18:50: [INFO]: **************************************************** [org.dataone.integration.ContextAwareTestCaseDataone]
~~~ Context is solo CoordinatingNode: https://cn-dev-ucsb-1.test.dataone.org/cn
20200805-05:18:50: [INFO]: **************************************************** [org.dataone.integration.ContextAwareTestCaseDataone]
                          nodeId  key                       value
=============================================================================================================
20200805-05:18:50: [INFO]: certificate directory: /etc/dataone/client/testClientCerts/ [org.dataone.integration.ContextAwareTestCaseDataone]
20200805-05:18:50: [INFO]: certificate filename: testPerson_Expired [org.dataone.integration.ContextAwareTestCaseDataone]
20200805-05:18:50: [INFO]: client setup as Subject: CN=testPerson,DC=dataone,DC=org [org.dataone.integration.ContextAwareTestCaseDataone]
20200805-05:18:50: [WARN]: registering ConnectionManager... [org.dataone.client.utils.HttpConnectionMonitorService]
20200805-05:18:50: [INFO]: created client for certificate file: testPerson_Expired with subject: CN=testPerson,DC=dataone,DC=org [org.dataone.integration.ContextAwareTestCaseDataone]
20200805-05:18:50: [INFO]: **************************************************** [org.dataone.integration.ContextAwareTestCaseDataone]
20200805-05:18:50: [INFO]: ***  context label:   SINGLE_CN [org.dataone.integration.ContextAwareTestCaseDataone]
20200805-05:18:50: [INFO]: **************************************************** [org.dataone.integration.ContextAwareTestCaseDataone]
~~~ Context is solo CoordinatingNode: https://cn-dev-ucsb-1.test.dataone.org/cn
20200805-05:18:50: [INFO]: **************************************************** [org.dataone.integration.ContextAwareTestCaseDataone]
                          nodeId  key                       value
=============================================================================================================
20200805-05:18:50: [INFO]: created client for certificate file: testSubmitter with subject: public [org.dataone.integration.ContextAwareTestCaseDataone]
20200805-05:18:50: [INFO]: RestClient.doRequestNoBody, thread(1) call Info: GET https://cn-dev-ucsb-1.test.dataone.org/cn/v1/monitor/ping [org.dataone.client.rest.RestClient]
Tests run: 130, Failures: 96, Errors: 0, Skipped: 29, Time elapsed: 2.628 sec <<< FAILURE!

Results :

Failed tests: 
  testGetFormat(org.dataone.integration.it.apiTests.CNCoreV1IT): ServiceFailure: 0 Client_Error:: class org.dataone.client.exception.ClientSideException: /Connect to cn-dev-ucsb-1.test.dataone.org:443 [cn-dev-ucsb-1.test.dataone.org/128.111.85.178] failed: Connection refused (Connection refused)  [for host GET https://cn-dev-ucsb-1.test.dataone.org/cn/v1/formats ]
  testHasReservation(org.dataone.integration.it.apiTests.CNCoreV1IT): class org.dataone.client.exception.ClientSideException: /Connect to cn-dev-ucsb-1.test.dataone.org:443 [cn-dev-ucsb-1.test.dataone.org/128.111.85.178] failed: Connection refused (Connection refused)  [for host POST https://cn-dev-ucsb-1.test.dataone.org/cn/v1/reserve; MMP message has: ParamPart:pid = 2020217221849196;  ]
  testHasReservation_noReservation(org.dataone.integration.it.apiTests.CNCoreV1IT): ServiceFailure: 0 Client_Error:: class org.dataone.client.exception.ClientSideException: /Connect to cn-dev-ucsb-1.test.dataone.org:443 [cn-dev-ucsb-1.test.dataone.org/128.111.85.178] failed: Connection refused (Connection refused)  [for host GET https://cn-dev-ucsb-1.test.dataone.org/cn/v1/reserve/2020217221849213?subject=public ]
  testGetLogRecords(org.dataone.integration.it.apiTests.CNCoreV1IT): ServiceFailure: 0000: Certificate is expired (or not yet valid): certificate expired on 20180318194448GMT+00:00
  testGetLogRecords_Slicing(org.dataone.integration.it.apiTests.CNCoreV1IT): ServiceFailure: 0000: Certificate is expired (or not yet valid): certificate expired on 20180318194448GMT+00:00
  testGetLogRecords_dateFiltering(org.dataone.integration.it.apiTests.CNCoreV1IT): ServiceFailure : 0000 : Certificate is expired (or not yet valid): certificate expired on 20180319181654GMT+00:00
  testListChecksumAlgorithms(org.dataone.integration.it.apiTests.CNCoreV1IT): ServiceFailure: 0 Client_Error:: class org.dataone.client.exception.ClientSideException: /Connect to cn-dev-ucsb-1.test.dataone.org:443 [cn-dev-ucsb-1.test.dataone.org/128.111.85.178] failed: Connection refused (Connection refused)  [for host GET https://cn-dev-ucsb-1.test.dataone.org/cn/v1/checksum ]
  testGenerateIdentifier(org.dataone.integration.it.apiTests.CNCoreV1IT): ServiceFailure: 0 Client_Error:: class org.dataone.client.exception.ClientSideException: /Connect to cn-dev-ucsb-1.test.dataone.org:443 [cn-dev-ucsb-1.test.dataone.org/128.111.85.178] failed: Connection refused (Connection refused)  [for host GET https://cn-dev-ucsb-1.test.dataone.org/cn/v1/node ]
  testGenerateIdentifier_badScheme(org.dataone.integration.it.apiTests.CNCoreV1IT): class org.dataone.client.exception.ClientSideException: /Connect to cn-dev-ucsb-1.test.dataone.org:443 [cn-dev-ucsb-1.test.dataone.org/128.111.85.178] failed: Connection refused (Connection refused)  [for host POST https://cn-dev-ucsb-1.test.dataone.org/cn/v1/generate; MMP message has: ParamPart:scheme = bloip; ParamPart:fragment = CNodeTier1Test;  ]
  testReserveIdentifier(org.dataone.integration.it.apiTests.CNCoreV1IT): ServiceFailure: 0 Client_Error:: class org.dataone.client.exception.ClientSideException: /Connect to cn-dev-ucsb-1.test.dataone.org:443 [cn-dev-ucsb-1.test.dataone.org/128.111.85.178] failed: Connection refused (Connection refused)  [for host POST https://cn-dev-ucsb-1.test.dataone.org/cn/v1/reserve; MMP message has: ParamPart:pid = 2020217221849267;  ]
  testRegisterSystemMetadata(org.dataone.integration.it.apiTests.CNCoreV1IT): ServiceFailure: 0000: Certificate is expired (or not yet valid): certificate expired on 20180430024028GMT+00:00
  testListFormats(org.dataone.integration.it.apiTests.CNCoreV1IT): ServiceFailure: 0 Client_Error:: class org.dataone.client.exception.ClientSideException: /Connect to cn-dev-ucsb-1.test.dataone.org:443 [cn-dev-ucsb-1.test.dataone.org/128.111.85.178] failed: Connection refused (Connection refused)  [for host GET https://cn-dev-ucsb-1.test.dataone.org/cn/v1/formats ]
  testListNodes(org.dataone.integration.it.apiTests.CNCoreV1IT): ServiceFailure: 0 Client_Error:: class org.dataone.client.exception.ClientSideException: /Connect to cn-dev-ucsb-1.test.dataone.org:443 [cn-dev-ucsb-1.test.dataone.org/128.111.85.178] failed: Connection refused (Connection refused)  [for host GET https://cn-dev-ucsb-1.test.dataone.org/cn/v1/node ]
  testPing(org.dataone.integration.it.apiTests.CNCoreV1IT): GET https://cn-dev-ucsb-1.test.dataone.org/cn/v1/monitor/ping ServiceFailure: 0 Client_Error:: class org.dataone.client.exception.ClientSideException: /Connect to cn-dev-ucsb-1.test.dataone.org:443 [cn-dev-ucsb-1.test.dataone.org/128.111.85.178] failed: Connection refused (Connection refused)
  testListObjects(org.dataone.integration.it.apiTests.CNReadV1IT): unexpected error thrown by listObjects(): class org.dataone.client.exception.ClientSideException: /Connect to cn-dev-ucsb-1.test.dataone.org:443 [cn-dev-ucsb-1.test.dataone.org/128.111.85.178] failed: Connection refused (Connection refused):: cause: ServiceFailure: class org.dataone.client.exception.ClientSideException: /Connect to cn-dev-ucsb-1.test.dataone.org:443 [cn-dev-ucsb-1.test.dataone.org/128.111.85.178] failed: Connection refused (Connection refused)  [for host GET https://cn-dev-ucsb-1.test.dataone.org/cn/v1/object ]
  testDescribe_NotFound(org.dataone.integration.it.apiTests.CNReadV1IT): ServiceFailure: 0 Client_Error:: class org.dataone.client.exception.ClientSideException: /Connect to cn-dev-ucsb-1.test.dataone.org:443 [cn-dev-ucsb-1.test.dataone.org/128.111.85.178] failed: Connection refused (Connection refused)  [for host HEAD https://cn-dev-ucsb-1.test.dataone.org/cn/v1/object/TestingNotFound:2020217221849840 ]
  testDescribe_IdentifierEncoding(org.dataone.integration.it.apiTests.CNReadV1IT): https://cn-dev-ucsb-1.test.dataone.org/cn/v1 Failed 1 or more identifier encoding testsNode Test Summary for node: https://cn-dev-ucsb-1.test.dataone.org/cn/v1
  testGetChecksum_NotFound(org.dataone.integration.it.apiTests.CNReadV1IT): ServiceFailure: 0 Client_Error:: class org.dataone.client.exception.ClientSideException: /Connect to cn-dev-ucsb-1.test.dataone.org:443 [cn-dev-ucsb-1.test.dataone.org/128.111.85.178] failed: Connection refused (Connection refused)  [for host GET https://cn-dev-ucsb-1.test.dataone.org/cn/v1/checksum/TestingNotFound:2020217221849931 ]
  testListObjects_Slicing(org.dataone.integration.it.apiTests.CNReadV1IT): ServiceFailure: 0 Client_Error: class org.dataone.client.exception.ClientSideException: /Connect to cn-dev-ucsb-1.test.dataone.org:443 [cn-dev-ucsb-1.test.dataone.org/128.111.85.178] failed: Connection refused (Connection refused)  [for host GET https://cn-dev-ucsb-1.test.dataone.org/cn/v1/object ]
  testListObjects_FromDateTest(org.dataone.integration.it.apiTests.CNReadV1IT): org.dataone.integration.TestIterationEndingException: unexpected error thrown by listObjects(): class org.dataone.client.exception.ClientSideException: /Connect to cn-dev-ucsb-1.test.dataone.org:443 [cn-dev-ucsb-1.test.dataone.org/128.111.85.178] failed: Connection refused (Connection refused)  [for host https://cn-dev-ucsb-1.test.dataone.org/cn/v1 ]
  testListObjects_FormatIdFilteringTest(org.dataone.integration.it.apiTests.CNReadV1IT): unexpected error thrown by listObjects(): class org.dataone.client.exception.ClientSideException: /Connect to cn-dev-ucsb-1.test.dataone.org:443 [cn-dev-ucsb-1.test.dataone.org/128.111.85.178] failed: Connection refused (Connection refused):: cause: ServiceFailure: class org.dataone.client.exception.ClientSideException: /Connect to cn-dev-ucsb-1.test.dataone.org:443 [cn-dev-ucsb-1.test.dataone.org/128.111.85.178] failed: Connection refused (Connection refused)  [for host GET https://cn-dev-ucsb-1.test.dataone.org/cn/v1/object ]
  testListObjects_FormatIdFilteringTestFakeFormat(org.dataone.integration.it.apiTests.CNReadV1IT): ServiceFailure: 0 Client_Error:: class org.dataone.client.exception.ClientSideException: /Connect to cn-dev-ucsb-1.test.dataone.org:443 [cn-dev-ucsb-1.test.dataone.org/128.111.85.178] failed: Connection refused (Connection refused)  [for host GET https://cn-dev-ucsb-1.test.dataone.org/cn/v1/object?formatId=fake_format ]
  testSearch_Solr_unicodeTests(org.dataone.integration.it.apiTests.CNReadV1IT): org.dataone.service.exceptions.ServiceFailure: class org.dataone.client.exception.ClientSideException: /Connect to cn-dev-ucsb-1.test.dataone.org:443 [cn-dev-ucsb-1.test.dataone.org/128.111.85.178] failed: Connection refused (Connection refused)  [for host https://cn-dev-ucsb-1.test.dataone.org/cn/v1 ]
  testSearch_Solr_unicodeTests(org.dataone.integration.it.apiTests.CNReadV1IT): org.dataone.service.exceptions.ServiceFailure: class org.dataone.client.exception.ClientSideException: /Connect to cn-dev-ucsb-1.test.dataone.org:443 [cn-dev-ucsb-1.test.dataone.org/128.111.85.178] failed: Connection refused (Connection refused)  [for host https://cn-dev-ucsb-1.test.dataone.org/cn/v1 ]
  testSearch_Solr_unicodeTests(org.dataone.integration.it.apiTests.CNReadV1IT): org.dataone.service.exceptions.ServiceFailure: class org.dataone.client.exception.ClientSideException: /Connect to cn-dev-ucsb-1.test.dataone.org:443 [cn-dev-ucsb-1.test.dataone.org/128.111.85.178] failed: Connection refused (Connection refused)  [for host https://cn-dev-ucsb-1.test.dataone.org/cn/v1 ]
  testSearch_Solr_unicodeTests(org.dataone.integration.it.apiTests.CNReadV1IT): org.dataone.service.exceptions.ServiceFailure: class org.dataone.client.exception.ClientSideException: /Connect to cn-dev-ucsb-1.test.dataone.org:443 [cn-dev-ucsb-1.test.dataone.org/128.111.85.178] failed: Connection refused (Connection refused)  [for host https://cn-dev-ucsb-1.test.dataone.org/cn/v1 ]
  testSearch_Solr_unicodeTests(org.dataone.integration.it.apiTests.CNReadV1IT): org.dataone.service.exceptions.ServiceFailure: class org.dataone.client.exception.ClientSideException: /Connect to cn-dev-ucsb-1.test.dataone.org:443 [cn-dev-ucsb-1.test.dataone.org/128.111.85.178] failed: Connection refused (Connection refused)  [for host https://cn-dev-ucsb-1.test.dataone.org/cn/v1 ]
  testSearch_Solr_unicodeTests(org.dataone.integration.it.apiTests.CNReadV1IT): org.dataone.service.exceptions.ServiceFailure: class org.dataone.client.exception.ClientSideException: /Connect to cn-dev-ucsb-1.test.dataone.org:443 [cn-dev-ucsb-1.test.dataone.org/128.111.85.178] failed: Connection refused (Connection refused)  [for host https://cn-dev-ucsb-1.test.dataone.org/cn/v1 ]
  testSearch_Solr_unicodeTests(org.dataone.integration.it.apiTests.CNReadV1IT): org.dataone.service.exceptions.ServiceFailure: class org.dataone.client.exception.ClientSideException: /Connect to cn-dev-ucsb-1.test.dataone.org:443 [cn-dev-ucsb-1.test.dataone.org/128.111.85.178] failed: Connection refused (Connection refused)  [for host https://cn-dev-ucsb-1.test.dataone.org/cn/v1 ]
  testSearch_Solr_unicodeTests(org.dataone.integration.it.apiTests.CNReadV1IT): org.dataone.service.exceptions.ServiceFailure: class org.dataone.client.exception.ClientSideException: /Connect to cn-dev-ucsb-1.test.dataone.org:443 [cn-dev-ucsb-1.test.dataone.org/128.111.85.178] failed: Connection refused (Connection refused)  [for host https://cn-dev-ucsb-1.test.dataone.org/cn/v1 ]
  testSearch_Solr_unicodeTests(org.dataone.integration.it.apiTests.CNReadV1IT): org.dataone.service.exceptions.ServiceFailure: class org.dataone.client.exception.ClientSideException: /Connect to cn-dev-ucsb-1.test.dataone.org:443 [cn-dev-ucsb-1.test.dataone.org/128.111.85.178] failed: Connection refused (Connection refused)  [for host https://cn-dev-ucsb-1.test.dataone.org/cn/v1 ]
  testSearch_Solr_unicodeTests(org.dataone.integration.it.apiTests.CNReadV1IT): org.dataone.service.exceptions.ServiceFailure: class org.dataone.client.exception.ClientSideException: /Connect to cn-dev-ucsb-1.test.dataone.org:443 [cn-dev-ucsb-1.test.dataone.org/128.111.85.178] failed: Connection refused (Connection refused)  [for host https://cn-dev-ucsb-1.test.dataone.org/cn/v1 ]
  testSearch_Solr_unicodeTests(org.dataone.integration.it.apiTests.CNReadV1IT): org.dataone.service.exceptions.ServiceFailure: class org.dataone.client.exception.ClientSideException: /Connect to cn-dev-ucsb-1.test.dataone.org:443 [cn-dev-ucsb-1.test.dataone.org/128.111.85.178] failed: Connection refused (Connection refused)  [for host https://cn-dev-ucsb-1.test.dataone.org/cn/v1 ]
  testSearch_Solr_unicodeTests(org.dataone.integration.it.apiTests.CNReadV1IT): org.dataone.service.exceptions.ServiceFailure: class org.dataone.client.exception.ClientSideException: /Connect to cn-dev-ucsb-1.test.dataone.org:443 [cn-dev-ucsb-1.test.dataone.org/128.111.85.178] failed: Connection refused (Connection refused)  [for host https://cn-dev-ucsb-1.test.dataone.org/cn/v1 ]
  testSearch_Solr_unicodeTests(org.dataone.integration.it.apiTests.CNReadV1IT): org.dataone.service.exceptions.ServiceFailure: class org.dataone.client.exception.ClientSideException: /Connect to cn-dev-ucsb-1.test.dataone.org:443 [cn-dev-ucsb-1.test.dataone.org/128.111.85.178] failed: Connection refused (Connection refused)  [for host https://cn-dev-ucsb-1.test.dataone.org/cn/v1 ]
  testSearch_Solr_unicodeTests(org.dataone.integration.it.apiTests.CNReadV1IT): org.dataone.service.exceptions.ServiceFailure: class org.dataone.client.exception.ClientSideException: /Connect to cn-dev-ucsb-1.test.dataone.org:443 [cn-dev-ucsb-1.test.dataone.org/128.111.85.178] failed: Connection refused (Connection refused)  [for host https://cn-dev-ucsb-1.test.dataone.org/cn/v1 ]
  testSearch_Solr_unicodeTests(org.dataone.integration.it.apiTests.CNReadV1IT): org.dataone.service.exceptions.ServiceFailure: class org.dataone.client.exception.ClientSideException: /Connect to cn-dev-ucsb-1.test.dataone.org:443 [cn-dev-ucsb-1.test.dataone.org/128.111.85.178] failed: Connection refused (Connection refused)  [for host https://cn-dev-ucsb-1.test.dataone.org/cn/v1 ]
  testSearch_Solr_unicodeTests(org.dataone.integration.it.apiTests.CNReadV1IT): org.dataone.service.exceptions.ServiceFailure: class org.dataone.client.exception.ClientSideException: /Connect to cn-dev-ucsb-1.test.dataone.org:443 [cn-dev-ucsb-1.test.dataone.org/128.111.85.178] failed: Connection refused (Connection refused)  [for host https://cn-dev-ucsb-1.test.dataone.org/cn/v1 ]
  testSearch_Solr_unicodeTests(org.dataone.integration.it.apiTests.CNReadV1IT): org.dataone.service.exceptions.ServiceFailure: class org.dataone.client.exception.ClientSideException: /Connect to cn-dev-ucsb-1.test.dataone.org:443 [cn-dev-ucsb-1.test.dataone.org/128.111.85.178] failed: Connection refused (Connection refused)  [for host https://cn-dev-ucsb-1.test.dataone.org/cn/v1 ]
  testSearch_Solr_unicodeTests(org.dataone.integration.it.apiTests.CNReadV1IT): org.dataone.service.exceptions.ServiceFailure: class org.dataone.client.exception.ClientSideException: /Connect to cn-dev-ucsb-1.test.dataone.org:443 [cn-dev-ucsb-1.test.dataone.org/128.111.85.178] failed: Connection refused (Connection refused)  [for host https://cn-dev-ucsb-1.test.dataone.org/cn/v1 ]
  testSearch_Solr_unicodeTests(org.dataone.integration.it.apiTests.CNReadV1IT): org.dataone.service.exceptions.ServiceFailure: class org.dataone.client.exception.ClientSideException: /Connect to cn-dev-ucsb-1.test.dataone.org:443 [cn-dev-ucsb-1.test.dataone.org/128.111.85.178] failed: Connection refused (Connection refused)  [for host https://cn-dev-ucsb-1.test.dataone.org/cn/v1 ]
  testSearch_Solr_unicodeTests(org.dataone.integration.it.apiTests.CNReadV1IT): org.dataone.service.exceptions.ServiceFailure: class org.dataone.client.exception.ClientSideException: /Connect to cn-dev-ucsb-1.test.dataone.org:443 [cn-dev-ucsb-1.test.dataone.org/128.111.85.178] failed: Connection refused (Connection refused)  [for host https://cn-dev-ucsb-1.test.dataone.org/cn/v1 ]
  testSearch_Solr_unicodeTests(org.dataone.integration.it.apiTests.CNReadV1IT): org.dataone.service.exceptions.ServiceFailure: class org.dataone.client.exception.ClientSideException: /Connect to cn-dev-ucsb-1.test.dataone.org:443 [cn-dev-ucsb-1.test.dataone.org/128.111.85.178] failed: Connection refused (Connection refused)  [for host https://cn-dev-ucsb-1.test.dataone.org/cn/v1 ]
  testSearch_Solr_unicodeTests(org.dataone.integration.it.apiTests.CNReadV1IT): org.dataone.service.exceptions.ServiceFailure: class org.dataone.client.exception.ClientSideException: /Connect to cn-dev-ucsb-1.test.dataone.org:443 [cn-dev-ucsb-1.test.dataone.org/128.111.85.178] failed: Connection refused (Connection refused)  [for host https://cn-dev-ucsb-1.test.dataone.org/cn/v1 ]
  testSearch_Solr_unicodeTests(org.dataone.integration.it.apiTests.CNReadV1IT): org.dataone.service.exceptions.ServiceFailure: class org.dataone.client.exception.ClientSideException: /Connect to cn-dev-ucsb-1.test.dataone.org:443 [cn-dev-ucsb-1.test.dataone.org/128.111.85.178] failed: Connection refused (Connection refused)  [for host https://cn-dev-ucsb-1.test.dataone.org/cn/v1 ]
  testSearch_Solr_unicodeTests(org.dataone.integration.it.apiTests.CNReadV1IT): org.dataone.service.exceptions.ServiceFailure: class org.dataone.client.exception.ClientSideException: /Connect to cn-dev-ucsb-1.test.dataone.org:443 [cn-dev-ucsb-1.test.dataone.org/128.111.85.178] failed: Connection refused (Connection refused)  [for host https://cn-dev-ucsb-1.test.dataone.org/cn/v1 ]
  testSearch_Solr_unicodeTests(org.dataone.integration.it.apiTests.CNReadV1IT): org.dataone.service.exceptions.ServiceFailure: class org.dataone.client.exception.ClientSideException: /Connect to cn-dev-ucsb-1.test.dataone.org:443 [cn-dev-ucsb-1.test.dataone.org/128.111.85.178] failed: Connection refused (Connection refused)  [for host https://cn-dev-ucsb-1.test.dataone.org/cn/v1 ]
  testSearch_Solr_unicodeTests(org.dataone.integration.it.apiTests.CNReadV1IT): org.dataone.service.exceptions.ServiceFailure: class org.dataone.client.exception.ClientSideException: /Connect to cn-dev-ucsb-1.test.dataone.org:443 [cn-dev-ucsb-1.test.dataone.org/128.111.85.178] failed: Connection refused (Connection refused)  [for host https://cn-dev-ucsb-1.test.dataone.org/cn/v1 ]
  testSearch_Solr_unicodeTests(org.dataone.integration.it.apiTests.CNReadV1IT): org.dataone.service.exceptions.ServiceFailure: class org.dataone.client.exception.ClientSideException: /Connect to cn-dev-ucsb-1.test.dataone.org:443 [cn-dev-ucsb-1.test.dataone.org/128.111.85.178] failed: Connection refused (Connection refused)  [for host https://cn-dev-ucsb-1.test.dataone.org/cn/v1 ]
  testSearch_Solr_unicodeTests(org.dataone.integration.it.apiTests.CNReadV1IT): org.dataone.service.exceptions.ServiceFailure: class org.dataone.client.exception.ClientSideException: /Connect to cn-dev-ucsb-1.test.dataone.org:443 [cn-dev-ucsb-1.test.dataone.org/128.111.85.178] failed: Connection refused (Connection refused)  [for host https://cn-dev-ucsb-1.test.dataone.org/cn/v1 ]
  testQuery_Authentication(org.dataone.integration.it.apiTests.CNReadV1IT): org.dataone.service.exceptions.ServiceFailure: class org.dataone.client.exception.ClientSideException: /Connect to cn-dev-ucsb-1.test.dataone.org:443 [cn-dev-ucsb-1.test.dataone.org/128.111.85.178] failed: Connection refused (Connection refused)  [for host https://cn-dev-ucsb-1.test.dataone.org/cn/v1 ]
  testListQueryEngines(org.dataone.integration.it.apiTests.CNReadV1IT): ServiceFailure: 0 Client_Error:: class org.dataone.client.exception.ClientSideException: /Connect to cn-dev-ucsb-1.test.dataone.org:443 [cn-dev-ucsb-1.test.dataone.org/128.111.85.178] failed: Connection refused (Connection refused)  [for host GET https://cn-dev-ucsb-1.test.dataone.org/cn/v1/query ]
  testGetQueryEngineDescription(org.dataone.integration.it.apiTests.CNReadV1IT): ServiceFailure: 0 Client_Error:: class org.dataone.client.exception.ClientSideException: /Connect to cn-dev-ucsb-1.test.dataone.org:443 [cn-dev-ucsb-1.test.dataone.org/128.111.85.178] failed: Connection refused (Connection refused)  [for host GET https://cn-dev-ucsb-1.test.dataone.org/cn/v1/query ]
  testDescribe(org.dataone.integration.it.apiTests.CNReadV1IT): org.dataone.integration.TestIterationEndingException: could not create a test object and listObjects() threw exception:: ServiceFailure :: class org.dataone.client.exception.ClientSideException: /Connect to cn-dev-ucsb-1.test.dataone.org:443 [cn-dev-ucsb-1.test.dataone.org/128.111.85.178] failed: Connection refused (Connection refused)  [for host https://cn-dev-ucsb-1.test.dataone.org/cn/v1 ]
  testQuery(org.dataone.integration.it.apiTests.CNReadV1IT): org.dataone.service.exceptions.ServiceFailure: class org.dataone.client.exception.ClientSideException: /Connect to cn-dev-ucsb-1.test.dataone.org:443 [cn-dev-ucsb-1.test.dataone.org/128.111.85.178] failed: Connection refused (Connection refused)  [for host https://cn-dev-ucsb-1.test.dataone.org/cn/v1 ]
  testGet_IdentifierEncoding(org.dataone.integration.it.apiTests.CNReadV1IT): https://cn-dev-ucsb-1.test.dataone.org/cn/v1 Failed 1 or more identifier encoding testsNode Test Summary for node: https://cn-dev-ucsb-1.test.dataone.org/cn/v1
  testGetSystemMetadata(org.dataone.integration.it.apiTests.CNReadV1IT): org.dataone.integration.TestIterationEndingException: could not create a test object and listObjects() threw exception:: ServiceFailure :: class org.dataone.client.exception.ClientSideException: /Connect to cn-dev-ucsb-1.test.dataone.org:443 [cn-dev-ucsb-1.test.dataone.org/128.111.85.178] failed: Connection refused (Connection refused)  [for host https://cn-dev-ucsb-1.test.dataone.org/cn/v1 ]
  testGetChecksum_IdentifierEncoding(org.dataone.integration.it.apiTests.CNReadV1IT): https://cn-dev-ucsb-1.test.dataone.org/cn/v1 Failed 1 or more identifier encoding testsNode Test Summary for node: https://cn-dev-ucsb-1.test.dataone.org/cn/v1
  testGet_NotFound(org.dataone.integration.it.apiTests.CNReadV1IT): ServiceFailure: 0 Client_Error:: class org.dataone.client.exception.ClientSideException: /Connect to cn-dev-ucsb-1.test.dataone.org:443 [cn-dev-ucsb-1.test.dataone.org/128.111.85.178] failed: Connection refused (Connection refused)  [for host GET https://cn-dev-ucsb-1.test.dataone.org/cn/v1/object/TestingNotFound:2020217221850278 ]
  testGetSystemMetadata_NotFound(org.dataone.integration.it.apiTests.CNReadV1IT): ServiceFailure: 0 Client_Error:: class org.dataone.client.exception.ClientSideException: /Connect to cn-dev-ucsb-1.test.dataone.org:443 [cn-dev-ucsb-1.test.dataone.org/128.111.85.178] failed: Connection refused (Connection refused)  [for host GET https://cn-dev-ucsb-1.test.dataone.org/cn/v1/meta/TestingNotFound:2020217221850281 ]
  testGetSystemMetadata_IdentifierEncoding(org.dataone.integration.it.apiTests.CNReadV1IT): https://cn-dev-ucsb-1.test.dataone.org/cn/v1 Failed 1 or more identifier encoding testsNode Test Summary for node: https://cn-dev-ucsb-1.test.dataone.org/cn/v1
  testGetChecksum(org.dataone.integration.it.apiTests.CNReadV1IT): org.dataone.integration.TestIterationEndingException: could not create a test object and listObjects() threw exception:: ServiceFailure :: class org.dataone.client.exception.ClientSideException: /Connect to cn-dev-ucsb-1.test.dataone.org:443 [cn-dev-ucsb-1.test.dataone.org/128.111.85.178] failed: Connection refused (Connection refused)  [for host https://cn-dev-ucsb-1.test.dataone.org/cn/v1 ]
  testResolve(org.dataone.integration.it.apiTests.CNReadV1IT): org.dataone.integration.TestIterationEndingException: unexpected error thrown by listObjects(): class org.dataone.client.exception.ClientSideException: /Connect to cn-dev-ucsb-1.test.dataone.org:443 [cn-dev-ucsb-1.test.dataone.org/128.111.85.178] failed: Connection refused (Connection refused)  [for host https://cn-dev-ucsb-1.test.dataone.org/cn ]
  testSearch(org.dataone.integration.it.apiTests.CNReadV1IT): org.dataone.service.exceptions.ServiceFailure: class org.dataone.client.exception.ClientSideException: /Connect to cn-dev-ucsb-1.test.dataone.org:443 [cn-dev-ucsb-1.test.dataone.org/128.111.85.178] failed: Connection refused (Connection refused)  [for host https://cn-dev-ucsb-1.test.dataone.org/cn/v1 ]
  testGet(org.dataone.integration.it.apiTests.CNReadV1IT): No Objects available to test against:: could not create a test object and listObjects() threw exception:: ServiceFailure :: class org.dataone.client.exception.ClientSideException: /Connect to cn-dev-ucsb-1.test.dataone.org:443 [cn-dev-ucsb-1.test.dataone.org/128.111.85.178] failed: Connection refused (Connection refused)  [for host GET https://cn-dev-ucsb-1.test.dataone.org/cn/v1/object ]
  testIsAuthorized(org.dataone.integration.it.apiTests.CNAuthorizationV1IT): org.dataone.integration.TestIterationEndingException: could not create a test object and listObjects() threw exception:: ServiceFailure :: Certificate is expired (or not yet valid): certificate expired on 20180519185322GMT+00:00  [for host https://cn-dev-ucsb-1.test.dataone.org/cn/v1 ]
  testSetRightsHolder(org.dataone.integration.it.apiTests.CNAuthorizationV1IT): org.dataone.client.exception.ClientSideException: Unable to create test object!/Certificate is expired (or not yet valid): certificate expired on 20180430024028GMT+00:00  [for host https://cn-dev-ucsb-1.test.dataone.org/cn ]
  testSetAccessPolicy(org.dataone.integration.it.apiTests.CNAuthorizationV1IT): ServiceFailure: 0000: Certificate is expired (or not yet valid): certificate expired on 20180430024028GMT+00:00
  testIsAuthorized_NullPolicy_testPerson_is_RightsHolder(org.dataone.integration.it.apiTests.CNAuthorizationV1IT): ServiceFailure: 0000: Certificate is expired (or not yet valid): certificate expired on 20180430024028GMT+00:00
  testIsAuthorized_NullPolicy_testGroup_is_RightsHolder(org.dataone.integration.it.apiTests.CNAuthorizationV1IT): ServiceFailure: 0000: Certificate is expired (or not yet valid): certificate expired on 20180430024028GMT+00:00
  testIsAuthorized_AccessPolicy_is_Public_can_Read(org.dataone.integration.it.apiTests.CNAuthorizationV1IT): ServiceFailure: 0000: Certificate is expired (or not yet valid): certificate expired on 20180430024028GMT+00:00
  testIsAuthorized_AccessPolicy_is_AuthenticatedUser_can_Read(org.dataone.integration.it.apiTests.CNAuthorizationV1IT): ServiceFailure: 0000: Certificate is expired (or not yet valid): certificate expired on 20180430024028GMT+00:00
  testIsAuthorized_AccessPolicy_is_VerifiedUser_can_Read(org.dataone.integration.it.apiTests.CNAuthorizationV1IT): ServiceFailure: 0000: Certificate is expired (or not yet valid): certificate expired on 20180430024028GMT+00:00
  testIsAuthorized_AccessPolicy_is_testPerson_can_Read(org.dataone.integration.it.apiTests.CNAuthorizationV1IT): ServiceFailure: 0000: Certificate is expired (or not yet valid): certificate expired on 20180430024028GMT+00:00
  testIsAuthorized_AccessPolicy_is_testPerson_can_Write(org.dataone.integration.it.apiTests.CNAuthorizationV1IT): ServiceFailure: 0000: Certificate is expired (or not yet valid): certificate expired on 20180430024028GMT+00:00
  testIsAuthorized_AccessPolicy_is_testPerson_can_ChangePerm(org.dataone.integration.it.apiTests.CNAuthorizationV1IT): ServiceFailure: 0000: Certificate is expired (or not yet valid): certificate expired on 20180430024028GMT+00:00
  testIsAuthorized_AccessPolicy_is_testGroup_can_Read(org.dataone.integration.it.apiTests.CNAuthorizationV1IT): ServiceFailure: 0000: Certificate is expired (or not yet valid): certificate expired on 20180430024028GMT+00:00
  testIsAuthorized_AccessPolicy_is_testGroup_can_Write(org.dataone.integration.it.apiTests.CNAuthorizationV1IT): ServiceFailure: 0000: Certificate is expired (or not yet valid): certificate expired on 20180430024028GMT+00:00
  testIsAuthorized_AccessPolicy_is_testGroup_can_ChangePerm(org.dataone.integration.it.apiTests.CNAuthorizationV1IT): ServiceFailure: 0000: Certificate is expired (or not yet valid): certificate expired on 20180430024028GMT+00:00
  testIsAuthorized_AccessPolicy_is_legacyAccount_can_Write(org.dataone.integration.it.apiTests.CNAuthorizationV1IT): ServiceFailure: 0000: Certificate is expired (or not yet valid): certificate expired on 20180430024028GMT+00:00
  testIsAuthorized_ComplicatedAccessPolicy(org.dataone.integration.it.apiTests.CNAuthorizationV1IT): ServiceFailure: 0000: Certificate is expired (or not yet valid): certificate expired on 20180430024028GMT+00:00
  testVerifyAccount_NotAuthorized(org.dataone.integration.it.apiTests.CNIdentityV1IT): class org.dataone.client.exception.ClientSideException: /Connect to cn-dev-ucsb-1.test.dataone.org:443 [cn-dev-ucsb-1.test.dataone.org/128.111.85.178] failed: Connection refused (Connection refused)  [for host GET https://cn-dev-ucsb-1.test.dataone.org/cn/v1/accounts ]
  testGetSubjectInfo(org.dataone.integration.it.apiTests.CNIdentityV1IT): class org.dataone.client.exception.ClientSideException: /Connect to cn-dev-ucsb-1.test.dataone.org:443 [cn-dev-ucsb-1.test.dataone.org/128.111.85.178] failed: Connection refused (Connection refused)  [for host GET https://cn-dev-ucsb-1.test.dataone.org/cn/v1/accounts ]
  testListSubjects_Slicing(org.dataone.integration.it.apiTests.CNIdentityV1IT): ServiceFailure: 0 Client_Error: class org.dataone.client.exception.ClientSideException: /Connect to cn-dev-ucsb-1.test.dataone.org:443 [cn-dev-ucsb-1.test.dataone.org/128.111.85.178] failed: Connection refused (Connection refused)  [for host GET https://cn-dev-ucsb-1.test.dataone.org/cn/v1/accounts ]
  testVerifyAccount_AlreadyVerified(org.dataone.integration.it.apiTests.CNIdentityV1IT): Certificate is expired (or not yet valid): certificate expired on 20180430024028GMT+00:00
  testGetSubjectInfo_UrlEncodingSpaces(org.dataone.integration.it.apiTests.CNIdentityV1IT): class org.dataone.client.exception.ClientSideException: /Connect to cn-dev-ucsb-1.test.dataone.org:443 [cn-dev-ucsb-1.test.dataone.org/128.111.85.178] failed: Connection refused (Connection refused)  [for host GET https://cn-dev-ucsb-1.test.dataone.org/cn/v1/accounts/CN=Duque%20de%20Alburquerque,%20DC=spain,%20DC=emp ]
  testListSubjects(org.dataone.integration.it.apiTests.CNIdentityV1IT): class org.dataone.client.exception.ClientSideException: /Connect to cn-dev-ucsb-1.test.dataone.org:443 [cn-dev-ucsb-1.test.dataone.org/128.111.85.178] failed: Connection refused (Connection refused)  [for host GET https://cn-dev-ucsb-1.test.dataone.org/cn/v1/accounts ]
  testRegister_IdentifierNotUnique(org.dataone.integration.it.apiTests.CNRegisterV1IT): expected fail with InvalidRequest. Got: class org.dataone.service.exceptions.ServiceFailure:: Certificate is expired (or not yet valid): certificate expired on 20180318194448GMT+00:00
  testUpdateNodeCapabilities(org.dataone.integration.it.apiTests.CNRegisterV1IT): org.dataone.service.exceptions.ServiceFailure: 0000: Certificate is expired (or not yet valid): certificate expired on 20180318194448GMT+00:00
  testUpdateNodeCapabilities_NotFound(org.dataone.integration.it.apiTests.CNRegisterV1IT): expected fail with NotFound. Got: class org.dataone.service.exceptions.ServiceFailure:: Certificate is expired (or not yet valid): certificate expired on 20180318194448GMT+00:00
  testUpdateNodeCapabilities_NotAuthorized(org.dataone.integration.it.apiTests.CNRegisterV1IT): expected fail with NotAuthorized. Got: class org.dataone.service.exceptions.ServiceFailure:: class org.dataone.client.exception.ClientSideException: /Connect to cn-dev-ucsb-1.test.dataone.org:443 [cn-dev-ucsb-1.test.dataone.org/128.111.85.178] failed: Connection refused (Connection refused)  [for host GET https://cn-dev-ucsb-1.test.dataone.org/cn/v1/node ]
  testUpdateNodeCapabilities_updatingOtherField(org.dataone.integration.it.apiTests.CNRegisterV1IT): expected fail with InvalidRequest. Got: class org.dataone.service.exceptions.ServiceFailure:: Certificate is expired (or not yet valid): certificate expired on 20180318194448GMT+00:00
  testConnectionLayer_SelfSignedCert_JavaSSL(org.dataone.integration.it.apiTests.CNAuthenticationV1V2IT): a self-signed certificate against a methodthat implements Authorization should return either NotAuthorized or an empty log entry list. Got exception: ServiceFailure: 0 Client_Error:: class org.dataone.client.exception.ClientSideException: /Connect to cn-dev-ucsb-1.test.dataone.org:443 [cn-dev-ucsb-1.test.dataone.org/128.111.85.178] failed: Connection refused (Connection refused)  [for host GET https://cn-dev-ucsb-1.test.dataone.org/cn/v1/log ]
  testConnectionLayer_SelfSignedCert_curl(org.dataone.integration.it.apiTests.CNAuthenticationV1V2IT): Cannot find the certificate required for the test: /etc/dataone/client/testClientCerts/urn_node_cnStageUNM1_SS.crt  [for host  ]
  testConnectionLayer_SelfSignedCert_curl(org.dataone.integration.it.apiTests.CNAuthenticationV1V2IT): Don't know how we got here.  This is an unhandled response, andthe test is inconclusive.  The full response:
  testConnectionLayer_dataoneCAtrusted(org.dataone.integration.it.apiTests.CNAuthenticationV1V2IT): ServiceFailure: 0 Client_Error:: class org.dataone.client.exception.ClientSideException: /Connect to cn-dev-ucsb-1.test.dataone.org:443 [cn-dev-ucsb-1.test.dataone.org/128.111.85.178] failed: Connection refused (Connection refused)  [for host GET https://cn-dev-ucsb-1.test.dataone.org/cn/v1/monitor/ping ]

Tests run: 130, Failures: 96, Errors: 0, Skipped: 29

[WARNING] File encoding has not been set, using platform encoding UTF-8, i.e. build is platform dependent!
[JENKINS] Recording test results
[INFO] 
[INFO] --- maven-failsafe-plugin:2.8.1:verify (verify) @ d1_integration ---
[INFO] Failsafe report directory: /var/lib/jenkins/jobs/d1_integration_DEV_cn_v1/workspace/d1_integration/target/failsafe-reports
[WARNING] File encoding has not been set, using platform encoding UTF-8, i.e. build is platform dependent!
[ERROR] There are test failures.

Please refer to /var/lib/jenkins/jobs/d1_integration_DEV_cn_v1/workspace/d1_integration/target/failsafe-reports for the individual test results.
[JENKINS] Recording test results
Notifying upstream projects of job completion
Join notifier requires a CauseAction
[INFO] ------------------------------------------------------------------------
[INFO] BUILD SUCCESS
[INFO] ------------------------------------------------------------------------
[INFO] Total time:  39.536 s
[INFO] Finished at: 2020-08-05T05:18:51Z
[INFO] ------------------------------------------------------------------------
Waiting for Jenkins to finish collecting data
[JENKINS] Archiving /var/lib/jenkins/jobs/d1_integration_DEV_cn_v1/workspace/d1_integration/pom.xml to org.dataone/d1_integration/2.4-SNAPSHOT/d1_integration-2.4-SNAPSHOT.pom
channel stopped
Notifying upstream projects of job completion
Finished: UNSTABLE