FailedConsole Output

Established TCP socket on 57330
<===[JENKINS REMOTING CAPACITY]===>channel started
Executing Maven:  -B -f /var/lib/jenkins/jobs/d1_solr_extensions/workspace/d1_solr_extensions/pom.xml clean install javadoc:javadoc
[INFO] Scanning for projects...
[WARNING] 
[WARNING] Some problems were encountered while building the effective model for org.dataone:d1_solr_extensions:jar:2.4.0-SNAPSHOT
[WARNING] 'build.plugins.plugin.version' for org.apache.maven.plugins:maven-shade-plugin is missing. @ line 99, column 21
[WARNING] 'build.plugins.plugin.version' for org.apache.maven.plugins:maven-compiler-plugin is missing. @ line 74, column 21
[WARNING] 'build.plugins.plugin.version' for org.codehaus.mojo:buildnumber-maven-plugin is missing. @ line 83, column 21
[WARNING] 'build.plugins.plugin.version' for com.mycila.maven-license-plugin:maven-license-plugin is missing. @ line 166, column 21
[WARNING] 'build.plugins.plugin.version' for org.apache.maven.plugins:maven-jar-plugin is missing. @ line 152, column 21
[WARNING] The expression ${artifactId} is deprecated. Please use ${project.artifactId} instead.
[WARNING] 
[WARNING] It is highly recommended to fix these problems because they threaten the stability of your build.
[WARNING] 
[WARNING] For this reason, future Maven versions might no longer support building such malformed projects.
[WARNING] 
[INFO]                                                                         
[INFO] ------------------------------------------------------------------------
[INFO] Building DataONE_Solr_Extensions 2.4.0-SNAPSHOT
[INFO] ------------------------------------------------------------------------
Downloading: http://jibx.sourceforge.net/maven/org/dataone/d1_cn_common/2.4.0-SNAPSHOT/maven-metadata.xml
Downloading: http://maven.dataone.org/org/dataone/d1_cn_common/2.4.0-SNAPSHOT/maven-metadata.xml
Downloaded: http://maven.dataone.org/org/dataone/d1_cn_common/2.4.0-SNAPSHOT/maven-metadata.xml (985 B at 3.4 KB/sec)
Downloading: http://jibx.sourceforge.net/maven/org/dataone/d1_cn_common/2.4.0-SNAPSHOT/d1_cn_common-2.4.0-20170323.064901-1.pom
Downloading: http://maven.dataone.org/org/dataone/d1_cn_common/2.4.0-SNAPSHOT/d1_cn_common-2.4.0-20170323.064901-1.pom
Downloaded: http://maven.dataone.org/org/dataone/d1_cn_common/2.4.0-SNAPSHOT/d1_cn_common-2.4.0-20170323.064901-1.pom (12 KB at 1379.3 KB/sec)
Downloading: http://maven.dataone.org/org/dataone/d1_identity_manager/2.4.0-SNAPSHOT/maven-metadata.xml
Downloading: http://jibx.sourceforge.net/maven/org/dataone/d1_identity_manager/2.4.0-SNAPSHOT/maven-metadata.xml
Downloading: http://jibx.sourceforge.net/maven/org/dataone/d1_identity_manager/2.4.0-SNAPSHOT/d1_identity_manager-2.4.0-SNAPSHOT.pom
Downloading: http://maven.dataone.org/org/dataone/d1_identity_manager/2.4.0-SNAPSHOT/d1_identity_manager-2.4.0-SNAPSHOT.pom
[WARNING] The POM for org.dataone:d1_identity_manager:jar:2.4.0-SNAPSHOT is missing, no dependency information available
Downloading: http://jibx.sourceforge.net/maven/org/dataone/d1_cn_noderegistry/2.4.0-SNAPSHOT/maven-metadata.xml
Downloading: http://maven.dataone.org/org/dataone/d1_cn_noderegistry/2.4.0-SNAPSHOT/maven-metadata.xml
Downloading: http://jibx.sourceforge.net/maven/org/dataone/d1_cn_noderegistry/2.4.0-SNAPSHOT/d1_cn_noderegistry-2.4.0-SNAPSHOT.pom
Downloading: http://maven.dataone.org/org/dataone/d1_cn_noderegistry/2.4.0-SNAPSHOT/d1_cn_noderegistry-2.4.0-SNAPSHOT.pom
[WARNING] The POM for org.dataone:d1_cn_noderegistry:jar:2.4.0-SNAPSHOT is missing, no dependency information available
Downloading: http://maven.dataone.org/org/dataone/d1_common_java/2.4.0-SNAPSHOT/d1_common_java-2.4.0-20170323.064218-3-tests.jar
Downloading: http://maven.dataone.org/org/dataone/d1_cn_common/2.4.0-SNAPSHOT/d1_cn_common-2.4.0-20170323.064901-1.jar
Downloaded: http://maven.dataone.org/org/dataone/d1_cn_common/2.4.0-SNAPSHOT/d1_cn_common-2.4.0-20170323.064901-1.jar (119 KB at 3582.8 KB/sec)
Downloaded: http://maven.dataone.org/org/dataone/d1_common_java/2.4.0-SNAPSHOT/d1_common_java-2.4.0-20170323.064218-3-tests.jar (545 KB at 4903.5 KB/sec)
Downloading: http://jibx.sourceforge.net/maven/org/dataone/d1_identity_manager/2.4.0-SNAPSHOT/d1_identity_manager-2.4.0-SNAPSHOT.jar
Downloading: http://jibx.sourceforge.net/maven/org/dataone/d1_cn_noderegistry/2.4.0-SNAPSHOT/d1_cn_noderegistry-2.4.0-SNAPSHOT.jar
Downloading: http://maven.dataone.org/org/dataone/d1_identity_manager/2.4.0-SNAPSHOT/d1_identity_manager-2.4.0-SNAPSHOT.jar
Downloading: http://maven.dataone.org/org/dataone/d1_cn_noderegistry/2.4.0-SNAPSHOT/d1_cn_noderegistry-2.4.0-SNAPSHOT.jar
Notifying upstream projects of job completion
Join notifier requires a CauseAction
[INFO] ------------------------------------------------------------------------
[INFO] BUILD FAILURE
[INFO] ------------------------------------------------------------------------
[INFO] Total time: 6.775s
[INFO] Finished at: Tue Mar 28 22:35:53 UTC 2017
[INFO] Final Memory: 26M/329M
[INFO] ------------------------------------------------------------------------
Waiting for Jenkins to finish collecting data
[ERROR] Failed to execute goal on project d1_solr_extensions: Could not resolve dependencies for project org.dataone:d1_solr_extensions:jar:2.4.0-SNAPSHOT: The following artifacts could not be resolved: org.dataone:d1_identity_manager:jar:2.4.0-SNAPSHOT, org.dataone:d1_cn_noderegistry:jar:2.4.0-SNAPSHOT: Could not find artifact org.dataone:d1_identity_manager:jar:2.4.0-SNAPSHOT in Jibx Maven Repository (http://jibx.sourceforge.net/maven/) -> [Help 1]
[ERROR] 
[ERROR] To see the full stack trace of the errors, re-run Maven with the -e switch.
[ERROR] Re-run Maven using the -X switch to enable full debug logging.
[ERROR] 
[ERROR] For more information about the errors and possible solutions, please read the following articles:
[ERROR] [Help 1] http://cwiki.apache.org/confluence/display/MAVEN/DependencyResolutionException