FailedConsole Output

Started by upstream project "Build_Stable" build number 27
originally caused by:
 Started by user administrator
Building in workspace /var/lib/jenkins/jobs/d1_jibx_extensions_stable/workspace
Cleaning local Directory d1_jibx_extensions
Checking out https://repository.dataone.org/software/cicore/tags/D1_JIBX_EXTENSIONS_v2.2.0 at revision '2017-06-11T11:43:43.812 +0000'
A         src
A         src/test
A         src/test/resources
A         src/test/resources/commons-logging.properties
A         src/test/resources/log4j.properties
A         src/test/resources/buildDomain.xml
A         src/test/resources/org
A         src/test/resources/org/dataone
A         src/test/resources/org/dataone/service
A         src/test/resources/org/dataone/service/samples
A         src/test/resources/org/dataone/service/samples/InvalidNonEmptyContainerEmptyIdentifier.xml
A         src/test/resources/org/dataone/service/samples/ValidNonEmptyContainer.xml
A         src/test/resources/org/dataone/service/samples/InvalidNonEmptyContainerIdentifierWithWhitespace.xml
A         src/test/resources/org/dataone/service/samples/InvalidNonEmptyContainerEmptySubject.xml
A         src/test/resources/org/dataone/service/samples/InvalidNonEmptyContainerWhitespaceonlySubject.xml
A         src/test/resources/org/dataone/service/resources
A         src/test/resources/org/dataone/service/resources/testExtendedTypes.xsd
A         src/test/resources/org/dataone/service/resources/config
A         src/test/resources/org/dataone/service/resources/config/jibxConfig.xml
A         src/test/java
A         src/test/java/org
A         src/test/java/org/dataone
A         src/test/java/org/dataone/jibx
A         src/test/java/org/dataone/jibx/schema
A         src/test/java/org/dataone/jibx/schema/codegen
A         src/test/java/org/dataone/jibx/schema/codegen/MarshallingNonEmptyContainerTest.java
A         src/test/java/org/dataone/jibx/schema/codegen/NonEmptyStringsTestCase.java
A         src/test/java/org/dataone/jibx/schema/codegen/SimpleConstructorTestCase.java
A         src/test/java/org/dataone/service
A         src/test/java/org/dataone/service/exceptions
AU        src/test/java/org/dataone/service/exceptions/UnsupportedType.java
A         src/test/java/org/dataone/service/types
A         src/test/java/org/dataone/service/types/NonEmptyContainer.java
A         src/test/java/org/dataone/service/types/Subject.java
A         src/test/java/org/dataone/service/types/Checksum.java
A         src/test/java/org/dataone/service/types/Identifier.java
A         src/test/java/org/dataone/service/types/ObjectFormatIdentifier.java
A         src/test/java/org/dataone/service/types/NodeReference.java
A         src/test/java/org/dataone/service/types/Person.java
A         src/test/java/binding.xml
A         src/main
A         src/main/resources
A         src/main/resources/buildInfo
A         src/main/resources/buildInfo/buildInfo.properties
A         src/main/java
A         src/main/java/org
A         src/main/java/org/dataone
A         src/main/java/org/dataone/jibx
A         src/main/java/org/dataone/jibx/schema
A         src/main/java/org/dataone/jibx/schema/codegen
A         src/main/java/org/dataone/jibx/schema/codegen/extend
A         src/main/java/org/dataone/jibx/schema/codegen/extend/ComparableIdentifierDecorator.java
A         src/main/java/org/dataone/jibx/schema/codegen/extend/FieldMatchDecoratorBase.java
A         src/main/java/org/dataone/jibx/schema/codegen/extend/CollectionMethodsDecorator.java
A         src/main/java/org/dataone/jibx/schema/codegen/extend/SimpleConstructorDecorator.java
A         src/main/java/org/dataone/jibx/schema/codegen/extend/NonEmptyStringTypeDecorator.java
A         src/main/java/org/dataone/jibx/schema/codegen/extend/SliceMethodsDecorator.java
A         src/main/java/org/dataone/jibx/schema/codegen/extend/NonEmptyNoWhitespaceString800TypeDecorator.java
A         src/main/java/org/dataone/jibx/schema/codegen/extend/ComparableSubjectDecorator.java
A         src/main/java/org/dataone/jibx/runtime
A         src/main/java/org/dataone/jibx/runtime/impl
A         src/main/java/org/dataone/jibx/runtime/impl/UTF8StreamReader.java
A         src/main/java/org/dataone/jibx/runtime/impl/UTF8ByteBufferReader.java
A         src/main/java/org/dataone/jibx/runtime/impl/XMLPullReaderFactory.java
A         src/main/java/org/dataone/jibx/runtime/impl/InputStreamWrapper.java
A         src/license-header.txt
A         pom.xml
A         README.txt
A         LICENSE.txt
 U        .
At revision 18828

No changes for https://repository.dataone.org/software/cicore/tags/D1_JIBX_EXTENSIONS_v2.2.0 since the previous build
Parsing POMs
Established TCP socket on 37767
[d1_jibx_extensions] $ /usr/lib/jvm/java-7-openjdk-amd64/bin/java -cp /var/lib/jenkins/plugins/maven-plugin/WEB-INF/lib/maven3-agent-1.11.jar:/usr/share/maven/boot/plexus-classworlds-2.x.jar org.jvnet.hudson.maven3.agent.Maven3Main /usr/share/maven /var/cache/jenkins/war/WEB-INF/lib/remoting-3.7.jar /var/lib/jenkins/plugins/maven-plugin/WEB-INF/lib/maven3-interceptor-1.11.jar /var/lib/jenkins/plugins/maven-plugin/WEB-INF/lib/maven3-interceptor-commons-1.11.jar 37767
<===[JENKINS REMOTING CAPACITY]===>channel started
ERROR: ================================================================================
ERROR: Invalid project setup: jenkins/security/MasterToSlaveCallable : Unsupported major.minor version 52.0
ERROR: [JENKINS-18403][JENKINS-28294] JDK 'java-7-openjdk' not supported to run Maven projects.
ERROR: Maven projects have to be launched with a Java version greater or equal to the minimum version required by the master.
ERROR: Use the Maven JDK Toolchains (plugin) to build your maven project with an older JDK.
ERROR: Retrying with slave Java and setting compile/test properties to point to /usr/lib/jvm/java-7-openjdk-amd64.
ERROR: ================================================================================
Established TCP socket on 49666
[d1_jibx_extensions] $ /usr/lib/jvm/java-8-openjdk-amd64/jre/bin/java -cp /var/lib/jenkins/plugins/maven-plugin/WEB-INF/lib/maven3-agent-1.11.jar:/usr/share/maven/boot/plexus-classworlds-2.x.jar org.jvnet.hudson.maven3.agent.Maven3Main /usr/share/maven /var/cache/jenkins/war/WEB-INF/lib/remoting-3.7.jar /var/lib/jenkins/plugins/maven-plugin/WEB-INF/lib/maven3-interceptor-1.11.jar /var/lib/jenkins/plugins/maven-plugin/WEB-INF/lib/maven3-interceptor-commons-1.11.jar 49666
<===[JENKINS REMOTING CAPACITY]===>channel started
Executing Maven:  -B -f /var/lib/jenkins/jobs/d1_jibx_extensions_stable/workspace/d1_jibx_extensions/pom.xml clean install javadoc:javadoc
[INFO] Scanning for projects...
[WARNING] 
[WARNING] Some problems were encountered while building the effective model for org.dataone:d1_jibx_extensions:jar:2.2.0
[WARNING] 'build.plugins.plugin.version' for com.mycila.maven-license-plugin:maven-license-plugin is missing. @ line 52, column 21
[WARNING] 'build.plugins.plugin.version' for org.apache.maven.plugins:maven-compiler-plugin is missing. @ line 14, column 21
[WARNING] 'build.plugins.plugin.version' for org.apache.maven.plugins:maven-jar-plugin is missing. @ line 38, column 21
[WARNING] 'build.plugins.plugin.version' for org.apache.maven.plugins:maven-clean-plugin is missing. @ line 96, column 21
[WARNING] 'build.plugins.plugin.version' for org.codehaus.mojo:buildnumber-maven-plugin is missing. @ line 22, column 21
[WARNING] 'build.plugins.plugin.version' for org.codehaus.mojo:build-helper-maven-plugin is missing. @ line 134, column 21
[WARNING] 
[WARNING] It is highly recommended to fix these problems because they threaten the stability of your build.
[WARNING] 
[WARNING] For this reason, future Maven versions might no longer support building such malformed projects.
[WARNING] 
[INFO]                                                                         
[INFO] ------------------------------------------------------------------------
[INFO] Building DataONE_JibX_Extensions 2.2.0
[INFO] ------------------------------------------------------------------------
[INFO] 
[INFO] --- maven-clean-plugin:2.3:clean (default-clean) @ d1_jibx_extensions ---
[INFO] 
[INFO] --- buildnumber-maven-plugin:1.4:create (default) @ d1_jibx_extensions ---
[INFO] Executing: /bin/sh -c cd '/var/lib/jenkins/jobs/d1_jibx_extensions_stable/workspace/d1_jibx_extensions' && 'svn' '--non-interactive' 'info'
[INFO] Working directory: /var/lib/jenkins/jobs/d1_jibx_extensions_stable/workspace/d1_jibx_extensions
[INFO] Storing buildNumber: 18828 at timestamp: 1497181436779
[INFO] Executing: /bin/sh -c cd '/var/lib/jenkins/jobs/d1_jibx_extensions_stable/workspace/d1_jibx_extensions' && 'svn' '--non-interactive' 'info'
[INFO] Working directory: /var/lib/jenkins/jobs/d1_jibx_extensions_stable/workspace/d1_jibx_extensions
[INFO] Storing buildScmBranch: tags/D1_JIBX_EXTENSIONS_v2.2.0
[INFO] 
[INFO] --- build-helper-maven-plugin:1.12:add-test-source (add-test-source) @ d1_jibx_extensions ---
[INFO] Test Source directory: /var/lib/jenkins/jobs/d1_jibx_extensions_stable/workspace/d1_jibx_extensions/target/generated-test-sources added.
[INFO] 
[INFO] --- maven-resources-plugin:2.3:resources (default-resources) @ d1_jibx_extensions ---
[WARNING] File encoding has not been set, using platform encoding UTF-8, i.e. build is platform dependent!
[WARNING] Using platform encoding (UTF-8 actually) to copy filtered resources, i.e. build is platform dependent!
[INFO] Copying 1 resource
[INFO] Copying 1 resource
[INFO] 
[INFO] --- maven-compiler-plugin:2.0.2:compile (default-compile) @ d1_jibx_extensions ---
[INFO] Compiling 12 source files to /var/lib/jenkins/jobs/d1_jibx_extensions_stable/workspace/d1_jibx_extensions/target/classes
[INFO] 
[INFO] --- maven-antrun-plugin:1.3:run (ant-generate-test-jibx) @ d1_jibx_extensions ---
[INFO] Executing tasks

codegen:
     [echo] Running code generation from schema
     [echo] Running code generation from schema
     [java] value
     [java] givenNameList familyName emailList
     [java] Warning: Undefined attribute value-name for ComponentCustom at (source unknown)
     [java] Warning: Undefined attribute value-name for ComponentCustom at (source unknown)
     [java] Warning: Undefined attribute value-name for ComponentCustom at (source unknown)
     [java] Warning: Undefined attribute value-name for ComponentCustom at (source unknown)
     [java] Warning: Undefined attribute value-name for ComponentCustom at (source unknown)
     [java] Loaded and validated 1 specified schema(s)
     [java] value has type java.lang.String is collect false has get getValue has set setValue
     [java] value has type java.lang.String is collect false has get getValue has set setValue
     [java] value has type java.lang.String is collect false has get getValue has set setValue
     [java] value has type java.lang.String is collect false has get getValue has set setValue
     [java] value has type java.lang.String is collect false has get getValue has set setValue
     [java] algorithm has type java.lang.String is collect false has get getAlgorithm has set setAlgorithm
     [java] subject has type org.dataone.service.types.Subject is collect false has get getSubject has set setSubject
     [java] givenNameList has type java.lang.String is collect true has get getGivenNameList has set setGivenNameList
     [java] familyName has type java.lang.String is collect false has get getFamilyName has set setFamilyName
     [java] emailList has type java.lang.String is collect true has get getEmailList has set setEmailList
     [java] isMemberOfList has type org.dataone.service.types.Subject is collect true has get getIsMemberOfList has set setIsMemberOfList
     [java] equivalentIdentityList has type org.dataone.service.types.Subject is collect true has get getEquivalentIdentityList has set setEquivalentIdentityList
     [java] verified has type java.lang.Boolean is collect false has get getVerified has set setVerified
     [java] subjectList has type org.dataone.service.types.Subject is collect true has get getSubjectList has set setSubjectList
     [java] identifierList has type org.dataone.service.types.Identifier is collect true has get getIdentifierList has set setIdentifierList
     [java] nodeReferenceList has type org.dataone.service.types.NodeReference is collect true has get getNodeReferenceList has set setNodeReferenceList
     [java] objectFormatIdentifierList has type org.dataone.service.types.ObjectFormatIdentifier is collect true has get getObjectFormatIdentifierList has set setObjectFormatIdentifierList
     [java] Generated 7 top-level classes in package org.dataone.service.types
     [java] Total classes in model: 7
[INFO] Executed tasks
[INFO] 
[INFO] --- maven-resources-plugin:2.3:testResources (default-testResources) @ d1_jibx_extensions ---
[WARNING] Using platform encoding (UTF-8 actually) to copy filtered resources, i.e. build is platform dependent!
[INFO] Copying 10 resources
[INFO] 
[INFO] --- maven-compiler-plugin:2.0.2:testCompile (default-testCompile) @ d1_jibx_extensions ---
[INFO] Compiling 11 source files to /var/lib/jenkins/jobs/d1_jibx_extensions_stable/workspace/d1_jibx_extensions/target/test-classes
[INFO] 
[INFO] --- maven-jibx-plugin:1.2.5:test-bind (compile-binding) @ d1_jibx_extensions ---
[INFO] Running JiBX binding compiler (single-module mode) on 1 binding file(s)
Notifying upstream projects of job completion
Join notifier requires a CauseAction
[INFO] ------------------------------------------------------------------------
[INFO] BUILD FAILURE
[INFO] ------------------------------------------------------------------------
[INFO] Total time: 13.145s
[INFO] Finished at: Sun Jun 11 11:44:06 UTC 2017
[INFO] Final Memory: 34M/377M
[INFO] ------------------------------------------------------------------------
Waiting for Jenkins to finish collecting data
[ERROR] Failed to execute goal org.jibx:maven-jibx-plugin:1.2.5:test-bind (compile-binding) on project d1_jibx_extensions: Error loading class java.lang.CharSequence: Error reading path java/lang/CharSequence.class for class java.lang.CharSequence -> [Help 1]
[ERROR] 
[ERROR] To see the full stack trace of the errors, re-run Maven with the -e switch.
[ERROR] Re-run Maven using the -X switch to enable full debug logging.
[ERROR] 
[ERROR] For more information about the errors and possible solutions, please read the following articles:
[ERROR] [Help 1] http://cwiki.apache.org/confluence/display/MAVEN/MojoExecutionException
[JENKINS] Archiving /var/lib/jenkins/jobs/d1_jibx_extensions_stable/workspace/d1_jibx_extensions/pom.xml to org.dataone/d1_jibx_extensions/2.2.0/d1_jibx_extensions-2.2.0.pom
channel stopped
IRC notifier plugin: Sending notification to: #dataone-build
IRC notifier plugin: [ERROR] not connected. Cannot send message to '#dataone-build'
Notifying upstream projects of job completion
Notifying upstream of completion: Build_Stable #27
Project Build_Stable still waiting for [d1_test_resources_stable, d1_cn_version_tool_stable] builds to complete
Notifying upstream build Build_Stable #27 of job completion
Finished: FAILURE