{ "_class" : "hudson.tasks.junit.TestResult", "testActions" : [ ], "duration" : 613.872, "empty" : false, "failCount" : 4, "passCount" : 1, "skipCount" : 0, "suites" : [ { "cases" : [ { "testActions" : [ ], "age" : 0, "className" : "org.dataone.integration.contextTests.TestDefaultSettings", "duration" : 0.003, "errorDetails" : null, "errorStackTrace" : null, "failedSince" : 0, "name" : "testTrue", "skipped" : false, "skippedMessage" : null, "status" : "PASSED", "stderr" : null, "stdout" : null } ], "duration" : 0.088, "enclosingBlockNames" : [ ], "enclosingBlocks" : [ ], "id" : null, "name" : "org.dataone.integration.contextTests.TestDefaultSettings", "nodeId" : null, "stderr" : null, "stdout" : null, "timestamp" : null }, { "cases" : [ { "testActions" : [ ], "age" : 59, "className" : "org.dataone.integration.it.functional.v2.MNViewFunctionalIT", "duration" : 37.674, "errorDetails" : "405: Method Not Allowed: parser for deserializing HTML not written yet. Providing message body: Apache Tomcat/8.0.32 (Ubuntu) - Error report

HTTP Status 405 - Method Not Allowed

type Status report

message Method Not Allowed

description The specified HTTP method is not allowed for the requested resource.


Apache Tomcat/8.0.32 (Ubuntu)

. pid: testView_Scimeta_201714622319612", "errorStackTrace" : "java.lang.AssertionError: 405: Method Not Allowed: parser for deserializing HTML not written yet. Providing message body:\u000aApache Tomcat/8.0.32 (Ubuntu) - Error report

HTTP Status 405 - Method Not Allowed

type Status report

message Method Not Allowed

description The specified HTTP method is not allowed for the requested resource.


Apache Tomcat/8.0.32 (Ubuntu)

. pid: testView_Scimeta_201714622319612\u000a\u0009at org.dataone.integration.it.testImplementations.ViewFunctionalTestImplementations.testView_Scimeta(ViewFunctionalTestImplementations.java:64)\u000a\u0009at org.dataone.integration.it.testImplementations.ViewFunctionalTestImplementations.testView_Scimeta(ViewFunctionalTestImplementations.java:49)\u000a\u0009at org.dataone.integration.it.functional.v2.MNViewFunctionalIT.testView_Scimeta(MNViewFunctionalIT.java:37)\u000a\u0009at sun.reflect.NativeMethodAccessorImpl.invoke0(Native Method)\u000a\u0009at sun.reflect.NativeMethodAccessorImpl.invoke(NativeMethodAccessorImpl.java:57)\u000a\u0009at sun.reflect.DelegatingMethodAccessorImpl.invoke(DelegatingMethodAccessorImpl.java:43)\u000a\u0009at java.lang.reflect.Method.invoke(Method.java:606)\u000a\u0009at org.junit.runners.model.FrameworkMethod$1.runReflectiveCall(FrameworkMethod.java:44)\u000a\u0009at org.junit.internal.runners.model.ReflectiveCallable.run(ReflectiveCallable.java:15)\u000a\u0009at org.junit.runners.model.FrameworkMethod.invokeExplosively(FrameworkMethod.java:41)\u000a\u0009at org.junit.internal.runners.statements.InvokeMethod.evaluate(InvokeMethod.java:20)\u000a\u0009at org.junit.rules.Verifier$1.evaluate(Verifier.java:34)\u000a\u0009at org.junit.internal.runners.statements.RunBefores.evaluate(RunBefores.java:28)\u000a\u0009at org.junit.runners.BlockJUnit4ClassRunner.runChild(BlockJUnit4ClassRunner.java:76)\u000a\u0009at org.junit.runners.BlockJUnit4ClassRunner.runChild(BlockJUnit4ClassRunner.java:50)\u000a\u0009at org.junit.runners.ParentRunner$3.run(ParentRunner.java:193)\u000a\u0009at org.junit.runners.ParentRunner$1.schedule(ParentRunner.java:52)\u000a\u0009at org.junit.runners.ParentRunner.runChildren(ParentRunner.java:191)\u000a\u0009at org.junit.runners.ParentRunner.access$000(ParentRunner.java:42)\u000a\u0009at org.junit.runners.ParentRunner$2.evaluate(ParentRunner.java:184)\u000a\u0009at org.junit.runners.ParentRunner.run(ParentRunner.java:236)\u000a\u0009at org.apache.maven.surefire.junit4.JUnit4TestSet.execute(JUnit4TestSet.java:53)\u000a\u0009at org.apache.maven.surefire.junit4.JUnit4Provider.executeTestSet(JUnit4Provider.java:119)\u000a\u0009at org.apache.maven.surefire.junit4.JUnit4Provider.invoke(JUnit4Provider.java:101)\u000a\u0009at sun.reflect.NativeMethodAccessorImpl.invoke0(Native Method)\u000a\u0009at sun.reflect.NativeMethodAccessorImpl.invoke(NativeMethodAccessorImpl.java:57)\u000a\u0009at sun.reflect.DelegatingMethodAccessorImpl.invoke(DelegatingMethodAccessorImpl.java:43)\u000a\u0009at java.lang.reflect.Method.invoke(Method.java:606)\u000a\u0009at org.apache.maven.surefire.booter.ProviderFactory$ClassLoaderProxy.invoke(ProviderFactory.java:103)\u000a\u0009at com.sun.proxy.$Proxy0.invoke(Unknown Source)\u000a\u0009at org.apache.maven.surefire.booter.SurefireStarter.invokeProvider(SurefireStarter.java:150)\u000a\u0009at org.apache.maven.surefire.booter.SurefireStarter.runSuitesInProcess(SurefireStarter.java:91)\u000a\u0009at org.apache.maven.surefire.booter.ForkedBooter.main(ForkedBooter.java:69)\u000aCaused by: org.dataone.client.exception.ClientSideException: Unable to create test object!/405: Method Not Allowed: parser for deserializing HTML not written yet. Providing message body:\u000aApache Tomcat/8.0.32 (Ubuntu) - Error report

HTTP Status 405 - Method Not Allowed

type Status report

message Method Not Allowed

description The specified HTTP method is not allowed for the requested resource.


Apache Tomcat/8.0.32 (Ubuntu)

\u000a\u0009at org.dataone.integration.ContextAwareTestCaseDataone.createTestObject(ContextAwareTestCaseDataone.java:1609)\u000a\u0009at org.dataone.integration.ContextAwareTestCaseDataone.createTestObject(ContextAwareTestCaseDataone.java:1430)\u000a\u0009at org.dataone.integration.ContextAwareTestCaseDataone.createTestObject(ContextAwareTestCaseDataone.java:1383)\u000a\u0009at org.dataone.integration.ContextAwareTestCaseDataone.createTestObject(ContextAwareTestCaseDataone.java:1342)\u000a\u0009at org.dataone.integration.ContextAwareTestCaseDataone.createTestObject(ContextAwareTestCaseDataone.java:1359)\u000a\u0009at org.dataone.integration.it.testImplementations.ViewFunctionalTestImplementations.testView_Scimeta(ViewFunctionalTestImplementations.java:62)\u000a\u0009... 32 more\u000aCaused by: org.dataone.service.exceptions.ServiceFailure: 405: Method Not Allowed: parser for deserializing HTML not written yet. Providing message body:\u000aApache Tomcat/8.0.32 (Ubuntu) - Error report

HTTP Status 405 - Method Not Allowed

type Status report

message Method Not Allowed

description The specified HTTP method is not allowed for the requested resource.


Apache Tomcat/8.0.32 (Ubuntu)

\u000a\u0009at org.dataone.service.util.ExceptionHandler.deserializeHtmlAndThrowException(ExceptionHandler.java:423)\u000a\u0009at org.dataone.service.util.ExceptionHandler.deserializeAndThrowException(ExceptionHandler.java:372)\u000a\u0009at org.dataone.service.util.ExceptionHandler.deserializeAndThrowException(ExceptionHandler.java:313)\u000a\u0009at org.dataone.service.util.ExceptionHandler.filterErrors(ExceptionHandler.java:107)\u000a\u0009at org.dataone.service.util.ExceptionHandler.filterErrors(ExceptionHandler.java:82)\u000a\u0009at org.dataone.client.rest.HttpMultipartRestClient.doPostRequest(HttpMultipartRestClient.java:463)\u000a\u0009at org.dataone.client.v2.impl.MultipartMNode.create(MultipartMNode.java:495)\u000a\u0009at org.dataone.integration.adapters.CommonCallAdapter.create(CommonCallAdapter.java:505)\u000a\u0009at org.dataone.integration.ContextAwareTestCaseDataone.createTestObject(ContextAwareTestCaseDataone.java:1600)\u000a\u0009... 37 more\u000a", "failedSince" : 424, "name" : "testView_Scimeta", "skipped" : false, "skippedMessage" : null, "status" : "FAILED", "stderr" : null, "stdout" : null }, { "testActions" : [ ], "age" : 59, "className" : "org.dataone.integration.it.functional.v2.MNViewFunctionalIT", "duration" : 206.455, "errorDetails" : null, "errorStackTrace" : "java.lang.NullPointerException\u000a\u0009at org.dataone.integration.it.testImplementations.ViewFunctionalTestImplementations.testView_ResMap(ViewFunctionalTestImplementations.java:150)\u000a\u0009at org.dataone.integration.it.testImplementations.ViewFunctionalTestImplementations.testView_ResMap(ViewFunctionalTestImplementations.java:107)\u000a\u0009at org.dataone.integration.it.functional.v2.MNViewFunctionalIT.testView_ResMap(MNViewFunctionalIT.java:42)\u000a\u0009at sun.reflect.NativeMethodAccessorImpl.invoke0(Native Method)\u000a\u0009at sun.reflect.NativeMethodAccessorImpl.invoke(NativeMethodAccessorImpl.java:57)\u000a\u0009at sun.reflect.DelegatingMethodAccessorImpl.invoke(DelegatingMethodAccessorImpl.java:43)\u000a\u0009at java.lang.reflect.Method.invoke(Method.java:606)\u000a\u0009at org.junit.runners.model.FrameworkMethod$1.runReflectiveCall(FrameworkMethod.java:44)\u000a\u0009at org.junit.internal.runners.model.ReflectiveCallable.run(ReflectiveCallable.java:15)\u000a\u0009at org.junit.runners.model.FrameworkMethod.invokeExplosively(FrameworkMethod.java:41)\u000a\u0009at org.junit.internal.runners.statements.InvokeMethod.evaluate(InvokeMethod.java:20)\u000a\u0009at org.junit.rules.Verifier$1.evaluate(Verifier.java:34)\u000a\u0009at org.junit.internal.runners.statements.RunBefores.evaluate(RunBefores.java:28)\u000a\u0009at org.junit.runners.BlockJUnit4ClassRunner.runChild(BlockJUnit4ClassRunner.java:76)\u000a\u0009at org.junit.runners.BlockJUnit4ClassRunner.runChild(BlockJUnit4ClassRunner.java:50)\u000a\u0009at org.junit.runners.ParentRunner$3.run(ParentRunner.java:193)\u000a\u0009at org.junit.runners.ParentRunner$1.schedule(ParentRunner.java:52)\u000a\u0009at org.junit.runners.ParentRunner.runChildren(ParentRunner.java:191)\u000a\u0009at org.junit.runners.ParentRunner.access$000(ParentRunner.java:42)\u000a\u0009at org.junit.runners.ParentRunner$2.evaluate(ParentRunner.java:184)\u000a\u0009at org.junit.runners.ParentRunner.run(ParentRunner.java:236)\u000a\u0009at org.apache.maven.surefire.junit4.JUnit4TestSet.execute(JUnit4TestSet.java:53)\u000a\u0009at org.apache.maven.surefire.junit4.JUnit4Provider.executeTestSet(JUnit4Provider.java:119)\u000a\u0009at org.apache.maven.surefire.junit4.JUnit4Provider.invoke(JUnit4Provider.java:101)\u000a\u0009at sun.reflect.NativeMethodAccessorImpl.invoke0(Native Method)\u000a\u0009at sun.reflect.NativeMethodAccessorImpl.invoke(NativeMethodAccessorImpl.java:57)\u000a\u0009at sun.reflect.DelegatingMethodAccessorImpl.invoke(DelegatingMethodAccessorImpl.java:43)\u000a\u0009at java.lang.reflect.Method.invoke(Method.java:606)\u000a\u0009at org.apache.maven.surefire.booter.ProviderFactory$ClassLoaderProxy.invoke(ProviderFactory.java:103)\u000a\u0009at com.sun.proxy.$Proxy0.invoke(Unknown Source)\u000a\u0009at org.apache.maven.surefire.booter.SurefireStarter.invokeProvider(SurefireStarter.java:150)\u000a\u0009at org.apache.maven.surefire.booter.SurefireStarter.runSuitesInProcess(SurefireStarter.java:91)\u000a\u0009at org.apache.maven.surefire.booter.ForkedBooter.main(ForkedBooter.java:69)\u000a", "failedSince" : 424, "name" : "testView_ResMap", "skipped" : false, "skippedMessage" : null, "status" : "FAILED", "stderr" : null, "stdout" : null }, { "testActions" : [ ], "age" : 59, "className" : "org.dataone.integration.it.functional.v2.MNViewFunctionalIT", "duration" : 363.353, "errorDetails" : null, "errorStackTrace" : "java.lang.NullPointerException\u000a\u0009at org.dataone.integration.it.testImplementations.ViewFunctionalTestImplementations.testListViewsExist(ViewFunctionalTestImplementations.java:239)\u000a\u0009at org.dataone.integration.it.testImplementations.ViewFunctionalTestImplementations.testListViewsExist(ViewFunctionalTestImplementations.java:197)\u000a\u0009at org.dataone.integration.it.functional.v2.MNViewFunctionalIT.testListViewsExist(MNViewFunctionalIT.java:52)\u000a\u0009at sun.reflect.NativeMethodAccessorImpl.invoke0(Native Method)\u000a\u0009at sun.reflect.NativeMethodAccessorImpl.invoke(NativeMethodAccessorImpl.java:57)\u000a\u0009at sun.reflect.DelegatingMethodAccessorImpl.invoke(DelegatingMethodAccessorImpl.java:43)\u000a\u0009at java.lang.reflect.Method.invoke(Method.java:606)\u000a\u0009at org.junit.runners.model.FrameworkMethod$1.runReflectiveCall(FrameworkMethod.java:44)\u000a\u0009at org.junit.internal.runners.model.ReflectiveCallable.run(ReflectiveCallable.java:15)\u000a\u0009at org.junit.runners.model.FrameworkMethod.invokeExplosively(FrameworkMethod.java:41)\u000a\u0009at org.junit.internal.runners.statements.InvokeMethod.evaluate(InvokeMethod.java:20)\u000a\u0009at org.junit.rules.Verifier$1.evaluate(Verifier.java:34)\u000a\u0009at org.junit.internal.runners.statements.RunBefores.evaluate(RunBefores.java:28)\u000a\u0009at org.junit.runners.BlockJUnit4ClassRunner.runChild(BlockJUnit4ClassRunner.java:76)\u000a\u0009at org.junit.runners.BlockJUnit4ClassRunner.runChild(BlockJUnit4ClassRunner.java:50)\u000a\u0009at org.junit.runners.ParentRunner$3.run(ParentRunner.java:193)\u000a\u0009at org.junit.runners.ParentRunner$1.schedule(ParentRunner.java:52)\u000a\u0009at org.junit.runners.ParentRunner.runChildren(ParentRunner.java:191)\u000a\u0009at org.junit.runners.ParentRunner.access$000(ParentRunner.java:42)\u000a\u0009at org.junit.runners.ParentRunner$2.evaluate(ParentRunner.java:184)\u000a\u0009at org.junit.runners.ParentRunner.run(ParentRunner.java:236)\u000a\u0009at org.apache.maven.surefire.junit4.JUnit4TestSet.execute(JUnit4TestSet.java:53)\u000a\u0009at org.apache.maven.surefire.junit4.JUnit4Provider.executeTestSet(JUnit4Provider.java:119)\u000a\u0009at org.apache.maven.surefire.junit4.JUnit4Provider.invoke(JUnit4Provider.java:101)\u000a\u0009at sun.reflect.NativeMethodAccessorImpl.invoke0(Native Method)\u000a\u0009at sun.reflect.NativeMethodAccessorImpl.invoke(NativeMethodAccessorImpl.java:57)\u000a\u0009at sun.reflect.DelegatingMethodAccessorImpl.invoke(DelegatingMethodAccessorImpl.java:43)\u000a\u0009at java.lang.reflect.Method.invoke(Method.java:606)\u000a\u0009at org.apache.maven.surefire.booter.ProviderFactory$ClassLoaderProxy.invoke(ProviderFactory.java:103)\u000a\u0009at com.sun.proxy.$Proxy0.invoke(Unknown Source)\u000a\u0009at org.apache.maven.surefire.booter.SurefireStarter.invokeProvider(SurefireStarter.java:150)\u000a\u0009at org.apache.maven.surefire.booter.SurefireStarter.runSuitesInProcess(SurefireStarter.java:91)\u000a\u0009at org.apache.maven.surefire.booter.ForkedBooter.main(ForkedBooter.java:69)\u000a", "failedSince" : 424, "name" : "testListViewsExist", "skipped" : false, "skippedMessage" : null, "status" : "FAILED", "stderr" : null, "stdout" : null }, { "testActions" : [ ], "age" : 59, "className" : "org.dataone.integration.it.functional.v2.MNViewFunctionalIT", "duration" : 6.215, "errorDetails" : "https://alpha.tdar.org/dataone//v2: Unable to run testListViews functional test: ServiceFailure : 404: Not Found: Deserializing Text/Plain: Just providing message body: {EndOfMessage}", "errorStackTrace" : "java.lang.AssertionError: https://alpha.tdar.org/dataone//v2: Unable to run testListViews functional test: ServiceFailure : 404: Not Found: Deserializing Text/Plain: Just providing message body:\u000a\u000a{EndOfMessage}\u000a\u0009at org.dataone.integration.it.testImplementations.ViewFunctionalTestImplementations.testListViews(ViewFunctionalTestImplementations.java:186)\u000a\u0009at org.dataone.integration.it.testImplementations.ViewFunctionalTestImplementations.testListViews(ViewFunctionalTestImplementations.java:164)\u000a\u0009at org.dataone.integration.it.functional.v2.MNViewFunctionalIT.testListViews(MNViewFunctionalIT.java:47)\u000a\u0009at sun.reflect.NativeMethodAccessorImpl.invoke0(Native Method)\u000a\u0009at sun.reflect.NativeMethodAccessorImpl.invoke(NativeMethodAccessorImpl.java:57)\u000a\u0009at sun.reflect.DelegatingMethodAccessorImpl.invoke(DelegatingMethodAccessorImpl.java:43)\u000a\u0009at java.lang.reflect.Method.invoke(Method.java:606)\u000a\u0009at org.junit.runners.model.FrameworkMethod$1.runReflectiveCall(FrameworkMethod.java:44)\u000a\u0009at org.junit.internal.runners.model.ReflectiveCallable.run(ReflectiveCallable.java:15)\u000a\u0009at org.junit.runners.model.FrameworkMethod.invokeExplosively(FrameworkMethod.java:41)\u000a\u0009at org.junit.internal.runners.statements.InvokeMethod.evaluate(InvokeMethod.java:20)\u000a\u0009at org.junit.rules.Verifier$1.evaluate(Verifier.java:34)\u000a\u0009at org.junit.internal.runners.statements.RunBefores.evaluate(RunBefores.java:28)\u000a\u0009at org.junit.runners.BlockJUnit4ClassRunner.runChild(BlockJUnit4ClassRunner.java:76)\u000a\u0009at org.junit.runners.BlockJUnit4ClassRunner.runChild(BlockJUnit4ClassRunner.java:50)\u000a\u0009at org.junit.runners.ParentRunner$3.run(ParentRunner.java:193)\u000a\u0009at org.junit.runners.ParentRunner$1.schedule(ParentRunner.java:52)\u000a\u0009at org.junit.runners.ParentRunner.runChildren(ParentRunner.java:191)\u000a\u0009at org.junit.runners.ParentRunner.access$000(ParentRunner.java:42)\u000a\u0009at org.junit.runners.ParentRunner$2.evaluate(ParentRunner.java:184)\u000a\u0009at org.junit.runners.ParentRunner.run(ParentRunner.java:236)\u000a\u0009at org.apache.maven.surefire.junit4.JUnit4TestSet.execute(JUnit4TestSet.java:53)\u000a\u0009at org.apache.maven.surefire.junit4.JUnit4Provider.executeTestSet(JUnit4Provider.java:119)\u000a\u0009at org.apache.maven.surefire.junit4.JUnit4Provider.invoke(JUnit4Provider.java:101)\u000a\u0009at sun.reflect.NativeMethodAccessorImpl.invoke0(Native Method)\u000a\u0009at sun.reflect.NativeMethodAccessorImpl.invoke(NativeMethodAccessorImpl.java:57)\u000a\u0009at sun.reflect.DelegatingMethodAccessorImpl.invoke(DelegatingMethodAccessorImpl.java:43)\u000a\u0009at java.lang.reflect.Method.invoke(Method.java:606)\u000a\u0009at org.apache.maven.surefire.booter.ProviderFactory$ClassLoaderProxy.invoke(ProviderFactory.java:103)\u000a\u0009at com.sun.proxy.$Proxy0.invoke(Unknown Source)\u000a\u0009at org.apache.maven.surefire.booter.SurefireStarter.invokeProvider(SurefireStarter.java:150)\u000a\u0009at org.apache.maven.surefire.booter.SurefireStarter.runSuitesInProcess(SurefireStarter.java:91)\u000a\u0009at org.apache.maven.surefire.booter.ForkedBooter.main(ForkedBooter.java:69)\u000a", "failedSince" : 424, "name" : "testListViews", "skipped" : false, "skippedMessage" : null, "status" : "FAILED", "stderr" : null, "stdout" : null } ], "duration" : 613.784, "enclosingBlockNames" : [ ], "enclosingBlocks" : [ ], "id" : null, "name" : "org.dataone.integration.it.functional.v2.MNViewFunctionalIT", "nodeId" : null, "stderr" : null, "stdout" : null, "timestamp" : null } ] }