UnstableConsole Output

Started by user administrator
Building in workspace /var/lib/jenkins/jobs/d1_integration_Sandbox_authToken/workspace
Cleaning local Directory d1_integration
Checking out https://repository.dataone.org/software/cicore/trunk/d1_integration at revision '2015-12-15T19:14:24.005 +0000'
A         GeneratingITCertificates.txt
A         cnTestMethodTemplate.pl
A         src
A         src/test
A         src/test/resources
A         src/test/resources/nodes.json
A         src/test/resources/org
A         src/test/resources/org/dataone
A         src/test/resources/org/dataone/configuration
A         src/test/resources/org/dataone/configuration/overriding.properties
A         src/test/resources/d1_testdocs
A         src/test/resources/d1_testdocs/eml200
A         src/test/resources/d1_testdocs/eml200/SystemMetadata
A         src/test/resources/d1_testdocs/eml200/SystemMetadata/dpennington.resourcemap
A         src/test/resources/d1_testdocs/eml200/SystemMetadata/IPCC.200802107062739.1
A         src/test/resources/d1_testdocs/eml200/SystemMetadata/README.txt
A         src/test/resources/d1_testdocs/eml200/SystemMetadata/dpennington.195.2
A         src/test/resources/d1_testdocs/eml200/dpennington.resourcemap
A         src/test/resources/d1_testdocs/eml200/IPCC.200802107062739.1
A         src/test/resources/d1_testdocs/eml200/dpennington.195.2
A         src/test/resources/d1_testdocs/eml201
A         src/test/resources/d1_testdocs/eml201/TPT001_018MHP2000R00_20110121.50.1.xml
A         src/test/resources/d1_testdocs/eml201/SystemMetadata
A         src/test/resources/d1_testdocs/eml201/SystemMetadata/msucci.24.1
A         src/test/resources/d1_testdocs/eml201/SystemMetadata/msucci.23.3
A         src/test/resources/d1_testdocs/eml201/SystemMetadata/msucci.resourcemap
A         src/test/resources/d1_testdocs/eml201/SystemMetadata/README.txt
A         src/test/resources/d1_testdocs/eml201/msucci.24.1
A         src/test/resources/d1_testdocs/eml201/msucci.23.3
A         src/test/resources/d1_testdocs/eml201/msucci.resourcemap
A         src/test/resources/d1_testdocs/eml201/TPT001_018MHP2000R00_20110121.40.1.csv
A         src/test/resources/d1_testdocs/eml210
A         src/test/resources/d1_testdocs/eml210/SystemMetadata
A         src/test/resources/d1_testdocs/eml210/SystemMetadata/README.txt
A         src/test/resources/d1_testdocs/eml210/SystemMetadata/peggym.130.4
A         src/test/resources/d1_testdocs/eml210/SystemMetadata/peggym.resourcemap
A         src/test/resources/d1_testdocs/eml210/SystemMetadata/peggym.127.1
A         src/test/resources/d1_testdocs/eml210/SystemMetadata/peggym.128.1
A         src/test/resources/d1_testdocs/eml210/SystemMetadata/peggym.129.1
A         src/test/resources/d1_testdocs/eml210/peggym.130.4
A         src/test/resources/d1_testdocs/eml210/peggym.resourcemap
A         src/test/resources/d1_testdocs/eml210/peggym.127.1
A         src/test/resources/d1_testdocs/eml210/peggym.128.1
A         src/test/resources/d1_testdocs/eml210/peggym.129.1
A         src/test/resources/d1_testdocs/encodingTestSet
A         src/test/resources/d1_testdocs/encodingTestSet/singleAsciiCharacterTests.utf8.txt
AU        src/test/resources/d1_testdocs/encodingTestSet/testUnicodeStrings.utf8.txt
A         src/test/resources/d1_testdocs/encodingTestSet/testAsciiStrings.utf8.txt
AU        src/test/resources/d1_testdocs/encodingTestSet/IMPORTANT_README.txt
A         src/test/resources/d1_testdocs/IT_contexts
A         src/test/resources/d1_testdocs/IT_contexts/default.LOCAL.test.properties
A         src/test/resources/d1_testdocs/IT_contexts/default.DEV.test.properties
A         src/test/resources/d1_testdocs/fgdc
A         src/test/resources/d1_testdocs/fgdc/README.txt
A         src/test/resources/d1_testdocs/fgdc/www.nbii.gov_metadata_mdata_NASA_nasa_d_FEDGPS1293.xml
A         src/test/resources/d1_testdocs/fgdc/www.nbii.gov_metadata_mdata_USGS_PIERC_brdpierc0020.xml
A         src/test/resources/d1_testdocs/fgdc/www.nbii.gov_metadata_mdata_CSIRO_csiro_d_abayadultprawns.xml
A         src/test/resources/d1_testdocs/fgdc/www.nbii.gov_metadata_mdata_NASA_nasa_d_FEDGPS1293.sysmeta.xml
A         src/test/resources/d1_testdocs/fgdc/www.nbii.gov_metadata_mdata_NPS_VegMap_nps_d_metawababdy.xml
A         src/test/resources/d1_testdocs/fgdc/www.nbii.gov_metadata_mdata_USGS_PIERC_brdpierc0020.sysmeta.xml
A         src/test/resources/d1_testdocs/fgdc/www.nbii.gov_metadata_mdata_CSIRO_csiro_d_abayadultprawns.sysmeta.xml
A         src/test/resources/d1_testdocs/fgdc/www.nbii.gov_metadata_mdata_NPS_VegMap_nps_d_metawababdy.sysmeta.xml
A         src/test/resources/d1_testdocs/knb-lter-cdr.329066.1.data
A         src/test/resources/d1_testdocs/knb-lter-gce.247.12.xml
A         src/test/resources/d1_testdocs/knb-lter-luq.76.2.xml
A         src/test/resources/d1_testdocs/checksumTestSet
A         src/test/resources/d1_testdocs/checksumTestSet/sciMD-eml-201-NoLastLForCR.xml
A         src/test/resources/d1_testdocs/BAYXXX_015ADCP015R00_20051215.50.9.xml
A         src/test/resources/d1_testdocs/nodelist
A         src/test/resources/d1_testdocs/nodelist/nodeRegistry.xml
A         src/test/resources/d1_testdocs/EXAMPLE_MANIFEST.MF
A         src/test/resources/d1_testdocs/BAYXXX_015ADCP015R00_20051215.50.9_SYSMETA.xml
A         src/test/resources/d1_testdocs/knb-lter-luq.76.2-broken.xml
A         src/test/resources/d1_testdocs/ore_example_from_openarchives.xml
A         src/test/resources/d1_testdocs/iso19115
A         src/test/resources/d1_testdocs/iso19115/ornldaac_iso_645.xml
A         src/test/resources/d1_testdocs/iso19115/README.txt
A         src/test/resources/d1_testdocs/iso19115/test.xml
A         src/test/resources/d1_testdocs/iso19115/ornldaac_iso_122.xml
A         src/test/resources/d1_testdocs/iso19115/ornldaac_iso_868.xml
A         src/test/resources/d1_testdocs/knb-lter-gce.114.11.xml
A         src/test/java
A         src/test/java/org
A         src/test/java/org/dataone
A         src/test/java/org/dataone/configuration
A         src/test/java/org/dataone/configuration/TestSettingsTest.java
A         src/test/java/org/dataone/client
A         src/test/java/org/dataone/client/V1ClientArchitectureConformityIT.java
A         src/test/java/org/dataone/client/CNRestURLTest.java
A         src/test/java/org/dataone/client/PoolingHttpClientConnectionManagerTest.java
A         src/test/java/org/dataone/client/ArchitectureUtils.java
A         src/test/java/org/dataone/client/RetryHandler.java
A         src/test/java/org/dataone/client/ClientArchitectureConformityIT.java
A         src/test/java/org/dataone/integration
A         src/test/java/org/dataone/integration/webTest
A         src/test/java/org/dataone/integration/webTest/TestManifestAccess.java
A         src/test/java/org/dataone/integration/webTest/MockV1ITCase.java
A         src/test/java/org/dataone/integration/webTest/TestingTestRunnerServlet.java
A         src/test/java/org/dataone/integration/webTest/TestLauncher.java
A         src/test/java/org/dataone/integration/tools
A         src/test/java/org/dataone/integration/tools/RegisterNodeTools.java
A         src/test/java/org/dataone/integration/tools/ProductionContentCheckingTools.java
A         src/test/java/org/dataone/integration/tools/ProductionResourceMapParsingChecks.java
A         src/test/java/org/dataone/integration/CommonResourcesTest.java
A         src/test/java/org/dataone/integration/contextTests
A         src/test/java/org/dataone/integration/contextTests/TestDefaultSettings.java
A         src/test/java/org/dataone/integration/ContextAwareTestCaseDataoneTest.java
A         src/test/java/org/dataone/integration/it
A         src/test/java/org/dataone/integration/it/functional
A         src/test/java/org/dataone/integration/it/functional/ClientAuthIT.java
A         src/test/java/org/dataone/integration/it/functional/SynchronizationIT.java
A         src/test/java/org/dataone/integration/it/functional/MNodeMiscFunctionalIT.java
A         src/test/java/org/dataone/integration/it/functional/ClientCertificateInstallationIT.java
A         src/test/java/org/dataone/integration/it/functional/D1ClientIT.java
A         src/test/java/org/dataone/integration/it/functional/DataReplicationIT.java
A         src/test/java/org/dataone/integration/it/functional/XNodeWebServerBasicIT.java
A         src/test/java/org/dataone/integration/it/functional/MNReplicationIT.java
A         src/test/java/org/dataone/integration/it/functional/ResourceMapXParsing.java
A         src/test/java/org/dataone/integration/it/functional/SysmetaChangeFuncIT.java
AU        src/test/java/org/dataone/integration/it/functional/MNodeObjectLifecycleIT.java
A         src/test/java/org/dataone/integration/it/functional/ChecksumAnalysis.java
A         src/test/java/org/dataone/integration/it/functional/MNCreateFuncIT.java
A         src/test/java/org/dataone/integration/it/functional/v2
A         src/test/java/org/dataone/integration/it/functional/v2/MNPackageFunctionalIT.java
A         src/test/java/org/dataone/integration/it/functional/v2/LogAggregationFunctionalIT.java
A         src/test/java/org/dataone/integration/it/functional/v2/CNViewFunctionalIT.java
A         src/test/java/org/dataone/integration/it/functional/v2/V1V2InteropFunctionalIT.java
A         src/test/java/org/dataone/integration/it/functional/v2/AuthTokenFunctionalIT.java
A         src/test/java/org/dataone/integration/it/functional/v2/CNDiagnosticFunctionalIT.java
A         src/test/java/org/dataone/integration/it/functional/v2/CNRegisterFunctionalIT.java
A         src/test/java/org/dataone/integration/it/functional/v2/MNViewFunctionalIT.java
A         src/test/java/org/dataone/integration/it/functional/CNCNReplicationIT.java
A         src/test/java/org/dataone/integration/it/functional/MNv2FunctionalTestSuite.java
A         src/test/java/org/dataone/integration/it/functional/PreRegNodeContentCheck.java
A         src/test/java/org/dataone/integration/it/functional/EnvironmentsCheck.java
A         src/test/java/org/dataone/integration/it/functional/SyncInventoryIT.java
A         src/test/java/org/dataone/integration/it/functional/WebTestConcurrency.java
A         src/test/java/org/dataone/integration/it/functional/D1ObjectIT.java
A         src/test/java/org/dataone/integration/it/functional/PackageIT.java
A         src/test/java/org/dataone/integration/it/CNodeTier1_metacat_IT.java
A         src/test/java/org/dataone/integration/it/CNodeTier1_nodeRegistry_IT.java
A         src/test/java/org/dataone/integration/it/testImplementations
A         src/test/java/org/dataone/integration/it/testImplementations/MNReplicationTestImplementations.java
A         src/test/java/org/dataone/integration/it/testImplementations/QueryTestImplementations.java
A         src/test/java/org/dataone/integration/it/testImplementations/CNDiagnosticTestImplementations.java
A         src/test/java/org/dataone/integration/it/testImplementations/CNRegisterTestImplementations.java
A         src/test/java/org/dataone/integration/it/testImplementations/MNReadTestImplementations.java
A         src/test/java/org/dataone/integration/it/testImplementations/MNPackageFunctionalTestImplementations.java
A         src/test/java/org/dataone/integration/it/testImplementations/CNCoreTestImplementations.java
A         src/test/java/org/dataone/integration/it/testImplementations/CNUpdateSystemMetadataTestImplementations.java
A         src/test/java/org/dataone/integration/it/testImplementations/SidMNTestImplementations.java
A         src/test/java/org/dataone/integration/it/testImplementations/ReadTestImplementations.java
A         src/test/java/org/dataone/integration/it/testImplementations/LogAggregationFunctionalTestImplementations.java
A         src/test/java/org/dataone/integration/it/testImplementations/EnvironmentStatusTest.java
A         src/test/java/org/dataone/integration/it/testImplementations/CNAuthTestImplementations.java
A         src/test/java/org/dataone/integration/it/testImplementations/MNUpdateSystemMetadataTestImplementations.java
A         src/test/java/org/dataone/integration/it/testImplementations/AbstractAuthorizationTestImplementations.java
A         src/test/java/org/dataone/integration/it/testImplementations/MNSystemMetadataMutabilityImplementations.java
A         src/test/java/org/dataone/integration/it/testImplementations/SystemMetadataFunctionalTestImplementation.java
A         src/test/java/org/dataone/integration/it/testImplementations/SidCommonTestImplementations.java
A         src/test/java/org/dataone/integration/it/testImplementations/CNDiagnosticFunctionalTestImplementations.java
A         src/test/java/org/dataone/integration/it/testImplementations/CoreTestImplementations.java
A         src/test/java/org/dataone/integration/it/testImplementations/UpdateSystemMetadataTestImplementations.java
A         src/test/java/org/dataone/integration/it/testImplementations/AuthAPITestImplementations.java
A         src/test/java/org/dataone/integration/it/testImplementations/IsAuthorizedAuthorizationTestImplementations.java
A         src/test/java/org/dataone/integration/it/testImplementations/V1IsAuthorizedAuthorizationTestImpl.java
A         src/test/java/org/dataone/integration/it/testImplementations/V2IsAuthorizedAuthorizationTestImpl.java
A         src/test/java/org/dataone/integration/it/testImplementations/MNStorageTestImplementations.java
A         src/test/java/org/dataone/integration/it/testImplementations/AuthTestImplementations.java
A         src/test/java/org/dataone/integration/it/testImplementations/SSLTestImplementations.java
A         src/test/java/org/dataone/integration/it/testImplementations/ContentIntegrityTestImplementations.java
A         src/test/java/org/dataone/integration/it/testImplementations/ViewTestImplementations.java
A         src/test/java/org/dataone/integration/it/testImplementations/CNIdentityTestImplementations.java
A         src/test/java/org/dataone/integration/it/testImplementations/SynchronizeMetadataTestImplementations.java
A         src/test/java/org/dataone/integration/it/testImplementations/AuthTokenTestImplementation.java
A         src/test/java/org/dataone/integration/it/testImplementations/V1V2InteropFunctionalTestImplementations.java
A         src/test/java/org/dataone/integration/it/testImplementations/MNPackageTestImplementations.java
A         src/test/java/org/dataone/integration/it/testImplementations/CNReplicationTestImplementations.java
A         src/test/java/org/dataone/integration/it/testImplementations/NodeRegistryExtensibilityTestImplementations.java
A         src/test/java/org/dataone/integration/it/testImplementations/MNSystemMetadataChangedMethodTestImplementations.java
A         src/test/java/org/dataone/integration/it/testImplementations/CNReadTestImplementations.java
A         src/test/java/org/dataone/integration/it/testImplementations/ViewFunctionalTestImplementations.java
A         src/test/java/org/dataone/integration/it/testImplementations/SidCNTestImplementations.java
A         src/test/java/org/dataone/integration/it/CNodeTier2_nodeRegistry_IT.java
A         src/test/java/org/dataone/integration/it/CNodeTier1_cnService_IT.java
A         src/test/java/org/dataone/integration/it/CNodeTier4_metacat_IT.java
A         src/test/java/org/dataone/integration/it/testDefinitions
A         src/test/java/org/dataone/integration/it/testDefinitions/MNCoreSlowTestDefinitions.java
A         src/test/java/org/dataone/integration/it/testDefinitions/SynchronizeMetadataTestDefinition.java
A         src/test/java/org/dataone/integration/it/testDefinitions/MNSystemMetadataChangedTestDefinitions.java
A         src/test/java/org/dataone/integration/it/testDefinitions/CNReplicationSidTestDefinitions.java
A         src/test/java/org/dataone/integration/it/testDefinitions/MNAuthorizationSidTestDefinitions.java
A         src/test/java/org/dataone/integration/it/testDefinitions/AuthAPITestDefinitions.java
A         src/test/java/org/dataone/integration/it/testDefinitions/CNReadTestDefinitions.java
A         src/test/java/org/dataone/integration/it/testDefinitions/GeneralAuthorizationTestDefinitions.java
A         src/test/java/org/dataone/integration/it/testDefinitions/MNStorageTestDefinitions.java
A         src/test/java/org/dataone/integration/it/testDefinitions/MNStorageSidTestDefinitions.java
A         src/test/java/org/dataone/integration/it/testDefinitions/MNQueryTestDefinitions.java
A         src/test/java/org/dataone/integration/it/testDefinitions/SSLTestDefinitions.java
A         src/test/java/org/dataone/integration/it/testDefinitions/CNRegisterTestDefinitions.java
A         src/test/java/org/dataone/integration/it/testDefinitions/CNDiagnosticTestDefinitions.java
A         src/test/java/org/dataone/integration/it/testDefinitions/MNReadTestDefinitions.java
A         src/test/java/org/dataone/integration/it/testDefinitions/CNUpdateSystemMetadataTestDefinitions.java
A         src/test/java/org/dataone/integration/it/testDefinitions/CNCoreTestDefinitions.java
A         src/test/java/org/dataone/integration/it/testDefinitions/CNCoreSidTestDefinitions.java
A         src/test/java/org/dataone/integration/it/testDefinitions/ReadTestDefinitions.java
A         src/test/java/org/dataone/integration/it/testDefinitions/CNAuthTestDefinitions.java
A         src/test/java/org/dataone/integration/it/testDefinitions/MNCoreTestDefinitions.java
A         src/test/java/org/dataone/integration/it/testDefinitions/MNUpdateSystemMetadataTestDefinitions.java
A         src/test/java/org/dataone/integration/it/testDefinitions/MNPackageTestDefinitions.java
A         src/test/java/org/dataone/integration/it/testDefinitions/SystemMetadataChangedMethodTestDefnitions.java
A         src/test/java/org/dataone/integration/it/testDefinitions/CoreTestDefinitions.java
A         src/test/java/org/dataone/integration/it/testDefinitions/CNReplicationTestDefinitions.java
A         src/test/java/org/dataone/integration/it/testDefinitions/NodeRegistryExtensibilityTestDefinitions.java
A         src/test/java/org/dataone/integration/it/testDefinitions/CNReadSidTestDefinitions.java
A         src/test/java/org/dataone/integration/it/testDefinitions/AuthTestDefinitions.java
A         src/test/java/org/dataone/integration/it/testDefinitions/MNv2SystemMetadataChangedTestDefinitions.java
A         src/test/java/org/dataone/integration/it/testDefinitions/MNReplicationTestDefinitions.java
A         src/test/java/org/dataone/integration/it/testDefinitions/QueryTestDefinitions.java
A         src/test/java/org/dataone/integration/it/testDefinitions/MNReadSidTestDefinitions.java
A         src/test/java/org/dataone/integration/it/testDefinitions/MNv2StorageTestDefinitions.java
A         src/test/java/org/dataone/integration/it/testDefinitions/V2AuthorizationTestDefinitions.java
A         src/test/java/org/dataone/integration/it/testDefinitions/ContentIntegrityTestDefinitions.java
A         src/test/java/org/dataone/integration/it/testDefinitions/CNIdentityTestDefinitions.java
A         src/test/java/org/dataone/integration/it/testDefinitions/ViewTestDefinitions.java
A         src/test/java/org/dataone/integration/it/testDefinitions/MNAuthAPITestDefnitions.java
A         src/test/java/org/dataone/integration/it/testDefinitions/CNv2RegisterTestDefinitions.java
A         src/test/java/org/dataone/integration/it/testDefinitions/CNAuthorizationSidTestDefinitions.java
A         src/test/java/org/dataone/integration/it/testDefinitions/CNv2CoreTestDefinitions.java
A         src/test/java/org/dataone/integration/it/CNodeTier1_identity_IT.java
A         src/test/java/org/dataone/integration/it/CNodeTier2_identity_IT.java
A         src/test/java/org/dataone/integration/it/MNodeTier0IT.java
A         src/test/java/org/dataone/integration/it/MNodeTier1IT.java
A         src/test/java/org/dataone/integration/it/ContextAwareAdapter.java
A         src/test/java/org/dataone/integration/it/MNodeTier2IT.java
A         src/test/java/org/dataone/integration/it/MNodeTier3IT.java
A         src/test/java/org/dataone/integration/it/MNodeTier4IT.java
A         src/test/java/org/dataone/integration/it/MNodeTier1SlowIT.java
A         src/test/java/org/dataone/integration/it/CNodeTier1_logAgg_IT.java
A         src/test/java/org/dataone/integration/it/CNodeTier2Auth_metacat_IT.java
A         src/test/java/org/dataone/integration/it/apiTests
A         src/test/java/org/dataone/integration/it/apiTests/MNReplicationV2IT.java
A         src/test/java/org/dataone/integration/it/apiTests/MNReadV1IT.java
A         src/test/java/org/dataone/integration/it/apiTests/CNDiagnosticV2IT.java
A         src/test/java/org/dataone/integration/it/apiTests/CNRegisterV2IT.java
A         src/test/java/org/dataone/integration/it/apiTests/CNCoreV2IT.java
A         src/test/java/org/dataone/integration/it/apiTests/CNIdentityV2IT.java
A         src/test/java/org/dataone/integration/it/apiTests/MNUpdateSystemMetadataIT.java
A         src/test/java/org/dataone/integration/it/apiTests/MNSystemMetadataMutabilityIt.java
A         src/test/java/org/dataone/integration/it/apiTests/CNv1TestSuite.java
A         src/test/java/org/dataone/integration/it/apiTests/CNv2TestSuite.java
A         src/test/java/org/dataone/integration/it/apiTests/CNAuthorizationV1IT.java
A         src/test/java/org/dataone/integration/it/apiTests/MNCoreV2IT.java
A         src/test/java/org/dataone/integration/it/apiTests/CNQueryV2IT.java
A         src/test/java/org/dataone/integration/it/apiTests/MNv1TestSuite.java
A         src/test/java/org/dataone/integration/it/apiTests/MNCoreV2SlowIT.java
A         src/test/java/org/dataone/integration/it/apiTests/CNReplicationV1IT.java
A         src/test/java/org/dataone/integration/it/apiTests/MNAuthorizationV1IT.java
A         src/test/java/org/dataone/integration/it/apiTests/CNViewV2IT.java
A         src/test/java/org/dataone/integration/it/apiTests/CNReadV2IT.java
A         src/test/java/org/dataone/integration/it/apiTests/MNStorageV1IT.java
A         src/test/java/org/dataone/integration/it/apiTests/MNQueryV2IT.java
A         src/test/java/org/dataone/integration/it/apiTests/CNContentIntegrityV1V2IT.java
A         src/test/java/org/dataone/integration/it/apiTests/MNReplicationV1IT.java
A         src/test/java/org/dataone/integration/it/apiTests/CNRegisterV1IT.java
A         src/test/java/org/dataone/integration/it/apiTests/MNViewV2IT.java
A         src/test/java/org/dataone/integration/it/apiTests/MNReadV2IT.java
A         src/test/java/org/dataone/integration/it/apiTests/CNAuthenticationV1V2IT.java
A         src/test/java/org/dataone/integration/it/apiTests/CNCoreV1IT.java
A         src/test/java/org/dataone/integration/it/apiTests/CNIdentityV1IT.java
A         src/test/java/org/dataone/integration/it/apiTests/MNContentIntegrityV1V2IT.java
A         src/test/java/org/dataone/integration/it/apiTests/CNAuthorizationV2IT.java
A         src/test/java/org/dataone/integration/it/apiTests/MNAuthenticationV1V2IT.java
A         src/test/java/org/dataone/integration/it/apiTests/MNCoreV1IT.java
A         src/test/java/org/dataone/integration/it/apiTests/CNQueryV1IT.java
A         src/test/java/org/dataone/integration/it/apiTests/MNPackageV2IT.java
A         src/test/java/org/dataone/integration/it/apiTests/MNCoreV1SlowIT.java
A         src/test/java/org/dataone/integration/it/apiTests/CNReplicationV2IT.java
A         src/test/java/org/dataone/integration/it/apiTests/MNAuthorizationV2IT.java
A         src/test/java/org/dataone/integration/it/apiTests/CNReadV1IT.java
A         src/test/java/org/dataone/integration/it/apiTests/MNStorageV2IT.java
A         src/test/java/org/dataone/integration/it/apiTests/MNQueryV1IT.java
A         src/test/java/org/dataone/integration/it/CNodeTier1_search_IT.java
A         src/test/python
A         src/test/python/org
A         src/test/python/org/dataone
A         src/test/python/org/dataone/client
AU        src/test/python/org/dataone/client/test_client.py
A         src/test/python/org/dataone/client/d1_test_case.py
A         src/test/python/org/dataone/integration
A         src/test/python/org/dataone/integration/context.py
A         src/test/python/org/dataone/integration/tier_1_mn_core_getobjectstatistics.py
A         src/test/python/org/dataone/integration/tier_3_mn_storage_create.py
A         src/test/python/org/dataone/integration/tier_1_mn_core_getstatus.py
A         src/test/python/org/dataone/integration/tier_1_mn_read_getchecksum.py
A         src/test/python/org/dataone/integration/tier_1_mn_core_getcapabilities.py
A         src/test/python/org/dataone/integration/tier_1_mn_read_synchronizationfailed.py
A         src/test/python/org/dataone/integration/tier_1_mn_core_ping.py
A         src/test/python/org/dataone/integration/tier_3_mn_storage_update.py
AU        src/test/python/org/dataone/integration/test_all.py
A         src/test/python/org/dataone/integration/tier_1_mn_read_get.py
A         src/test/python/org/dataone/integration/tier_1_mn_core_getlogrecords.py
A         src/test/python/org/dataone/integration/tier_1_mn_read_describe.py
A         src/test/python/org/dataone/integration/test_utilities.py
A         src/test/python/org/dataone/integration/tier_1_mn_read_getsystemmetadata.py
A         src/test/python/org/dataone/integration/tier_1_mn_read_listobjects.py
A         src/test/python/org/dataone/integration/tier_1_mn_core_getoperationstatistics.py
A         src/main
A         src/main/java
A         src/main/java/org
A         src/main/java/org/dataone
A         src/main/java/org/dataone/client
A         src/main/java/org/dataone/service
A         src/main/java/org/dataone/service/util
A         src/main/java/org/dataone/integration
A         src/main/java/org/dataone/integration/ContextAwareTestCaseDataone.java
A         src/main/java/org/dataone/integration/IntegrationTestContextParameters.java
A         src/main/java/org/dataone/integration/webTest
A         src/main/java/org/dataone/integration/webTest/AtomicTest.java
A         src/main/java/org/dataone/integration/webTest/StreamingWebTestListener.java
A         src/main/java/org/dataone/integration/webTest/TestRunnerHttpServlet.java
A         src/main/java/org/dataone/integration/webTest/WebTestName.java
A         src/main/java/org/dataone/integration/webTest/Launcher.java
A         src/main/java/org/dataone/integration/webTest/WebTestDescription.java
A         src/main/java/org/dataone/integration/webTest/WebTestImplementation.java
A         src/main/java/org/dataone/integration/webTest/WebTestListener.java
A         src/main/java/org/dataone/integration/webTest/MavenTestRunnerHttpServlet.java
AU        src/main/java/org/dataone/integration/webTest/TestRunnerIndexServlet.java
A         src/main/java/org/dataone/integration/webTest/StreamableSerializer.java
A         src/main/java/org/dataone/integration/webTest/TestRunnerApp.java
A         src/main/java/org/dataone/integration/hazelcast
A         src/main/java/org/dataone/integration/TestIterationEndingException.java
A         src/main/java/org/dataone/integration/adapters
A         src/main/java/org/dataone/integration/adapters/CommonCallAdapter.java
A         src/main/java/org/dataone/integration/adapters/MNCallAdapter.java
A         src/main/java/org/dataone/integration/adapters/CNCallAdapter.java
A         src/main/java/org/dataone/integration/EMLBuilderUtils.java
AU        src/main/java/org/dataone/integration/ExampleUtilities.java
A         src/main/java/org/dataone/integration/APITestUtils.java
A         src/main/java/org/dataone/configuration
A         src/main/java/org/dataone/configuration/TestSettings.java
A         src/main/resources
A         src/main/resources/commons-logging.properties
AU        src/main/resources/log4j.properties
AU        src/main/resources/logback.xml
A         src/main/resources/results.html
A         src/main/resources/results_head.html
A         src/main/resources/org
A         src/main/resources/org/dataone
A         src/main/resources/org/dataone/configuration
A         src/main/resources/org/dataone/configuration/context.DEV.test.properties
A         src/main/resources/org/dataone/configuration/context.SANDBOX.test.properties
A         src/main/resources/org/dataone/configuration/customHudsonDevNodelist.xml
AU        src/main/resources/org/dataone/configuration/context.DEV2.test.properties
A         src/main/resources/org/dataone/configuration/context.STAGE-2.test.properties
A         src/main/resources/org/dataone/configuration/context.STAGE.test.properties
A         src/main/resources/org/dataone/configuration/context.LOCAL_METACAT.test.properties
A         src/main/resources/org/dataone/configuration/default.common.test.properties
A         src/main/resources/org/dataone/configuration/context.LOCAL.test.properties
A         src/main/webapp
A         src/main/webapp/resultsHelp.html
A         src/main/webapp/index.jsp
A         src/main/webapp/results.html
A         src/main/webapp/images
AU        src/main/webapp/images/yellow.png
AU        src/main/webapp/images/sunny.gif
AU        src/main/webapp/images/grey.png
AU        src/main/webapp/images/blue.png
AU        src/main/webapp/images/help.png
AU        src/main/webapp/images/red.png
A         src/main/webapp/results_head.html
A         src/main/webapp/WEB-INF
AU        src/main/webapp/WEB-INF/web.xml
A         src/license-header.txt
A         pom.xml
A         tierTestingMethodTemplater.pl
A         README.txt
A         nbactions.xml
AU        LICENSE.txt
 U        .
At revision 17238
no change for https://repository.dataone.org/software/cicore/trunk/d1_integration since the previous build
Parsing POMs
Established TCP socket on 52895
[d1_integration] $ /usr/lib/jvm/java-7-openjdk-amd64/bin/java -cp /var/lib/jenkins/plugins/maven-plugin/WEB-INF/lib/maven3-agent-1.7.jar:/usr/share/maven/boot/plexus-classworlds-2.x.jar org.jvnet.hudson.maven3.agent.Maven3Main /usr/share/maven /var/cache/jenkins/war/WEB-INF/lib/remoting-2.52.jar /var/lib/jenkins/plugins/maven-plugin/WEB-INF/lib/maven3-interceptor-1.7.jar /var/lib/jenkins/plugins/maven-plugin/WEB-INF/lib/maven3-interceptor-commons-1.7.jar 52895
<===[JENKINS REMOTING CAPACITY]===>channel started
Executing Maven:  -B -f /var/lib/jenkins/jobs/d1_integration_Sandbox_authToken/workspace/d1_integration/pom.xml verify -Dit.test=AuthTokenFunctionalIT -Dtest=TestDefaultSettings -Dcontext.label=SANDBOX
[INFO] Scanning for projects...
[WARNING] 
[WARNING] Some problems were encountered while building the effective model for org.dataone:d1_integration:war:2.0-SNAPSHOT
[WARNING] 'build.plugins.plugin.version' for org.apache.maven.plugins:maven-compiler-plugin is missing. @ line 201, column 15
[WARNING] 'build.plugins.plugin.version' for org.codehaus.mojo:buildnumber-maven-plugin is missing. @ line 225, column 15
[WARNING] 'build.plugins.plugin.version' for com.mycila.maven-license-plugin:maven-license-plugin is missing. @ line 218, column 15
[WARNING] 'build.plugins.plugin.version' for org.apache.maven.plugins:maven-war-plugin is missing. @ line 241, column 15
[WARNING] 
[WARNING] It is highly recommended to fix these problems because they threaten the stability of your build.
[WARNING] 
[WARNING] For this reason, future Maven versions might no longer support building such malformed projects.
[WARNING] 
[INFO]                                                                         
[INFO] ------------------------------------------------------------------------
[INFO] Building DataONE Integration Testing Package 2.0-SNAPSHOT
[INFO] ------------------------------------------------------------------------
[INFO] 
[INFO] --- buildnumber-maven-plugin:1.2:create (default) @ d1_integration ---
[INFO] Checking for local modifications: skipped.
[INFO] Updating project files from SCM: skipped.
[INFO] Executing: /bin/sh -c cd /var/lib/jenkins/jobs/d1_integration_Sandbox_authToken/workspace/d1_integration && svn --non-interactive info
[INFO] Working directory: /var/lib/jenkins/jobs/d1_integration_Sandbox_authToken/workspace/d1_integration
[INFO] Storing buildNumber: 17238 at timestamp: 1450206876349
[INFO] Executing: /bin/sh -c cd /var/lib/jenkins/jobs/d1_integration_Sandbox_authToken/workspace/d1_integration && svn --non-interactive info
[INFO] Working directory: /var/lib/jenkins/jobs/d1_integration_Sandbox_authToken/workspace/d1_integration
[INFO] Storing buildScmBranch: trunk
[INFO] 
[INFO] --- maven-resources-plugin:2.3:resources (default-resources) @ d1_integration ---
[WARNING] Using platform encoding (UTF-8 actually) to copy filtered resources, i.e. build is platform dependent!
[INFO] Copying 14 resources
[INFO] 
[INFO] --- maven-compiler-plugin:2.0.2:compile (default-compile) @ d1_integration ---
[INFO] Compiling 22 source files to /var/lib/jenkins/jobs/d1_integration_Sandbox_authToken/workspace/d1_integration/target/classes
[INFO] 
[INFO] --- maven-resources-plugin:2.3:testResources (default-testResources) @ d1_integration ---
[WARNING] Using platform encoding (UTF-8 actually) to copy filtered resources, i.e. build is platform dependent!
[INFO] Copying 60 resources
[INFO] 
[INFO] --- maven-compiler-plugin:2.0.2:testCompile (default-testCompile) @ d1_integration ---
[INFO] Compiling 147 source files to /var/lib/jenkins/jobs/d1_integration_Sandbox_authToken/workspace/d1_integration/target/test-classes
[INFO] 
[INFO] --- maven-surefire-plugin:2.10:test (default-test) @ d1_integration ---
[INFO] Surefire report directory: /var/lib/jenkins/jobs/d1_integration_Sandbox_authToken/workspace/d1_integration/target/surefire-reports

-------------------------------------------------------
 T E S T S
-------------------------------------------------------
Running org.dataone.integration.contextTests.TestDefaultSettings
Tests run: 1, Failures: 0, Errors: 0, Skipped: 0, Time elapsed: 0.085 sec

Results :

Tests run: 1, Failures: 0, Errors: 0, Skipped: 0

[JENKINS] Recording test results
[INFO] 
[INFO] --- maven-antrun-plugin:1.3:run (execution1) @ d1_integration ---
[INFO] Executing tasks
     [copy] Copying 239 files to /var/lib/jenkins/jobs/d1_integration_Sandbox_authToken/workspace/d1_integration/target/classes
     [copy] Copying 3 files to /var/lib/jenkins/jobs/d1_integration_Sandbox_authToken/workspace/d1_integration/target/d1_integration-2.0-SNAPSHOT/org/dataone/integration/webTest
[INFO] Executed tasks
[INFO] 
[INFO] --- maven-dependency-plugin:2.3:unpack-dependencies (jetty-classpath) @ d1_integration ---
[INFO] Unpacking /var/lib/jenkins/.m2/repository/org/eclipse/jetty/orbit/org.apache.jasper.glassfish/2.2.2.v201112011158/org.apache.jasper.glassfish-2.2.2.v201112011158.jar to /var/lib/jenkins/jobs/d1_integration_Sandbox_authToken/workspace/d1_integration/target/d1_integration-2.0-SNAPSHOT with includes "" and excludes ""
[INFO] Unpacking /var/lib/jenkins/.m2/repository/org/slf4j/slf4j-simple/1.6.4/slf4j-simple-1.6.4.jar to /var/lib/jenkins/jobs/d1_integration_Sandbox_authToken/workspace/d1_integration/target/d1_integration-2.0-SNAPSHOT with includes "" and excludes ""
[INFO] Unpacking /var/lib/jenkins/.m2/repository/org/eclipse/jetty/jetty-websocket/8.1.15.v20140411/jetty-websocket-8.1.15.v20140411.jar to /var/lib/jenkins/jobs/d1_integration_Sandbox_authToken/workspace/d1_integration/target/d1_integration-2.0-SNAPSHOT with includes "" and excludes ""
[INFO] Unpacking /var/lib/jenkins/.m2/repository/org/eclipse/jetty/orbit/javax.security.auth.message/1.0.0.v201108011116/javax.security.auth.message-1.0.0.v201108011116.jar to /var/lib/jenkins/jobs/d1_integration_Sandbox_authToken/workspace/d1_integration/target/d1_integration-2.0-SNAPSHOT with includes "" and excludes ""
[INFO] Unpacking /var/lib/jenkins/.m2/repository/org/eclipse/jetty/orbit/javax.servlet.jsp.jstl/1.2.0.v201105211821/javax.servlet.jsp.jstl-1.2.0.v201105211821.jar to /var/lib/jenkins/jobs/d1_integration_Sandbox_authToken/workspace/d1_integration/target/d1_integration-2.0-SNAPSHOT with includes "" and excludes ""
[INFO] Unpacking /var/lib/jenkins/.m2/repository/org/eclipse/jetty/orbit/com.sun.el/2.2.0.v201108011116/com.sun.el-2.2.0.v201108011116.jar to /var/lib/jenkins/jobs/d1_integration_Sandbox_authToken/workspace/d1_integration/target/d1_integration-2.0-SNAPSHOT with includes "" and excludes ""
[INFO] Unpacking /var/lib/jenkins/.m2/repository/org/eclipse/jetty/orbit/javax.mail.glassfish/1.4.1.v201005082020/javax.mail.glassfish-1.4.1.v201005082020.jar to /var/lib/jenkins/jobs/d1_integration_Sandbox_authToken/workspace/d1_integration/target/d1_integration-2.0-SNAPSHOT with includes "" and excludes ""
[INFO] Unpacking /var/lib/jenkins/.m2/repository/org/slf4j/slf4j-api/1.6.4/slf4j-api-1.6.4.jar to /var/lib/jenkins/jobs/d1_integration_Sandbox_authToken/workspace/d1_integration/target/d1_integration-2.0-SNAPSHOT with includes "" and excludes ""
[INFO] Unpacking /var/lib/jenkins/.m2/repository/org/eclipse/jetty/jetty-io/8.1.15.v20140411/jetty-io-8.1.15.v20140411.jar to /var/lib/jenkins/jobs/d1_integration_Sandbox_authToken/workspace/d1_integration/target/d1_integration-2.0-SNAPSHOT with includes "" and excludes ""
[INFO] Unpacking /var/lib/jenkins/.m2/repository/org/eclipse/jetty/orbit/javax.servlet.jsp/2.2.0.v201112011158/javax.servlet.jsp-2.2.0.v201112011158.jar to /var/lib/jenkins/jobs/d1_integration_Sandbox_authToken/workspace/d1_integration/target/d1_integration-2.0-SNAPSHOT with includes "" and excludes ""
[INFO] Unpacking /var/lib/jenkins/.m2/repository/org/eclipse/jetty/aggregate/jetty-all-server/8.1.15.v20140411/jetty-all-server-8.1.15.v20140411.jar to /var/lib/jenkins/jobs/d1_integration_Sandbox_authToken/workspace/d1_integration/target/d1_integration-2.0-SNAPSHOT with includes "" and excludes ""
[INFO] Unpacking /var/lib/jenkins/.m2/repository/org/eclipse/jetty/jetty-jsp/8.1.15.v20140411/jetty-jsp-8.1.15.v20140411.jar to /var/lib/jenkins/jobs/d1_integration_Sandbox_authToken/workspace/d1_integration/target/d1_integration-2.0-SNAPSHOT with includes "" and excludes ""
[INFO] Unpacking /var/lib/jenkins/.m2/repository/org/eclipse/jetty/orbit/org.apache.taglibs.standard.glassfish/1.2.0.v201112081803/org.apache.taglibs.standard.glassfish-1.2.0.v201112081803.jar to /var/lib/jenkins/jobs/d1_integration_Sandbox_authToken/workspace/d1_integration/target/d1_integration-2.0-SNAPSHOT with includes "" and excludes ""
[INFO] Unpacking /var/lib/jenkins/.m2/repository/javax/servlet/servlet-api/2.5/servlet-api-2.5.jar to /var/lib/jenkins/jobs/d1_integration_Sandbox_authToken/workspace/d1_integration/target/d1_integration-2.0-SNAPSHOT with includes "" and excludes ""
[INFO] Unpacking /var/lib/jenkins/.m2/repository/org/eclipse/jetty/orbit/javax.activation/1.1.0.v201105071233/javax.activation-1.1.0.v201105071233.jar to /var/lib/jenkins/jobs/d1_integration_Sandbox_authToken/workspace/d1_integration/target/d1_integration-2.0-SNAPSHOT with includes "" and excludes ""
[INFO] Unpacking /var/lib/jenkins/.m2/repository/org/eclipse/jetty/orbit/javax.annotation/1.1.0.v201108011116/javax.annotation-1.1.0.v201108011116.jar to /var/lib/jenkins/jobs/d1_integration_Sandbox_authToken/workspace/d1_integration/target/d1_integration-2.0-SNAPSHOT with includes "" and excludes ""
[INFO] Unpacking /var/lib/jenkins/.m2/repository/org/eclipse/jetty/jetty-http/8.1.15.v20140411/jetty-http-8.1.15.v20140411.jar to /var/lib/jenkins/jobs/d1_integration_Sandbox_authToken/workspace/d1_integration/target/d1_integration-2.0-SNAPSHOT with includes "" and excludes ""
[INFO] Unpacking /var/lib/jenkins/.m2/repository/org/eclipse/jetty/jetty-util/8.1.15.v20140411/jetty-util-8.1.15.v20140411.jar to /var/lib/jenkins/jobs/d1_integration_Sandbox_authToken/workspace/d1_integration/target/d1_integration-2.0-SNAPSHOT with includes "" and excludes ""
[INFO] Unpacking /var/lib/jenkins/.m2/repository/org/eclipse/jetty/orbit/org.eclipse.jdt.core/3.7.1/org.eclipse.jdt.core-3.7.1.jar to /var/lib/jenkins/jobs/d1_integration_Sandbox_authToken/workspace/d1_integration/target/d1_integration-2.0-SNAPSHOT with includes "" and excludes ""
[INFO] Unpacking /var/lib/jenkins/.m2/repository/org/eclipse/jetty/orbit/javax.servlet/3.0.0.v201112011016/javax.servlet-3.0.0.v201112011016.jar to /var/lib/jenkins/jobs/d1_integration_Sandbox_authToken/workspace/d1_integration/target/d1_integration-2.0-SNAPSHOT with includes "" and excludes ""
[INFO] Unpacking /var/lib/jenkins/.m2/repository/org/eclipse/jetty/orbit/javax.el/2.2.0.v201108011116/javax.el-2.2.0.v201108011116.jar to /var/lib/jenkins/jobs/d1_integration_Sandbox_authToken/workspace/d1_integration/target/d1_integration-2.0-SNAPSHOT with includes "" and excludes ""
[INFO] 
[INFO] --- maven-war-plugin:2.1.1:war (default-war) @ d1_integration ---
[INFO] Packaging webapp
[INFO] Assembling webapp [d1_integration] in [/var/lib/jenkins/jobs/d1_integration_Sandbox_authToken/workspace/d1_integration/target/d1_integration-2.0-SNAPSHOT]
[INFO] Processing war project
[INFO] Copying webapp resources [/var/lib/jenkins/jobs/d1_integration_Sandbox_authToken/workspace/d1_integration/src/main/webapp]
[INFO] Webapp assembled in [458 msecs]
[INFO] Building war: /var/lib/jenkins/jobs/d1_integration_Sandbox_authToken/workspace/d1_integration/target/d1_integration-2.0-SNAPSHOT.war
[INFO] WEB-INF/web.xml already added, skipping
[INFO] 
[INFO] --- maven-antrun-plugin:1.3:run (execution2) @ d1_integration ---
[INFO] Executing tasks
     [move] Moving 1 file to /var/lib/jenkins/jobs/d1_integration_Sandbox_authToken/workspace/d1_integration/target
[INFO] Executed tasks
[INFO] 
[INFO] --- maven-failsafe-plugin:2.8.1:integration-test (integration-test) @ d1_integration ---
[INFO] Failsafe report directory: /var/lib/jenkins/jobs/d1_integration_Sandbox_authToken/workspace/d1_integration/target/failsafe-reports

-------------------------------------------------------
 T E S T S
-------------------------------------------------------
Running org.dataone.integration.it.functional.v2.AuthTokenFunctionalIT
20151215-19:15:02: [INFO]: attempting to load context-specific configuration file (context SANDBOX): org/dataone/configuration/context.SANDBOX.test.properties [org.dataone.configuration.TestSettings]
20151215-19:15:02: [INFO]: attempting to load context-specific configuration file (context SANDBOX): org/dataone/configuration/context.SANDBOX.test.properties [org.dataone.configuration.TestSettings]
20151215-19:15:02: [INFO]: resource: org/dataone/configuration/context.SANDBOX.test.properties [org.dataone.configuration.TestSettings]
20151215-19:15:02: [INFO]: configuration url: file:/var/lib/jenkins/jobs/d1_integration_Sandbox_authToken/workspace/d1_integration/target/classes/org/dataone/configuration/context.SANDBOX.test.properties [org.dataone.configuration.TestSettings]
20151215-19:15:02: [INFO]: resource: org/dataone/configuration/default.common.test.properties [org.dataone.configuration.TestSettings]
20151215-19:15:02: [INFO]: configuration url: file:/var/lib/jenkins/jobs/d1_integration_Sandbox_authToken/workspace/d1_integration/target/classes/org/dataone/configuration/default.common.test.properties [org.dataone.configuration.TestSettings]
20151215-19:15:03: [INFO]: **************************************************** [org.dataone.integration.ContextAwareTestCaseDataone]
20151215-19:15:03: [INFO]: ***  context label:   SANDBOX [org.dataone.integration.ContextAwareTestCaseDataone]
20151215-19:15:03: [INFO]: **************************************************** [org.dataone.integration.ContextAwareTestCaseDataone]
~~~ Context is from d1client.properties: https://cn-sandbox.test.dataone.org/cn
20151215-19:15:04: [INFO]: rest call info: GET https://cn-sandbox.test.dataone.org/cn/v1/node [org.dataone.client.rest.RestClient]
20151215-19:15:04: [INFO]: response httpCode: 200 [org.dataone.service.util.ExceptionHandler]
20151215-19:15:05: [INFO]: isNodeAlive for Node: https://cn-sandbox.test.dataone.org/cn ... [org.dataone.integration.ContextAwareTestCaseDataone]
20151215-19:15:05: [INFO]: ... calling node ... [org.dataone.integration.ContextAwareTestCaseDataone]
20151215-19:15:05: [INFO]: rest call info: GET https://cn-sandbox.test.dataone.org/cn [org.dataone.client.rest.RestClient]
20151215-19:15:05: [INFO]: ... called node [org.dataone.integration.ContextAwareTestCaseDataone]
20151215-19:15:05: [INFO]: *** Adding CN to list: cn-sandbox [ https://cn-sandbox.test.dataone.org/cn ] [org.dataone.integration.ContextAwareTestCaseDataone]
20151215-19:15:05: [INFO]: isNodeAlive for Node: https://cn-sandbox-ucsb-1.test.dataone.org/cn ... [org.dataone.integration.ContextAwareTestCaseDataone]
20151215-19:15:05: [INFO]: ... calling node ... [org.dataone.integration.ContextAwareTestCaseDataone]
20151215-19:15:06: [INFO]: rest call info: GET https://cn-sandbox-ucsb-1.test.dataone.org/cn [org.dataone.client.rest.RestClient]
20151215-19:15:06: [INFO]: ... called node [org.dataone.integration.ContextAwareTestCaseDataone]
20151215-19:15:06: [INFO]: *** Adding CN to list: cn-sandbox-ucsb-1 [ https://cn-sandbox-ucsb-1.test.dataone.org/cn ] [org.dataone.integration.ContextAwareTestCaseDataone]
20151215-19:15:06: [INFO]: isNodeAlive for Node: https://cn-sandbox-orc-1.test.dataone.org/cn ... [org.dataone.integration.ContextAwareTestCaseDataone]
20151215-19:15:06: [INFO]: ... calling node ... [org.dataone.integration.ContextAwareTestCaseDataone]
20151215-19:15:06: [INFO]: rest call info: GET https://cn-sandbox-orc-1.test.dataone.org/cn [org.dataone.client.rest.RestClient]
20151215-19:15:06: [INFO]: ... called node [org.dataone.integration.ContextAwareTestCaseDataone]
20151215-19:15:06: [INFO]: *** Adding CN to list: cn-sandbox-orc-1 [ https://cn-sandbox-orc-1.test.dataone.org/cn ] [org.dataone.integration.ContextAwareTestCaseDataone]
20151215-19:15:06: [INFO]: isNodeAlive for Node: https://mn-sandbox-ucsb-1.test.dataone.org/knb/d1/mn ... [org.dataone.integration.ContextAwareTestCaseDataone]
20151215-19:15:06: [INFO]: ... calling node ... [org.dataone.integration.ContextAwareTestCaseDataone]
20151215-19:15:07: [INFO]: rest call info: GET https://mn-sandbox-ucsb-1.test.dataone.org/knb/d1/mn [org.dataone.client.rest.RestClient]
20151215-19:15:07: [INFO]: ... called node [org.dataone.integration.ContextAwareTestCaseDataone]
20151215-19:15:07: [INFO]: *** Adding MN to list: mn-sandbox-ucsb-1 [ https://mn-sandbox-ucsb-1.test.dataone.org/knb/d1/mn ] [org.dataone.integration.ContextAwareTestCaseDataone]
20151215-19:15:07: [INFO]: isNodeAlive for Node: https://mn-sandbox-ucsb-2.test.dataone.org/knb/d1/mn ... [org.dataone.integration.ContextAwareTestCaseDataone]
20151215-19:15:07: [INFO]: ... calling node ... [org.dataone.integration.ContextAwareTestCaseDataone]
20151215-19:15:07: [INFO]: rest call info: GET https://mn-sandbox-ucsb-2.test.dataone.org/knb/d1/mn [org.dataone.client.rest.RestClient]
20151215-19:15:07: [INFO]: ... called node [org.dataone.integration.ContextAwareTestCaseDataone]
20151215-19:15:07: [INFO]: *** Adding MN to list: mn-sandbox-ucsb-2 [ https://mn-sandbox-ucsb-2.test.dataone.org/knb/d1/mn ] [org.dataone.integration.ContextAwareTestCaseDataone]
20151215-19:15:07: [INFO]: isNodeAlive for Node: https://mn-sandbox-orc-1.test.dataone.org/mn ... [org.dataone.integration.ContextAwareTestCaseDataone]
20151215-19:15:07: [INFO]: ... calling node ... [org.dataone.integration.ContextAwareTestCaseDataone]
20151215-19:15:08: [INFO]: rest call info: GET https://mn-sandbox-orc-1.test.dataone.org/mn [org.dataone.client.rest.RestClient]
20151215-19:15:08: [INFO]: ... called node [org.dataone.integration.ContextAwareTestCaseDataone]
20151215-19:15:08: [INFO]: *** Adding MN to list: mn-sandbox-orc-1 [ https://mn-sandbox-orc-1.test.dataone.org/mn ] [org.dataone.integration.ContextAwareTestCaseDataone]
20151215-19:15:08: [INFO]: isNodeAlive for Node: http://dfc-mn.renci.org:8080/irods-dataone/rest/mn ... [org.dataone.integration.ContextAwareTestCaseDataone]
20151215-19:15:08: [INFO]: ... calling node ... [org.dataone.integration.ContextAwareTestCaseDataone]
20151215-19:15:08: [INFO]: rest call info: GET http://dfc-mn.renci.org:8080/irods-dataone/rest/mn [org.dataone.client.rest.RestClient]
20151215-19:15:08: [INFO]: ... called node [org.dataone.integration.ContextAwareTestCaseDataone]
20151215-19:15:08: [INFO]: *** Adding MN to list: Datanet Federation iRODS Node [ http://dfc-mn.renci.org:8080/irods-dataone/rest/mn ] [org.dataone.integration.ContextAwareTestCaseDataone]
20151215-19:15:08: [INFO]: isNodeAlive for Node: https://trusty.iarc.uaf.edu/mn ... [org.dataone.integration.ContextAwareTestCaseDataone]
20151215-19:15:08: [INFO]: ... calling node ... [org.dataone.integration.ContextAwareTestCaseDataone]
20151215-19:15:09: [INFO]: rest call info: GET https://trusty.iarc.uaf.edu/mn [org.dataone.client.rest.RestClient]
20151215-19:15:09: [INFO]: ... called node [org.dataone.integration.ContextAwareTestCaseDataone]
20151215-19:15:09: [INFO]: *** Adding MN to list: IARC Data Archive [ https://trusty.iarc.uaf.edu/mn ] [org.dataone.integration.ContextAwareTestCaseDataone]
20151215-19:15:09: [INFO]: isNodeAlive for Node: http://usgs.ornl.gov/USGS_MN/mn ... [org.dataone.integration.ContextAwareTestCaseDataone]
20151215-19:15:09: [INFO]: ... calling node ... [org.dataone.integration.ContextAwareTestCaseDataone]
20151215-19:15:10: [INFO]: rest call info: GET http://usgs.ornl.gov/USGS_MN/mn [org.dataone.client.rest.RestClient]
20151215-19:15:10: [INFO]: ... called node [org.dataone.integration.ContextAwareTestCaseDataone]
20151215-19:15:10: [INFO]: *** Adding MN to list: USGS Science Data Catalog [ http://usgs.ornl.gov/USGS_MN/mn ] [org.dataone.integration.ContextAwareTestCaseDataone]
20151215-19:15:10: [INFO]: isNodeAlive for Node: http://alpha.tdar.org/dataone ... [org.dataone.integration.ContextAwareTestCaseDataone]
20151215-19:15:10: [INFO]: ... calling node ... [org.dataone.integration.ContextAwareTestCaseDataone]
20151215-19:15:10: [INFO]: rest call info: GET http://alpha.tdar.org/dataone [org.dataone.client.rest.RestClient]
20151215-19:15:10: [INFO]: ... called node [org.dataone.integration.ContextAwareTestCaseDataone]
20151215-19:15:10: [INFO]: *** Adding MN to list: TDAR Alpha [ http://alpha.tdar.org/dataone ] [org.dataone.integration.ContextAwareTestCaseDataone]
20151215-19:15:10: [INFO]: trying to filter CN list for the round robin CN... original size: 3, includes nodes: [org.dataone.integration.ContextAwareTestCaseDataone]
20151215-19:15:10: [INFO]:     CN: https://cn-sandbox.test.dataone.org/cn "Round Robin Sandbox Router of Coordinating Nodes" [org.dataone.integration.ContextAwareTestCaseDataone]
20151215-19:15:10: [INFO]:     CN: https://cn-sandbox-ucsb-1.test.dataone.org/cn "University of California Santa Barbara Sandbox Coordinating Node" [org.dataone.integration.ContextAwareTestCaseDataone]
20151215-19:15:10: [INFO]:     CN: https://cn-sandbox-orc-1.test.dataone.org/cn "Oak Ridge National Laboratory Sandbox Coordinating Node" [org.dataone.integration.ContextAwareTestCaseDataone]
20151215-19:15:10: [INFO]: excluding round robin CN: https://cn-sandbox.test.dataone.org/cn "Round Robin Sandbox Router of Coordinating Nodes" [org.dataone.integration.ContextAwareTestCaseDataone]
20151215-19:15:10: [INFO]: including CN: https://cn-sandbox-ucsb-1.test.dataone.org/cn "University of California Santa Barbara Sandbox Coordinating Node" [org.dataone.integration.ContextAwareTestCaseDataone]
20151215-19:15:10: [INFO]: including CN: https://cn-sandbox-orc-1.test.dataone.org/cn "Oak Ridge National Laboratory Sandbox Coordinating Node" [org.dataone.integration.ContextAwareTestCaseDataone]
20151215-19:15:10: [INFO]: filtered CN list without round robin CN. size: 2, including nodes: [org.dataone.integration.ContextAwareTestCaseDataone]
20151215-19:15:10: [INFO]:     CN: https://cn-sandbox-ucsb-1.test.dataone.org/cn "University of California Santa Barbara Sandbox Coordinating Node" [org.dataone.integration.ContextAwareTestCaseDataone]
20151215-19:15:10: [INFO]:     CN: https://cn-sandbox-orc-1.test.dataone.org/cn "Oak Ridge National Laboratory Sandbox Coordinating Node" [org.dataone.integration.ContextAwareTestCaseDataone]
20151215-19:15:10: [INFO]: **************************************************** [org.dataone.integration.ContextAwareTestCaseDataone]
20151215-19:15:10: [INFO]: certificate directory: /etc/dataone/client/testClientCerts/ [org.dataone.integration.ContextAwareTestCaseDataone]
20151215-19:15:10: [INFO]: certificate filename: cnSandboxORC1 [org.dataone.integration.ContextAwareTestCaseDataone]
20151215-19:15:10: [INFO]: client setup as Subject: CN=urn:node:cnSandboxORC1,DC=dataone,DC=org [org.dataone.integration.ContextAwareTestCaseDataone]
20151215-19:15:10: [INFO]: created client for certificate file: cnSandboxORC1 with subject: CN=urn:node:cnSandboxORC1,DC=dataone,DC=org [org.dataone.integration.ContextAwareTestCaseDataone]
20151215-19:15:11: [INFO]: rest call info: GET https://cn-sandbox-ucsb-1.test.dataone.org/cn/v2/node [org.dataone.client.rest.RestClient]
20151215-19:15:11: [INFO]: response httpCode: 200 [org.dataone.service.util.ExceptionHandler]
20151215-19:15:11: [INFO]: created client for certificate file: cnSandboxORC1 with subject: CN=urn:node:cnSandboxORC1,DC=dataone,DC=org [org.dataone.integration.ContextAwareTestCaseDataone]
20151215-19:15:11: [INFO]: rest call info: GET https://mn-sandbox-ucsb-1.test.dataone.org/knb/d1/mn/v2/monitor/ping [org.dataone.client.rest.RestClient]
20151215-19:15:11: [INFO]: response httpCode: 200 [org.dataone.service.util.ExceptionHandler]
20151215-19:15:11: [INFO]: rest call info: GET https://mn-sandbox-ucsb-1.test.dataone.org/knb/d1/mn/v2/node [org.dataone.client.rest.RestClient]
20151215-19:15:11: [INFO]: response httpCode: 200 [org.dataone.service.util.ExceptionHandler]
20151215-19:15:12: [INFO]: rest call info: GET https://cn-sandbox.test.dataone.org/cn/v1/node [org.dataone.client.rest.RestClient]
20151215-19:15:12: [INFO]: response httpCode: 200 [org.dataone.service.util.ExceptionHandler]
20151215-19:15:13: [INFO]: rest call info: GET https://cn-sandbox.test.dataone.org/cn/v1/accounts/testId [org.dataone.client.rest.RestClient]
20151215-19:15:13: [INFO]: response httpCode: 404 [org.dataone.service.util.ExceptionHandler]
20151215-19:15:13: [WARN]: [LDAP: error code 32 - No Such Object] [org.dataone.portal.TokenGenerator]
org.dataone.service.exceptions.NotFound: [LDAP: error code 32 - No Such Object]
	at org.dataone.service.util.ExceptionHandler.deserializeXml(ExceptionHandler.java:629)
	at org.dataone.service.util.ExceptionHandler.deserializeXmlAndThrowException(ExceptionHandler.java:517)
	at org.dataone.service.util.ExceptionHandler.deserializeAndThrowException(ExceptionHandler.java:363)
	at org.dataone.service.util.ExceptionHandler.deserializeAndThrowException(ExceptionHandler.java:313)
	at org.dataone.service.util.ExceptionHandler.filterErrors(ExceptionHandler.java:107)
	at org.dataone.client.rest.HttpMultipartRestClient.doGetRequest(HttpMultipartRestClient.java:333)
	at org.dataone.client.rest.HttpMultipartRestClient.doGetRequest(HttpMultipartRestClient.java:318)
	at org.dataone.client.v1.impl.MultipartCNode.getSubjectInfo(MultipartCNode.java:1498)
	at org.dataone.client.v1.impl.MultipartCNode.getSubjectInfo(MultipartCNode.java:1479)
	at org.dataone.portal.TokenGenerator.getSession(TokenGenerator.java:176)
	at org.dataone.integration.it.testImplementations.AuthTokenTestImplementation.getTokenSesssion(AuthTokenTestImplementation.java:61)
	at org.dataone.integration.it.testImplementations.AuthTokenTestImplementation.testCnQuery(AuthTokenTestImplementation.java:373)
	at org.dataone.integration.it.testImplementations.AuthTokenTestImplementation.testCnQuery(AuthTokenTestImplementation.java:334)
	at org.dataone.integration.it.functional.v2.AuthTokenFunctionalIT.testCnQuery(AuthTokenFunctionalIT.java:46)
	at sun.reflect.NativeMethodAccessorImpl.invoke0(Native Method)
	at sun.reflect.NativeMethodAccessorImpl.invoke(NativeMethodAccessorImpl.java:57)
	at sun.reflect.DelegatingMethodAccessorImpl.invoke(DelegatingMethodAccessorImpl.java:43)
	at java.lang.reflect.Method.invoke(Method.java:606)
	at org.junit.runners.model.FrameworkMethod$1.runReflectiveCall(FrameworkMethod.java:44)
	at org.junit.internal.runners.model.ReflectiveCallable.run(ReflectiveCallable.java:15)
	at org.junit.runners.model.FrameworkMethod.invokeExplosively(FrameworkMethod.java:41)
	at org.junit.internal.runners.statements.InvokeMethod.evaluate(InvokeMethod.java:20)
	at org.junit.rules.Verifier$1.evaluate(Verifier.java:34)
	at org.junit.internal.runners.statements.RunBefores.evaluate(RunBefores.java:28)
	at org.junit.runners.BlockJUnit4ClassRunner.runChild(BlockJUnit4ClassRunner.java:76)
	at org.junit.runners.BlockJUnit4ClassRunner.runChild(BlockJUnit4ClassRunner.java:50)
	at org.junit.runners.ParentRunner$3.run(ParentRunner.java:193)
	at org.junit.runners.ParentRunner$1.schedule(ParentRunner.java:52)
	at org.junit.runners.ParentRunner.runChildren(ParentRunner.java:191)
	at org.junit.runners.ParentRunner.access$000(ParentRunner.java:42)
	at org.junit.runners.ParentRunner$2.evaluate(ParentRunner.java:184)
	at org.junit.runners.ParentRunner.run(ParentRunner.java:236)
	at org.apache.maven.surefire.junit4.JUnit4TestSet.execute(JUnit4TestSet.java:53)
	at org.apache.maven.surefire.junit4.JUnit4Provider.executeTestSet(JUnit4Provider.java:119)
	at org.apache.maven.surefire.junit4.JUnit4Provider.invoke(JUnit4Provider.java:101)
	at sun.reflect.NativeMethodAccessorImpl.invoke0(Native Method)
	at sun.reflect.NativeMethodAccessorImpl.invoke(NativeMethodAccessorImpl.java:57)
	at sun.reflect.DelegatingMethodAccessorImpl.invoke(DelegatingMethodAccessorImpl.java:43)
	at java.lang.reflect.Method.invoke(Method.java:606)
	at org.apache.maven.surefire.booter.ProviderFactory$ClassLoaderProxy.invoke(ProviderFactory.java:103)
	at com.sun.proxy.$Proxy0.invoke(Unknown Source)
	at org.apache.maven.surefire.booter.SurefireStarter.invokeProvider(SurefireStarter.java:150)
	at org.apache.maven.surefire.booter.SurefireStarter.runSuitesInProcess(SurefireStarter.java:91)
	at org.apache.maven.surefire.booter.ForkedBooter.main(ForkedBooter.java:69)
20151215-19:15:13: [INFO]: Created auth token: eyJhbGciOiJSUzI1NiJ9.eyJleHAiOjE0NTAyNzE3MTIsInN1YiI6InRlc3RJZCIsImNvbnN1bWVyS2V5IjpudWxsLCJpc3N1ZWRBdCI6IjIwMTUtMTItMTVUMTk6MTU6MTIuNjIzKzAwOjAwIiwidXNlcklkIjoidGVzdElkIiwiZnVsbE5hbWUiOiJKYW5lIFNjaWVudGlzdCIsInR0bCI6NjQ4MDAsImlhdCI6MTQ1MDIwNjkxMn0.oHXZzXTXI3AEWKNTOflYCQmdtmBVwdhCt49nOnBbwca4ni-ZnpS0uCRQNI60IVHePibvYU9Y3gLkAL20EV_ejUSTkBdUlQ1H6C1TSHT4pqJ0k6Tu7J1kSloBzACnW_1CFLbao3vkzdGKbGxHz0sZNoKttFVbgm9FdwG-jQj-uR-cpQ9pQMHbNMIItZ8ERdIGtzCY-LCzeFc-CSNwB83jJ0lli6NHXBg0UkfiszaAWhaiq4BZKG-49RzOKJ3YrhQb6BgFOC_R_lkG1YppN9PEGMYjy0d4JnUyV-VbaOK6zg9Gyldk1AqdElWL1mR1NALNrPDpsj6o4OqDWW_0rDpyEovuBJHHVKmYbeuWYRaFZGae7qbWngZS2GdX2KdR4V7vDq4bs5a8Eu5Z7B5fiIiryPaYi7D9AGJlBXH6-vyj8GBEahIsy-RHMhxQnkKl-ogX9b9dy0XrHvAHg3gPtRajZClRC8hgGDsgggU_EfIgV-dCGDSMigq1MxhAXwsnJyU1BpRIv5nIQtciWZaeQNP8LjET__VcxgH6IjhDvycGK1LDTtk0BAv-LNMa3EZ-Hf8ZszVgSVloF4aTOg0pPNmU7xVDXNoOB5wU_VBv1azKkmbUmHC8WOFBSg4qGEHdFmiwny57TMLKV50nXkzMoA9KlWtQVWYOE8PvCUgdakGQ_wE [org.dataone.integration.it.ContextAwareAdapter]
20151215-19:15:13: [INFO]: 
***************** running test for testCnQuery(...) vs. node: https://cn-sandbox-ucsb-1.test.dataone.org/cn ***************** [org.dataone.integration.ContextAwareTestCaseDataone]
20151215-19:15:13: [INFO]: rest call info: GET https://mn-sandbox-ucsb-1.test.dataone.org/knb/d1/mn/v2/meta/testCnQuery_token_5 [org.dataone.client.rest.RestClient]
20151215-19:15:13: [INFO]: response httpCode: 200 [org.dataone.service.util.ExceptionHandler]
20151215-19:15:13: [INFO]:  ====>>>>> pid of procured test Object: testCnQuery_token_5 [org.dataone.integration.ContextAwareTestCaseDataone]
20151215-19:15:13: [INFO]: attempting CN getSystemMEtadata... [org.dataone.integration.it.ContextAwareAdapter]
20151215-19:15:13: [INFO]: rest call info: GET https://cn-sandbox-ucsb-1.test.dataone.org/cn/v2/meta/testCnQuery_token_5 [org.dataone.client.rest.RestClient]
20151215-19:15:13: [INFO]: response httpCode: 200 [org.dataone.service.util.ExceptionHandler]
20151215-19:15:14: [INFO]: rest call info: GET https://cn-sandbox-ucsb-1.test.dataone.org/cn/v2/query/solr/?q=identifier:testCnQuery_token_5 [org.dataone.client.rest.RestClient]
20151215-19:15:14: [INFO]: response httpCode: 200 [org.dataone.service.util.ExceptionHandler]
20151215-19:15:14: [INFO]: CN.query ran against GET https://cn-sandbox-ucsb-1.test.dataone.org/cn/v2/meta/testCnQuery_token_5 for pid testCnQuery_token_5 [org.dataone.integration.it.ContextAwareAdapter]
20151215-19:15:14: [INFO]: query results: numFound = 0   <doc>s returned = 0 [org.dataone.integration.ContextAwareTestCaseDataone]
20151215-19:15:14: [INFO]: CN.query results have a count of 0 logs and contain 0 returned docs. [org.dataone.integration.it.ContextAwareAdapter]
20151215-19:15:14: [INFO]: **************************************************** [org.dataone.integration.ContextAwareTestCaseDataone]
20151215-19:15:14: [INFO]: ***  context label:   SANDBOX [org.dataone.integration.ContextAwareTestCaseDataone]
20151215-19:15:14: [INFO]: **************************************************** [org.dataone.integration.ContextAwareTestCaseDataone]
20151215-19:15:14: [INFO]: **************************************************** [org.dataone.integration.ContextAwareTestCaseDataone]
20151215-19:15:14: [INFO]: created client for certificate file: cnSandboxORC1 with subject: CN=urn:node:cnSandboxORC1,DC=dataone,DC=org [org.dataone.integration.ContextAwareTestCaseDataone]
20151215-19:15:14: [INFO]: rest call info: GET https://cn-sandbox-ucsb-1.test.dataone.org/cn/v2/node [org.dataone.client.rest.RestClient]
20151215-19:15:14: [INFO]: response httpCode: 200 [org.dataone.service.util.ExceptionHandler]
20151215-19:15:14: [INFO]: created client for certificate file: cnSandboxORC1 with subject: CN=urn:node:cnSandboxORC1,DC=dataone,DC=org [org.dataone.integration.ContextAwareTestCaseDataone]
20151215-19:15:15: [INFO]: rest call info: GET https://mn-sandbox-ucsb-1.test.dataone.org/knb/d1/mn/v2/monitor/ping [org.dataone.client.rest.RestClient]
20151215-19:15:15: [INFO]: response httpCode: 200 [org.dataone.service.util.ExceptionHandler]
20151215-19:15:15: [INFO]: rest call info: GET https://mn-sandbox-ucsb-1.test.dataone.org/knb/d1/mn/v2/node [org.dataone.client.rest.RestClient]
20151215-19:15:15: [INFO]: response httpCode: 200 [org.dataone.service.util.ExceptionHandler]
20151215-19:15:15: [INFO]: rest call info: GET https://cn-sandbox.test.dataone.org/cn/v1/accounts/testId [org.dataone.client.rest.RestClient]
20151215-19:15:15: [INFO]: response httpCode: 404 [org.dataone.service.util.ExceptionHandler]
20151215-19:15:15: [WARN]: [LDAP: error code 32 - No Such Object] [org.dataone.portal.TokenGenerator]
org.dataone.service.exceptions.NotFound: [LDAP: error code 32 - No Such Object]
	at org.dataone.service.util.ExceptionHandler.deserializeXml(ExceptionHandler.java:629)
	at org.dataone.service.util.ExceptionHandler.deserializeXmlAndThrowException(ExceptionHandler.java:517)
	at org.dataone.service.util.ExceptionHandler.deserializeAndThrowException(ExceptionHandler.java:363)
	at org.dataone.service.util.ExceptionHandler.deserializeAndThrowException(ExceptionHandler.java:313)
	at org.dataone.service.util.ExceptionHandler.filterErrors(ExceptionHandler.java:107)
	at org.dataone.client.rest.HttpMultipartRestClient.doGetRequest(HttpMultipartRestClient.java:333)
	at org.dataone.client.rest.HttpMultipartRestClient.doGetRequest(HttpMultipartRestClient.java:318)
	at org.dataone.client.v1.impl.MultipartCNode.getSubjectInfo(MultipartCNode.java:1498)
	at org.dataone.client.v1.impl.MultipartCNode.getSubjectInfo(MultipartCNode.java:1479)
	at org.dataone.portal.TokenGenerator.getSession(TokenGenerator.java:176)
	at org.dataone.integration.it.testImplementations.AuthTokenTestImplementation.getTokenSesssion(AuthTokenTestImplementation.java:61)
	at org.dataone.integration.it.testImplementations.AuthTokenTestImplementation.testMnCreate(AuthTokenTestImplementation.java:147)
	at org.dataone.integration.it.testImplementations.AuthTokenTestImplementation.testMnCreate(AuthTokenTestImplementation.java:111)
	at org.dataone.integration.it.functional.v2.AuthTokenFunctionalIT.testMnCreate(AuthTokenFunctionalIT.java:31)
	at sun.reflect.NativeMethodAccessorImpl.invoke0(Native Method)
	at sun.reflect.NativeMethodAccessorImpl.invoke(NativeMethodAccessorImpl.java:57)
	at sun.reflect.DelegatingMethodAccessorImpl.invoke(DelegatingMethodAccessorImpl.java:43)
	at java.lang.reflect.Method.invoke(Method.java:606)
	at org.junit.runners.model.FrameworkMethod$1.runReflectiveCall(FrameworkMethod.java:44)
	at org.junit.internal.runners.model.ReflectiveCallable.run(ReflectiveCallable.java:15)
	at org.junit.runners.model.FrameworkMethod.invokeExplosively(FrameworkMethod.java:41)
	at org.junit.internal.runners.statements.InvokeMethod.evaluate(InvokeMethod.java:20)
	at org.junit.rules.Verifier$1.evaluate(Verifier.java:34)
	at org.junit.internal.runners.statements.RunBefores.evaluate(RunBefores.java:28)
	at org.junit.runners.BlockJUnit4ClassRunner.runChild(BlockJUnit4ClassRunner.java:76)
	at org.junit.runners.BlockJUnit4ClassRunner.runChild(BlockJUnit4ClassRunner.java:50)
	at org.junit.runners.ParentRunner$3.run(ParentRunner.java:193)
	at org.junit.runners.ParentRunner$1.schedule(ParentRunner.java:52)
	at org.junit.runners.ParentRunner.runChildren(ParentRunner.java:191)
	at org.junit.runners.ParentRunner.access$000(ParentRunner.java:42)
	at org.junit.runners.ParentRunner$2.evaluate(ParentRunner.java:184)
	at org.junit.runners.ParentRunner.run(ParentRunner.java:236)
	at org.apache.maven.surefire.junit4.JUnit4TestSet.execute(JUnit4TestSet.java:53)
	at org.apache.maven.surefire.junit4.JUnit4Provider.executeTestSet(JUnit4Provider.java:119)
	at org.apache.maven.surefire.junit4.JUnit4Provider.invoke(JUnit4Provider.java:101)
	at sun.reflect.NativeMethodAccessorImpl.invoke0(Native Method)
	at sun.reflect.NativeMethodAccessorImpl.invoke(NativeMethodAccessorImpl.java:57)
	at sun.reflect.DelegatingMethodAccessorImpl.invoke(DelegatingMethodAccessorImpl.java:43)
	at java.lang.reflect.Method.invoke(Method.java:606)
	at org.apache.maven.surefire.booter.ProviderFactory$ClassLoaderProxy.invoke(ProviderFactory.java:103)
	at com.sun.proxy.$Proxy0.invoke(Unknown Source)
	at org.apache.maven.surefire.booter.SurefireStarter.invokeProvider(SurefireStarter.java:150)
	at org.apache.maven.surefire.booter.SurefireStarter.runSuitesInProcess(SurefireStarter.java:91)
	at org.apache.maven.surefire.booter.ForkedBooter.main(ForkedBooter.java:69)
20151215-19:15:15: [INFO]: Created auth token: eyJhbGciOiJSUzI1NiJ9.eyJleHAiOjE0NTAyNzE3MTUsInN1YiI6InRlc3RJZCIsImNvbnN1bWVyS2V5IjpudWxsLCJpc3N1ZWRBdCI6IjIwMTUtMTItMTVUMTk6MTU6MTUuMTY2KzAwOjAwIiwidXNlcklkIjoidGVzdElkIiwiZnVsbE5hbWUiOiJKYW5lIFNjaWVudGlzdCIsInR0bCI6NjQ4MDAsImlhdCI6MTQ1MDIwNjkxNX0.XpTJsZf4YPx3S0X9qxF9RUNrPWyJXxe136HDemzyD3qrNzivovSu-u2SO37CfeUHTe8jL8HraWyIibZlHJquwO8qlpVqHImnBzR4RXd1E36J0-vObpWh9XDznq-UAMEGnPb0SV5AbagB-DqZ9DGDCMBhpdGjX096ehtsRols8DScElKu42HOoqPnMdYB2avlHYT8aDEzTI9Y7CJYeYLU9C49DiiTFiZ11_UF85FXDQyD8aIIGbVpDoZpFHITIku4jn3Sj44cz5zd1mHibSQDhzSMOgbaCbKipIUS7iACODe0Xh9nOST005xNwUPWmxLv8WhDfrZqZeaCzrzsB-zKDc6yDmVHEh9unUlwgM0MGYHqBPXCSjIqU4nQVXcx5G8HQPuWtfXCGctYbWdXtJqsXla5Y65QJXGfMvng0DC6YohIiNoLMce98G5TqTOWonitm83Q8v-3mh04SqOhaKYpG-nxyF8fpVPUpe1o-1mZLXXIl7Wq78XOzVT4rTpuvj2Xc-A-HAeUwFReJge7eGKICoYs8elBxDHNgGXY8hvUy9tgZphW3yRAM33LMNtA2HL8awlgzf2OmqNpPE1jLftQvrDrYU82mAmUUzvKOoFzhRmH23K07k2BW06oAnBHGoFJKUhjlcwMzV3pdsU_mSm01FEJvu_TomHuUiEVOVO8u_o [org.dataone.integration.it.ContextAwareAdapter]
20151215-19:15:15: [INFO]: 
***************** running test for testMnCreate(...) vs. node: https://cn-sandbox-ucsb-1.test.dataone.org/cn ***************** [org.dataone.integration.ContextAwareTestCaseDataone]
20151215-19:15:15: [INFO]: refreshing objectFormatCache from cn: null [org.dataone.client.v2.formats.ObjectFormatCache]
20151215-19:15:15: [INFO]: rest call info: GET https://cn-sandbox.test.dataone.org/cn/v2/formats [org.dataone.client.rest.RestClient]
20151215-19:15:15: [INFO]: response httpCode: 200 [org.dataone.service.util.ExceptionHandler]
20151215-19:15:15: [INFO]: successful cache refresh from cn.listFormats() [org.dataone.client.v2.formats.ObjectFormatCache]
20151215-19:15:15: [INFO]: temp outputFile is: /tmp/mmp.output.3936766522475819692.tmp [org.dataone.mimemultipart.SimpleMultipartEntity]
20151215-19:15:15: [INFO]: temp outputFile is: /tmp/mmp.output.1571469176158119473.tmp [org.dataone.mimemultipart.SimpleMultipartEntity]
20151215-19:15:17: [INFO]: rest call info: POST https://mn-sandbox-ucsb-1.test.dataone.org/knb/d1/mn/v2/object; MMP message has: ParamPart:pid = testMnCreate_2015349111515422; FilePart:object = /tmp/mmp.output.3936766522475819692.tmp (684336 bytes); FilePart:sysmeta = /tmp/mmp.output.1571469176158119473.tmp (803 bytes);  [org.dataone.client.rest.RestClient]
20151215-19:15:17: [INFO]: response httpCode: 200 [org.dataone.service.util.ExceptionHandler]
20151215-19:15:17: [INFO]: attempting CN getSystemMEtadata... [org.dataone.integration.it.ContextAwareAdapter]
20151215-19:15:17: [INFO]: rest call info: GET https://cn-sandbox-ucsb-1.test.dataone.org/cn/v2/meta/testMnCreate_2015349111515422 [org.dataone.client.rest.RestClient]
20151215-19:15:17: [INFO]: response httpCode: 404 [org.dataone.service.util.ExceptionHandler]
20151215-19:15:47: [INFO]: attempting CN getSystemMEtadata... [org.dataone.integration.it.ContextAwareAdapter]
20151215-19:15:48: [INFO]: rest call info: GET https://cn-sandbox-ucsb-1.test.dataone.org/cn/v2/meta/testMnCreate_2015349111515422 [org.dataone.client.rest.RestClient]
20151215-19:15:48: [INFO]: response httpCode: 404 [org.dataone.service.util.ExceptionHandler]
20151215-19:16:18: [INFO]: attempting CN getSystemMEtadata... [org.dataone.integration.it.ContextAwareAdapter]
20151215-19:16:18: [INFO]: rest call info: GET https://cn-sandbox-ucsb-1.test.dataone.org/cn/v2/meta/testMnCreate_2015349111515422 [org.dataone.client.rest.RestClient]
20151215-19:16:18: [INFO]: response httpCode: 404 [org.dataone.service.util.ExceptionHandler]
20151215-19:16:48: [INFO]: attempting CN getSystemMEtadata... [org.dataone.integration.it.ContextAwareAdapter]
20151215-19:16:49: [INFO]: rest call info: GET https://cn-sandbox-ucsb-1.test.dataone.org/cn/v2/meta/testMnCreate_2015349111515422 [org.dataone.client.rest.RestClient]
20151215-19:16:49: [INFO]: response httpCode: 404 [org.dataone.service.util.ExceptionHandler]
20151215-19:17:19: [INFO]: attempting CN getSystemMEtadata... [org.dataone.integration.it.ContextAwareAdapter]
20151215-19:17:19: [INFO]: rest call info: GET https://cn-sandbox-ucsb-1.test.dataone.org/cn/v2/meta/testMnCreate_2015349111515422 [org.dataone.client.rest.RestClient]
20151215-19:17:19: [INFO]: response httpCode: 404 [org.dataone.service.util.ExceptionHandler]
20151215-19:17:49: [INFO]: attempting CN getSystemMEtadata... [org.dataone.integration.it.ContextAwareAdapter]
20151215-19:17:50: [INFO]: rest call info: GET https://cn-sandbox-ucsb-1.test.dataone.org/cn/v2/meta/testMnCreate_2015349111515422 [org.dataone.client.rest.RestClient]
20151215-19:17:50: [INFO]: response httpCode: 404 [org.dataone.service.util.ExceptionHandler]
20151215-19:18:20: [INFO]: attempting CN getSystemMEtadata... [org.dataone.integration.it.ContextAwareAdapter]
20151215-19:18:21: [INFO]: rest call info: GET https://cn-sandbox-ucsb-1.test.dataone.org/cn/v2/meta/testMnCreate_2015349111515422 [org.dataone.client.rest.RestClient]
20151215-19:18:21: [INFO]: response httpCode: 200 [org.dataone.service.util.ExceptionHandler]
20151215-19:18:21: [INFO]: rest call info: GET https://mn-sandbox-ucsb-1.test.dataone.org/knb/d1/mn/v2/isAuthorized/testMnCreate_2015349111515422?action=read [org.dataone.client.rest.RestClient]
20151215-19:18:21: [INFO]: response httpCode: 200 [org.dataone.service.util.ExceptionHandler]
20151215-19:18:21: [INFO]: created client for certificate file: cnSandboxORC1 with subject: CN=urn:node:cnSandboxORC1,DC=dataone,DC=org [org.dataone.integration.ContextAwareTestCaseDataone]
20151215-19:18:22: [INFO]: rest call info: GET https://cn-sandbox-orc-1.test.dataone.org/cn/v2/node [org.dataone.client.rest.RestClient]
20151215-19:18:22: [INFO]: response httpCode: 200 [org.dataone.service.util.ExceptionHandler]
20151215-19:18:22: [INFO]: created client for certificate file: cnSandboxORC1 with subject: CN=urn:node:cnSandboxORC1,DC=dataone,DC=org [org.dataone.integration.ContextAwareTestCaseDataone]
20151215-19:18:22: [INFO]: rest call info: GET https://mn-sandbox-ucsb-1.test.dataone.org/knb/d1/mn/v2/monitor/ping [org.dataone.client.rest.RestClient]
20151215-19:18:22: [INFO]: response httpCode: 200 [org.dataone.service.util.ExceptionHandler]
20151215-19:18:22: [INFO]: rest call info: GET https://mn-sandbox-ucsb-1.test.dataone.org/knb/d1/mn/v2/node [org.dataone.client.rest.RestClient]
20151215-19:18:22: [INFO]: response httpCode: 200 [org.dataone.service.util.ExceptionHandler]
20151215-19:18:22: [INFO]: rest call info: GET https://cn-sandbox.test.dataone.org/cn/v1/accounts/testId [org.dataone.client.rest.RestClient]
20151215-19:18:22: [INFO]: response httpCode: 404 [org.dataone.service.util.ExceptionHandler]
20151215-19:18:22: [WARN]: [LDAP: error code 32 - No Such Object] [org.dataone.portal.TokenGenerator]
org.dataone.service.exceptions.NotFound: [LDAP: error code 32 - No Such Object]
	at org.dataone.service.util.ExceptionHandler.deserializeXml(ExceptionHandler.java:629)
	at org.dataone.service.util.ExceptionHandler.deserializeXmlAndThrowException(ExceptionHandler.java:517)
	at org.dataone.service.util.ExceptionHandler.deserializeAndThrowException(ExceptionHandler.java:363)
	at org.dataone.service.util.ExceptionHandler.deserializeAndThrowException(ExceptionHandler.java:313)
	at org.dataone.service.util.ExceptionHandler.filterErrors(ExceptionHandler.java:107)
	at org.dataone.client.rest.HttpMultipartRestClient.doGetRequest(HttpMultipartRestClient.java:333)
	at org.dataone.client.rest.HttpMultipartRestClient.doGetRequest(HttpMultipartRestClient.java:318)
	at org.dataone.client.v1.impl.MultipartCNode.getSubjectInfo(MultipartCNode.java:1498)
	at org.dataone.client.v1.impl.MultipartCNode.getSubjectInfo(MultipartCNode.java:1479)
	at org.dataone.portal.TokenGenerator.getSession(TokenGenerator.java:176)
	at org.dataone.integration.it.testImplementations.AuthTokenTestImplementation.getTokenSesssion(AuthTokenTestImplementation.java:61)
	at org.dataone.integration.it.testImplementations.AuthTokenTestImplementation.testMnCreate(AuthTokenTestImplementation.java:147)
	at org.dataone.integration.it.testImplementations.AuthTokenTestImplementation.testMnCreate(AuthTokenTestImplementation.java:111)
	at org.dataone.integration.it.functional.v2.AuthTokenFunctionalIT.testMnCreate(AuthTokenFunctionalIT.java:31)
	at sun.reflect.NativeMethodAccessorImpl.invoke0(Native Method)
	at sun.reflect.NativeMethodAccessorImpl.invoke(NativeMethodAccessorImpl.java:57)
	at sun.reflect.DelegatingMethodAccessorImpl.invoke(DelegatingMethodAccessorImpl.java:43)
	at java.lang.reflect.Method.invoke(Method.java:606)
	at org.junit.runners.model.FrameworkMethod$1.runReflectiveCall(FrameworkMethod.java:44)
	at org.junit.internal.runners.model.ReflectiveCallable.run(ReflectiveCallable.java:15)
	at org.junit.runners.model.FrameworkMethod.invokeExplosively(FrameworkMethod.java:41)
	at org.junit.internal.runners.statements.InvokeMethod.evaluate(InvokeMethod.java:20)
	at org.junit.rules.Verifier$1.evaluate(Verifier.java:34)
	at org.junit.internal.runners.statements.RunBefores.evaluate(RunBefores.java:28)
	at org.junit.runners.BlockJUnit4ClassRunner.runChild(BlockJUnit4ClassRunner.java:76)
	at org.junit.runners.BlockJUnit4ClassRunner.runChild(BlockJUnit4ClassRunner.java:50)
	at org.junit.runners.ParentRunner$3.run(ParentRunner.java:193)
	at org.junit.runners.ParentRunner$1.schedule(ParentRunner.java:52)
	at org.junit.runners.ParentRunner.runChildren(ParentRunner.java:191)
	at org.junit.runners.ParentRunner.access$000(ParentRunner.java:42)
	at org.junit.runners.ParentRunner$2.evaluate(ParentRunner.java:184)
	at org.junit.runners.ParentRunner.run(ParentRunner.java:236)
	at org.apache.maven.surefire.junit4.JUnit4TestSet.execute(JUnit4TestSet.java:53)
	at org.apache.maven.surefire.junit4.JUnit4Provider.executeTestSet(JUnit4Provider.java:119)
	at org.apache.maven.surefire.junit4.JUnit4Provider.invoke(JUnit4Provider.java:101)
	at sun.reflect.NativeMethodAccessorImpl.invoke0(Native Method)
	at sun.reflect.NativeMethodAccessorImpl.invoke(NativeMethodAccessorImpl.java:57)
	at sun.reflect.DelegatingMethodAccessorImpl.invoke(DelegatingMethodAccessorImpl.java:43)
	at java.lang.reflect.Method.invoke(Method.java:606)
	at org.apache.maven.surefire.booter.ProviderFactory$ClassLoaderProxy.invoke(ProviderFactory.java:103)
	at com.sun.proxy.$Proxy0.invoke(Unknown Source)
	at org.apache.maven.surefire.booter.SurefireStarter.invokeProvider(SurefireStarter.java:150)
	at org.apache.maven.surefire.booter.SurefireStarter.runSuitesInProcess(SurefireStarter.java:91)
	at org.apache.maven.surefire.booter.ForkedBooter.main(ForkedBooter.java:69)
20151215-19:18:23: [INFO]: Created auth token: eyJhbGciOiJSUzI1NiJ9.eyJleHAiOjE0NTAyNzE5MDIsInN1YiI6InRlc3RJZCIsImNvbnN1bWVyS2V5IjpudWxsLCJpc3N1ZWRBdCI6IjIwMTUtMTItMTVUMTk6MTg6MjIuNDQ4KzAwOjAwIiwidXNlcklkIjoidGVzdElkIiwiZnVsbE5hbWUiOiJKYW5lIFNjaWVudGlzdCIsInR0bCI6NjQ4MDAsImlhdCI6MTQ1MDIwNzEwMn0.YWmRAgoHXOzzZr4XXVUCKQnYAzfum_JueQQ8YOAseDcBi_j4cTZBDP7-6YFbRcsTtHmtb3Ne-BHRWXlvLKsxyBmWAK6zD6dWjChN8GuwBweJElL-tz8J2ddFKRlxhccPNwJWs7bRXDt7_0a36n3O9m7jpojNhRn91E06p651QP-SAhAhSeAbdZpKmuZLzZERjKz4gF5unP9Vj4h89eW3uCd8ibtqX6eyXuqDP1dkEsCTBHW3NxYcJEneyYxdMMEemnIEXSvzwSiwN5EauCB6IfPR-FIWk-BHHUs4Md57zlpdTM_dG67_ZLvO7hO4g__ChxKpawvmI2HzmSweExnc3I0GKoWnlvfaa2lnny5zj3cc7pcT4Xmz2dnBQoXTGfpdTwhKyTQGoZWoAnyIoWwV1GdMhKGdR2e3dBrWoz4O5bQ6wrPY-Ror1XIBHqpCJha37qlgz-9bNtWj-mxG_S-agavfiC8adF799_H5cPWz32TSP4FjVyqfKl1uAM9EhCrO3euctVbgUmBDmMbnRRBSaHMW59pxNebfRVLxCh6HoWItLiAkpNoDS53v0fVd9iJ1wnN2j6D8KUZ36NnlYNVv3IyDQ_VvxMVPNpkB15fSYpCFMgA167_D_WHxvZgyvaQIVIAHJ31S40RubBzmfPbdJIJ4Ju6bsT_3OrtUCf0zKVM [org.dataone.integration.it.ContextAwareAdapter]
20151215-19:18:23: [INFO]: 
***************** running test for testMnCreate(...) vs. node: https://cn-sandbox-orc-1.test.dataone.org/cn ***************** [org.dataone.integration.ContextAwareTestCaseDataone]
20151215-19:18:23: [INFO]: temp outputFile is: /tmp/mmp.output.3039173425251831567.tmp [org.dataone.mimemultipart.SimpleMultipartEntity]
20151215-19:18:23: [INFO]: temp outputFile is: /tmp/mmp.output.5364697466823807475.tmp [org.dataone.mimemultipart.SimpleMultipartEntity]
20151215-19:18:24: [INFO]: rest call info: POST https://mn-sandbox-ucsb-1.test.dataone.org/knb/d1/mn/v2/object; MMP message has: ParamPart:pid = testMnCreate_20153491118231; FilePart:object = /tmp/mmp.output.3039173425251831567.tmp (684336 bytes); FilePart:sysmeta = /tmp/mmp.output.5364697466823807475.tmp (801 bytes);  [org.dataone.client.rest.RestClient]
20151215-19:18:24: [INFO]: response httpCode: 200 [org.dataone.service.util.ExceptionHandler]
20151215-19:18:24: [INFO]: attempting CN getSystemMEtadata... [org.dataone.integration.it.ContextAwareAdapter]
20151215-19:18:24: [INFO]: rest call info: GET https://cn-sandbox-orc-1.test.dataone.org/cn/v2/meta/testMnCreate_20153491118231 [org.dataone.client.rest.RestClient]
20151215-19:18:24: [INFO]: response httpCode: 404 [org.dataone.service.util.ExceptionHandler]
20151215-19:18:54: [INFO]: attempting CN getSystemMEtadata... [org.dataone.integration.it.ContextAwareAdapter]
20151215-19:18:55: [INFO]: rest call info: GET https://cn-sandbox-orc-1.test.dataone.org/cn/v2/meta/testMnCreate_20153491118231 [org.dataone.client.rest.RestClient]
20151215-19:18:55: [INFO]: response httpCode: 404 [org.dataone.service.util.ExceptionHandler]
20151215-19:19:25: [INFO]: attempting CN getSystemMEtadata... [org.dataone.integration.it.ContextAwareAdapter]
20151215-19:19:26: [INFO]: rest call info: GET https://cn-sandbox-orc-1.test.dataone.org/cn/v2/meta/testMnCreate_20153491118231 [org.dataone.client.rest.RestClient]
20151215-19:19:26: [INFO]: response httpCode: 404 [org.dataone.service.util.ExceptionHandler]
20151215-19:19:56: [INFO]: attempting CN getSystemMEtadata... [org.dataone.integration.it.ContextAwareAdapter]
20151215-19:19:57: [INFO]: rest call info: GET https://cn-sandbox-orc-1.test.dataone.org/cn/v2/meta/testMnCreate_20153491118231 [org.dataone.client.rest.RestClient]
20151215-19:19:57: [INFO]: response httpCode: 404 [org.dataone.service.util.ExceptionHandler]
20151215-19:20:27: [INFO]: attempting CN getSystemMEtadata... [org.dataone.integration.it.ContextAwareAdapter]
20151215-19:20:28: [INFO]: rest call info: GET https://cn-sandbox-orc-1.test.dataone.org/cn/v2/meta/testMnCreate_20153491118231 [org.dataone.client.rest.RestClient]
20151215-19:20:28: [INFO]: response httpCode: 404 [org.dataone.service.util.ExceptionHandler]
20151215-19:20:58: [INFO]: attempting CN getSystemMEtadata... [org.dataone.integration.it.ContextAwareAdapter]
20151215-19:20:59: [INFO]: rest call info: GET https://cn-sandbox-orc-1.test.dataone.org/cn/v2/meta/testMnCreate_20153491118231 [org.dataone.client.rest.RestClient]
20151215-19:20:59: [INFO]: response httpCode: 404 [org.dataone.service.util.ExceptionHandler]
20151215-19:21:29: [INFO]: attempting CN getSystemMEtadata... [org.dataone.integration.it.ContextAwareAdapter]
20151215-19:21:30: [INFO]: rest call info: GET https://cn-sandbox-orc-1.test.dataone.org/cn/v2/meta/testMnCreate_20153491118231 [org.dataone.client.rest.RestClient]
20151215-19:21:30: [INFO]: response httpCode: 200 [org.dataone.service.util.ExceptionHandler]
20151215-19:21:31: [INFO]: rest call info: GET https://mn-sandbox-ucsb-1.test.dataone.org/knb/d1/mn/v2/isAuthorized/testMnCreate_20153491118231?action=read [org.dataone.client.rest.RestClient]
20151215-19:21:31: [INFO]: response httpCode: 200 [org.dataone.service.util.ExceptionHandler]
20151215-19:21:31: [INFO]: **************************************************** [org.dataone.integration.ContextAwareTestCaseDataone]
20151215-19:21:31: [INFO]: ***  context label:   SANDBOX [org.dataone.integration.ContextAwareTestCaseDataone]
20151215-19:21:31: [INFO]: **************************************************** [org.dataone.integration.ContextAwareTestCaseDataone]
20151215-19:21:31: [INFO]: **************************************************** [org.dataone.integration.ContextAwareTestCaseDataone]
20151215-19:21:31: [INFO]: rest call info: GET https://cn-sandbox.test.dataone.org/cn/v1/accounts/testId [org.dataone.client.rest.RestClient]
20151215-19:21:31: [INFO]: response httpCode: 404 [org.dataone.service.util.ExceptionHandler]
20151215-19:21:31: [WARN]: [LDAP: error code 32 - No Such Object] [org.dataone.portal.TokenGenerator]
org.dataone.service.exceptions.NotFound: [LDAP: error code 32 - No Such Object]
	at org.dataone.service.util.ExceptionHandler.deserializeXml(ExceptionHandler.java:629)
	at org.dataone.service.util.ExceptionHandler.deserializeXmlAndThrowException(ExceptionHandler.java:517)
	at org.dataone.service.util.ExceptionHandler.deserializeAndThrowException(ExceptionHandler.java:363)
	at org.dataone.service.util.ExceptionHandler.deserializeAndThrowException(ExceptionHandler.java:313)
	at org.dataone.service.util.ExceptionHandler.filterErrors(ExceptionHandler.java:107)
	at org.dataone.client.rest.HttpMultipartRestClient.doGetRequest(HttpMultipartRestClient.java:333)
	at org.dataone.client.rest.HttpMultipartRestClient.doGetRequest(HttpMultipartRestClient.java:318)
	at org.dataone.client.v1.impl.MultipartCNode.getSubjectInfo(MultipartCNode.java:1498)
	at org.dataone.client.v1.impl.MultipartCNode.getSubjectInfo(MultipartCNode.java:1479)
	at org.dataone.portal.TokenGenerator.getSession(TokenGenerator.java:176)
	at org.dataone.integration.it.testImplementations.AuthTokenTestImplementation.getTokenSesssion(AuthTokenTestImplementation.java:61)
	at org.dataone.integration.it.testImplementations.AuthTokenTestImplementation.testEchoCredentials(AuthTokenTestImplementation.java:82)
	at org.dataone.integration.it.testImplementations.AuthTokenTestImplementation.testEchoCredentials(AuthTokenTestImplementation.java:75)
	at org.dataone.integration.it.functional.v2.AuthTokenFunctionalIT.testEchoCredentials(AuthTokenFunctionalIT.java:26)
	at sun.reflect.NativeMethodAccessorImpl.invoke0(Native Method)
	at sun.reflect.NativeMethodAccessorImpl.invoke(NativeMethodAccessorImpl.java:57)
	at sun.reflect.DelegatingMethodAccessorImpl.invoke(DelegatingMethodAccessorImpl.java:43)
	at java.lang.reflect.Method.invoke(Method.java:606)
	at org.junit.runners.model.FrameworkMethod$1.runReflectiveCall(FrameworkMethod.java:44)
	at org.junit.internal.runners.model.ReflectiveCallable.run(ReflectiveCallable.java:15)
	at org.junit.runners.model.FrameworkMethod.invokeExplosively(FrameworkMethod.java:41)
	at org.junit.internal.runners.statements.InvokeMethod.evaluate(InvokeMethod.java:20)
	at org.junit.rules.Verifier$1.evaluate(Verifier.java:34)
	at org.junit.internal.runners.statements.RunBefores.evaluate(RunBefores.java:28)
	at org.junit.runners.BlockJUnit4ClassRunner.runChild(BlockJUnit4ClassRunner.java:76)
	at org.junit.runners.BlockJUnit4ClassRunner.runChild(BlockJUnit4ClassRunner.java:50)
	at org.junit.runners.ParentRunner$3.run(ParentRunner.java:193)
	at org.junit.runners.ParentRunner$1.schedule(ParentRunner.java:52)
	at org.junit.runners.ParentRunner.runChildren(ParentRunner.java:191)
	at org.junit.runners.ParentRunner.access$000(ParentRunner.java:42)
	at org.junit.runners.ParentRunner$2.evaluate(ParentRunner.java:184)
	at org.junit.runners.ParentRunner.run(ParentRunner.java:236)
	at org.apache.maven.surefire.junit4.JUnit4TestSet.execute(JUnit4TestSet.java:53)
	at org.apache.maven.surefire.junit4.JUnit4Provider.executeTestSet(JUnit4Provider.java:119)
	at org.apache.maven.surefire.junit4.JUnit4Provider.invoke(JUnit4Provider.java:101)
	at sun.reflect.NativeMethodAccessorImpl.invoke0(Native Method)
	at sun.reflect.NativeMethodAccessorImpl.invoke(NativeMethodAccessorImpl.java:57)
	at sun.reflect.DelegatingMethodAccessorImpl.invoke(DelegatingMethodAccessorImpl.java:43)
	at java.lang.reflect.Method.invoke(Method.java:606)
	at org.apache.maven.surefire.booter.ProviderFactory$ClassLoaderProxy.invoke(ProviderFactory.java:103)
	at com.sun.proxy.$Proxy0.invoke(Unknown Source)
	at org.apache.maven.surefire.booter.SurefireStarter.invokeProvider(SurefireStarter.java:150)
	at org.apache.maven.surefire.booter.SurefireStarter.runSuitesInProcess(SurefireStarter.java:91)
	at org.apache.maven.surefire.booter.ForkedBooter.main(ForkedBooter.java:69)
20151215-19:21:31: [INFO]: created client for certificate file: cnSandboxORC1 with subject: CN=urn:node:cnSandboxORC1,DC=dataone,DC=org [org.dataone.integration.ContextAwareTestCaseDataone]
20151215-19:21:31: [INFO]: 
***************** running test for testEchoCredentials(...) vs. node: https://cn-sandbox-ucsb-1.test.dataone.org/cn ***************** [org.dataone.integration.ContextAwareTestCaseDataone]
20151215-19:21:32: [INFO]: rest call info: GET https://cn-sandbox-ucsb-1.test.dataone.org/cn/v2/diag/subject [org.dataone.client.rest.RestClient]
20151215-19:21:32: [INFO]: response httpCode: 200 [org.dataone.service.util.ExceptionHandler]
20151215-19:21:32: [INFO]: credentials subject :org.dataone.service.types.v1.Subject@cbb7714d [org.dataone.integration.it.ContextAwareAdapter]
20151215-19:21:32: [INFO]: rest call info: GET https://cn-sandbox.test.dataone.org/cn/v1/accounts/testId [org.dataone.client.rest.RestClient]
20151215-19:21:32: [INFO]: response httpCode: 404 [org.dataone.service.util.ExceptionHandler]
20151215-19:21:32: [WARN]: [LDAP: error code 32 - No Such Object] [org.dataone.portal.TokenGenerator]
org.dataone.service.exceptions.NotFound: [LDAP: error code 32 - No Such Object]
	at org.dataone.service.util.ExceptionHandler.deserializeXml(ExceptionHandler.java:629)
	at org.dataone.service.util.ExceptionHandler.deserializeXmlAndThrowException(ExceptionHandler.java:517)
	at org.dataone.service.util.ExceptionHandler.deserializeAndThrowException(ExceptionHandler.java:363)
	at org.dataone.service.util.ExceptionHandler.deserializeAndThrowException(ExceptionHandler.java:313)
	at org.dataone.service.util.ExceptionHandler.filterErrors(ExceptionHandler.java:107)
	at org.dataone.client.rest.HttpMultipartRestClient.doGetRequest(HttpMultipartRestClient.java:333)
	at org.dataone.client.rest.HttpMultipartRestClient.doGetRequest(HttpMultipartRestClient.java:318)
	at org.dataone.client.v1.impl.MultipartCNode.getSubjectInfo(MultipartCNode.java:1498)
	at org.dataone.client.v1.impl.MultipartCNode.getSubjectInfo(MultipartCNode.java:1479)
	at org.dataone.portal.TokenGenerator.getSession(TokenGenerator.java:176)
	at org.dataone.integration.it.testImplementations.AuthTokenTestImplementation.getTokenSesssion(AuthTokenTestImplementation.java:61)
	at org.dataone.integration.it.testImplementations.AuthTokenTestImplementation.testEchoCredentials(AuthTokenTestImplementation.java:82)
	at org.dataone.integration.it.testImplementations.AuthTokenTestImplementation.testEchoCredentials(AuthTokenTestImplementation.java:75)
	at org.dataone.integration.it.functional.v2.AuthTokenFunctionalIT.testEchoCredentials(AuthTokenFunctionalIT.java:26)
	at sun.reflect.NativeMethodAccessorImpl.invoke0(Native Method)
	at sun.reflect.NativeMethodAccessorImpl.invoke(NativeMethodAccessorImpl.java:57)
	at sun.reflect.DelegatingMethodAccessorImpl.invoke(DelegatingMethodAccessorImpl.java:43)
	at java.lang.reflect.Method.invoke(Method.java:606)
	at org.junit.runners.model.FrameworkMethod$1.runReflectiveCall(FrameworkMethod.java:44)
	at org.junit.internal.runners.model.ReflectiveCallable.run(ReflectiveCallable.java:15)
	at org.junit.runners.model.FrameworkMethod.invokeExplosively(FrameworkMethod.java:41)
	at org.junit.internal.runners.statements.InvokeMethod.evaluate(InvokeMethod.java:20)
	at org.junit.rules.Verifier$1.evaluate(Verifier.java:34)
	at org.junit.internal.runners.statements.RunBefores.evaluate(RunBefores.java:28)
	at org.junit.runners.BlockJUnit4ClassRunner.runChild(BlockJUnit4ClassRunner.java:76)
	at org.junit.runners.BlockJUnit4ClassRunner.runChild(BlockJUnit4ClassRunner.java:50)
	at org.junit.runners.ParentRunner$3.run(ParentRunner.java:193)
	at org.junit.runners.ParentRunner$1.schedule(ParentRunner.java:52)
	at org.junit.runners.ParentRunner.runChildren(ParentRunner.java:191)
	at org.junit.runners.ParentRunner.access$000(ParentRunner.java:42)
	at org.junit.runners.ParentRunner$2.evaluate(ParentRunner.java:184)
	at org.junit.runners.ParentRunner.run(ParentRunner.java:236)
	at org.apache.maven.surefire.junit4.JUnit4TestSet.execute(JUnit4TestSet.java:53)
	at org.apache.maven.surefire.junit4.JUnit4Provider.executeTestSet(JUnit4Provider.java:119)
	at org.apache.maven.surefire.junit4.JUnit4Provider.invoke(JUnit4Provider.java:101)
	at sun.reflect.NativeMethodAccessorImpl.invoke0(Native Method)
	at sun.reflect.NativeMethodAccessorImpl.invoke(NativeMethodAccessorImpl.java:57)
	at sun.reflect.DelegatingMethodAccessorImpl.invoke(DelegatingMethodAccessorImpl.java:43)
	at java.lang.reflect.Method.invoke(Method.java:606)
	at org.apache.maven.surefire.booter.ProviderFactory$ClassLoaderProxy.invoke(ProviderFactory.java:103)
	at com.sun.proxy.$Proxy0.invoke(Unknown Source)
	at org.apache.maven.surefire.booter.SurefireStarter.invokeProvider(SurefireStarter.java:150)
	at org.apache.maven.surefire.booter.SurefireStarter.runSuitesInProcess(SurefireStarter.java:91)
	at org.apache.maven.surefire.booter.ForkedBooter.main(ForkedBooter.java:69)
20151215-19:21:32: [INFO]: created client for certificate file: cnSandboxORC1 with subject: CN=urn:node:cnSandboxORC1,DC=dataone,DC=org [org.dataone.integration.ContextAwareTestCaseDataone]
20151215-19:21:32: [INFO]: 
***************** running test for testEchoCredentials(...) vs. node: https://cn-sandbox-orc-1.test.dataone.org/cn ***************** [org.dataone.integration.ContextAwareTestCaseDataone]
20151215-19:21:33: [INFO]: rest call info: GET https://cn-sandbox-orc-1.test.dataone.org/cn/v2/diag/subject [org.dataone.client.rest.RestClient]
20151215-19:21:33: [INFO]: response httpCode: 200 [org.dataone.service.util.ExceptionHandler]
20151215-19:21:33: [INFO]: credentials subject :org.dataone.service.types.v1.Subject@cbb7714d [org.dataone.integration.it.ContextAwareAdapter]
20151215-19:21:33: [INFO]: **************************************************** [org.dataone.integration.ContextAwareTestCaseDataone]
20151215-19:21:33: [INFO]: ***  context label:   SANDBOX [org.dataone.integration.ContextAwareTestCaseDataone]
20151215-19:21:33: [INFO]: **************************************************** [org.dataone.integration.ContextAwareTestCaseDataone]
20151215-19:21:33: [INFO]: **************************************************** [org.dataone.integration.ContextAwareTestCaseDataone]
20151215-19:21:33: [INFO]: rest call info: GET https://cn-sandbox.test.dataone.org/cn/v1/accounts/testId [org.dataone.client.rest.RestClient]
20151215-19:21:33: [INFO]: response httpCode: 404 [org.dataone.service.util.ExceptionHandler]
20151215-19:21:33: [WARN]: [LDAP: error code 32 - No Such Object] [org.dataone.portal.TokenGenerator]
org.dataone.service.exceptions.NotFound: [LDAP: error code 32 - No Such Object]
	at org.dataone.service.util.ExceptionHandler.deserializeXml(ExceptionHandler.java:629)
	at org.dataone.service.util.ExceptionHandler.deserializeXmlAndThrowException(ExceptionHandler.java:517)
	at org.dataone.service.util.ExceptionHandler.deserializeAndThrowException(ExceptionHandler.java:363)
	at org.dataone.service.util.ExceptionHandler.deserializeAndThrowException(ExceptionHandler.java:313)
	at org.dataone.service.util.ExceptionHandler.filterErrors(ExceptionHandler.java:107)
	at org.dataone.client.rest.HttpMultipartRestClient.doGetRequest(HttpMultipartRestClient.java:333)
	at org.dataone.client.rest.HttpMultipartRestClient.doGetRequest(HttpMultipartRestClient.java:318)
	at org.dataone.client.v1.impl.MultipartCNode.getSubjectInfo(MultipartCNode.java:1498)
	at org.dataone.client.v1.impl.MultipartCNode.getSubjectInfo(MultipartCNode.java:1479)
	at org.dataone.portal.TokenGenerator.getSession(TokenGenerator.java:176)
	at org.dataone.integration.it.testImplementations.AuthTokenTestImplementation.getTokenSesssion(AuthTokenTestImplementation.java:61)
	at org.dataone.integration.it.testImplementations.AuthTokenTestImplementation.testCnIsAuthorized(AuthTokenTestImplementation.java:232)
	at org.dataone.integration.it.testImplementations.AuthTokenTestImplementation.testCnIsAuthorized(AuthTokenTestImplementation.java:225)
	at org.dataone.integration.it.functional.v2.AuthTokenFunctionalIT.testCnIsAuthorized(AuthTokenFunctionalIT.java:36)
	at sun.reflect.NativeMethodAccessorImpl.invoke0(Native Method)
	at sun.reflect.NativeMethodAccessorImpl.invoke(NativeMethodAccessorImpl.java:57)
	at sun.reflect.DelegatingMethodAccessorImpl.invoke(DelegatingMethodAccessorImpl.java:43)
	at java.lang.reflect.Method.invoke(Method.java:606)
	at org.junit.runners.model.FrameworkMethod$1.runReflectiveCall(FrameworkMethod.java:44)
	at org.junit.internal.runners.model.ReflectiveCallable.run(ReflectiveCallable.java:15)
	at org.junit.runners.model.FrameworkMethod.invokeExplosively(FrameworkMethod.java:41)
	at org.junit.internal.runners.statements.InvokeMethod.evaluate(InvokeMethod.java:20)
	at org.junit.rules.Verifier$1.evaluate(Verifier.java:34)
	at org.junit.internal.runners.statements.RunBefores.evaluate(RunBefores.java:28)
	at org.junit.runners.BlockJUnit4ClassRunner.runChild(BlockJUnit4ClassRunner.java:76)
	at org.junit.runners.BlockJUnit4ClassRunner.runChild(BlockJUnit4ClassRunner.java:50)
	at org.junit.runners.ParentRunner$3.run(ParentRunner.java:193)
	at org.junit.runners.ParentRunner$1.schedule(ParentRunner.java:52)
	at org.junit.runners.ParentRunner.runChildren(ParentRunner.java:191)
	at org.junit.runners.ParentRunner.access$000(ParentRunner.java:42)
	at org.junit.runners.ParentRunner$2.evaluate(ParentRunner.java:184)
	at org.junit.runners.ParentRunner.run(ParentRunner.java:236)
	at org.apache.maven.surefire.junit4.JUnit4TestSet.execute(JUnit4TestSet.java:53)
	at org.apache.maven.surefire.junit4.JUnit4Provider.executeTestSet(JUnit4Provider.java:119)
	at org.apache.maven.surefire.junit4.JUnit4Provider.invoke(JUnit4Provider.java:101)
	at sun.reflect.NativeMethodAccessorImpl.invoke0(Native Method)
	at sun.reflect.NativeMethodAccessorImpl.invoke(NativeMethodAccessorImpl.java:57)
	at sun.reflect.DelegatingMethodAccessorImpl.invoke(DelegatingMethodAccessorImpl.java:43)
	at java.lang.reflect.Method.invoke(Method.java:606)
	at org.apache.maven.surefire.booter.ProviderFactory$ClassLoaderProxy.invoke(ProviderFactory.java:103)
	at com.sun.proxy.$Proxy0.invoke(Unknown Source)
	at org.apache.maven.surefire.booter.SurefireStarter.invokeProvider(SurefireStarter.java:150)
	at org.apache.maven.surefire.booter.SurefireStarter.runSuitesInProcess(SurefireStarter.java:91)
	at org.apache.maven.surefire.booter.ForkedBooter.main(ForkedBooter.java:69)
20151215-19:21:33: [INFO]: Created auth token: eyJhbGciOiJSUzI1NiJ9.eyJleHAiOjE0NTAyNzIwOTMsInN1YiI6InRlc3RJZCIsImNvbnN1bWVyS2V5IjpudWxsLCJpc3N1ZWRBdCI6IjIwMTUtMTItMTVUMTk6MjE6MzMuMDI4KzAwOjAwIiwidXNlcklkIjoidGVzdElkIiwiZnVsbE5hbWUiOiJKYW5lIFNjaWVudGlzdCIsInR0bCI6NjQ4MDAsImlhdCI6MTQ1MDIwNzI5M30.XwBpB6_kiueKZyI7U9HtYnkaMyUzBtwDhNRY1jrtBwGe55jWASXjDGn7H7TmYg4vnm8hjy_Ch11gMyOf0Y9WoSzyXuF5AhtQbyHkejY-vMa_Jj1y3KyiieZbFy_-TGPs7bjOZWf8sCjIiUQckB_GU05ClnLc5FXJAq94u6dL_qvlnSDhk7KF_zwIwny4Y6Q2ZdoBYsqykZ5JOflPC6AOTn4CAHDgg12w4KUFsPGTQkN2uMRb9ZMd-4iIF3yllH3UBu1JjNCQskKsBrF0VMzsd1DvT2cKjdg9IeUU2MlgC-bcfyHFEdJfEiJgG0IqHqqwGyYdOG8l-2Jra0-YhSPLowaCdHKjP6W04U23Y1xijrhjfEkUGGMPHWt6FJIuZZ0DdjF-xuuGL9p2r74ZgzoiPNlqKuVXeh8ZfFOJG9zozw2lSJB4u4iCFW5nPGNEcRSJgH0_QtRBQAwsVbaKks0DZIptaM9TDSf6a03sPzZ1zURn4wfdH8i_SfdXc1Zmg2ds_1B26ZQZuUvISRRca6LE6s7hFyLA1EB0Hy3BygU3e5tsNdXteoru_G7laF_Dsox45aVuBMOKbDJkziDY60EUiqJdsOjp5sIyAU7rjazKHK2XjiGWYf_DTce8yjGn7ETiZtXfEaMCXdzl7pgEGWInUTAoCy8vtpkEXnut258Fn_8 [org.dataone.integration.it.ContextAwareAdapter]
20151215-19:21:33: [INFO]: created client for certificate file: cnSandboxORC1 with subject: CN=urn:node:cnSandboxORC1,DC=dataone,DC=org [org.dataone.integration.ContextAwareTestCaseDataone]
20151215-19:21:33: [INFO]: 
***************** running test for testCnIsAuthorized(...) vs. node: https://cn-sandbox-ucsb-1.test.dataone.org/cn ***************** [org.dataone.integration.ContextAwareTestCaseDataone]
20151215-19:21:33: [INFO]: rest call info: GET https://cn-sandbox-ucsb-1.test.dataone.org/cn/v2/meta/testCnIsAuthorized_token_5 [org.dataone.client.rest.RestClient]
20151215-19:21:33: [INFO]: response httpCode: 200 [org.dataone.service.util.ExceptionHandler]
20151215-19:21:33: [INFO]:  ====>>>>> pid of procured test Object: testCnIsAuthorized_token_5 [org.dataone.integration.ContextAwareTestCaseDataone]
20151215-19:21:34: [INFO]: rest call info: GET https://cn-sandbox-ucsb-1.test.dataone.org/cn/v2/isAuthorized/testCnIsAuthorized_token_5?action=read [org.dataone.client.rest.RestClient]
20151215-19:21:34: [INFO]: response httpCode: 200 [org.dataone.service.util.ExceptionHandler]
20151215-19:21:34: [INFO]: rest call info: GET https://cn-sandbox.test.dataone.org/cn/v1/accounts/testId [org.dataone.client.rest.RestClient]
20151215-19:21:34: [INFO]: response httpCode: 404 [org.dataone.service.util.ExceptionHandler]
20151215-19:21:34: [WARN]: [LDAP: error code 32 - No Such Object] [org.dataone.portal.TokenGenerator]
org.dataone.service.exceptions.NotFound: [LDAP: error code 32 - No Such Object]
	at org.dataone.service.util.ExceptionHandler.deserializeXml(ExceptionHandler.java:629)
	at org.dataone.service.util.ExceptionHandler.deserializeXmlAndThrowException(ExceptionHandler.java:517)
	at org.dataone.service.util.ExceptionHandler.deserializeAndThrowException(ExceptionHandler.java:363)
	at org.dataone.service.util.ExceptionHandler.deserializeAndThrowException(ExceptionHandler.java:313)
	at org.dataone.service.util.ExceptionHandler.filterErrors(ExceptionHandler.java:107)
	at org.dataone.client.rest.HttpMultipartRestClient.doGetRequest(HttpMultipartRestClient.java:333)
	at org.dataone.client.rest.HttpMultipartRestClient.doGetRequest(HttpMultipartRestClient.java:318)
	at org.dataone.client.v1.impl.MultipartCNode.getSubjectInfo(MultipartCNode.java:1498)
	at org.dataone.client.v1.impl.MultipartCNode.getSubjectInfo(MultipartCNode.java:1479)
	at org.dataone.portal.TokenGenerator.getSession(TokenGenerator.java:176)
	at org.dataone.integration.it.testImplementations.AuthTokenTestImplementation.getTokenSesssion(AuthTokenTestImplementation.java:61)
	at org.dataone.integration.it.testImplementations.AuthTokenTestImplementation.testCnIsAuthorized(AuthTokenTestImplementation.java:232)
	at org.dataone.integration.it.testImplementations.AuthTokenTestImplementation.testCnIsAuthorized(AuthTokenTestImplementation.java:225)
	at org.dataone.integration.it.functional.v2.AuthTokenFunctionalIT.testCnIsAuthorized(AuthTokenFunctionalIT.java:36)
	at sun.reflect.NativeMethodAccessorImpl.invoke0(Native Method)
	at sun.reflect.NativeMethodAccessorImpl.invoke(NativeMethodAccessorImpl.java:57)
	at sun.reflect.DelegatingMethodAccessorImpl.invoke(DelegatingMethodAccessorImpl.java:43)
	at java.lang.reflect.Method.invoke(Method.java:606)
	at org.junit.runners.model.FrameworkMethod$1.runReflectiveCall(FrameworkMethod.java:44)
	at org.junit.internal.runners.model.ReflectiveCallable.run(ReflectiveCallable.java:15)
	at org.junit.runners.model.FrameworkMethod.invokeExplosively(FrameworkMethod.java:41)
	at org.junit.internal.runners.statements.InvokeMethod.evaluate(InvokeMethod.java:20)
	at org.junit.rules.Verifier$1.evaluate(Verifier.java:34)
	at org.junit.internal.runners.statements.RunBefores.evaluate(RunBefores.java:28)
	at org.junit.runners.BlockJUnit4ClassRunner.runChild(BlockJUnit4ClassRunner.java:76)
	at org.junit.runners.BlockJUnit4ClassRunner.runChild(BlockJUnit4ClassRunner.java:50)
	at org.junit.runners.ParentRunner$3.run(ParentRunner.java:193)
	at org.junit.runners.ParentRunner$1.schedule(ParentRunner.java:52)
	at org.junit.runners.ParentRunner.runChildren(ParentRunner.java:191)
	at org.junit.runners.ParentRunner.access$000(ParentRunner.java:42)
	at org.junit.runners.ParentRunner$2.evaluate(ParentRunner.java:184)
	at org.junit.runners.ParentRunner.run(ParentRunner.java:236)
	at org.apache.maven.surefire.junit4.JUnit4TestSet.execute(JUnit4TestSet.java:53)
	at org.apache.maven.surefire.junit4.JUnit4Provider.executeTestSet(JUnit4Provider.java:119)
	at org.apache.maven.surefire.junit4.JUnit4Provider.invoke(JUnit4Provider.java:101)
	at sun.reflect.NativeMethodAccessorImpl.invoke0(Native Method)
	at sun.reflect.NativeMethodAccessorImpl.invoke(NativeMethodAccessorImpl.java:57)
	at sun.reflect.DelegatingMethodAccessorImpl.invoke(DelegatingMethodAccessorImpl.java:43)
	at java.lang.reflect.Method.invoke(Method.java:606)
	at org.apache.maven.surefire.booter.ProviderFactory$ClassLoaderProxy.invoke(ProviderFactory.java:103)
	at com.sun.proxy.$Proxy0.invoke(Unknown Source)
	at org.apache.maven.surefire.booter.SurefireStarter.invokeProvider(SurefireStarter.java:150)
	at org.apache.maven.surefire.booter.SurefireStarter.runSuitesInProcess(SurefireStarter.java:91)
	at org.apache.maven.surefire.booter.ForkedBooter.main(ForkedBooter.java:69)
20151215-19:21:34: [INFO]: Created auth token: eyJhbGciOiJSUzI1NiJ9.eyJleHAiOjE0NTAyNzIwOTQsInN1YiI6InRlc3RJZCIsImNvbnN1bWVyS2V5IjpudWxsLCJpc3N1ZWRBdCI6IjIwMTUtMTItMTVUMTk6MjE6MzQuMzYyKzAwOjAwIiwidXNlcklkIjoidGVzdElkIiwiZnVsbE5hbWUiOiJKYW5lIFNjaWVudGlzdCIsInR0bCI6NjQ4MDAsImlhdCI6MTQ1MDIwNzI5NH0.DITpsNJpFOowWDK0Q9iGD1uHDNuxAsfn8oCaKs3mdBIAsYzkOvuI5YWORXtOGjvTEGIvD40rqqhd6i3646TM7cvNRH50HMjlsKiWT8UNB0PL243lpctbkW7nRiuKVZH2rJCdjwMyNMLK-of4sTZ1Enzx-tKL8P2KpPAD5GmoV1S5PHnWeG78XZmRbnm5rhW6cekZtshvkDAhtvvHMbaYgC5qJsY0ZcFrupor_iQ2p9dqr1OFB4w5t-nhENcQrksS_Aq8prfJFIwy24yuvc65dt7O3nqOU1frMV-StRpqzWbHuGBHJpIX7338NFinkvnilbieXb5OBmjlxaukUifm7RQFWyYy6JvlW3C77KWh8aReC4FA4NAazAGtJ4SypWXF5yCs-JPLQVH4iiTBJMuXxCaf7mdE9u7u9wp7qF47972oAyhAKtc5EkWIr80sVY3NSa-gCfRSWkACVOlTMA88T6iofbtyzDamExJFBUH_DnVTRgqq8qGlkhnuMlSv2PQ4snpc_CjgqAGEqzrr3MLKyrg21SX14Od1AA-GDErAaRL7fiDgSb_edjislraXj_PC7ceKzOBhsiWpQyixO0seXM6bxISFaXC2m9uc2VaSaxZPTvYbSaVipug2TVsKeR4eucyitcMgbLoirT9nV7iZAIndNAUdyBrfb5qwZk-ggIM [org.dataone.integration.it.ContextAwareAdapter]
20151215-19:21:34: [INFO]: created client for certificate file: cnSandboxORC1 with subject: CN=urn:node:cnSandboxORC1,DC=dataone,DC=org [org.dataone.integration.ContextAwareTestCaseDataone]
20151215-19:21:34: [INFO]: 
***************** running test for testCnIsAuthorized(...) vs. node: https://cn-sandbox-orc-1.test.dataone.org/cn ***************** [org.dataone.integration.ContextAwareTestCaseDataone]
20151215-19:21:35: [INFO]: rest call info: GET https://cn-sandbox-orc-1.test.dataone.org/cn/v2/meta/testCnIsAuthorized_token_5 [org.dataone.client.rest.RestClient]
20151215-19:21:35: [INFO]: response httpCode: 200 [org.dataone.service.util.ExceptionHandler]
20151215-19:21:35: [INFO]:  ====>>>>> pid of procured test Object: testCnIsAuthorized_token_5 [org.dataone.integration.ContextAwareTestCaseDataone]
20151215-19:21:37: [INFO]: rest call info: GET https://cn-sandbox-orc-1.test.dataone.org/cn/v2/isAuthorized/testCnIsAuthorized_token_5?action=read [org.dataone.client.rest.RestClient]
20151215-19:21:37: [INFO]: response httpCode: 200 [org.dataone.service.util.ExceptionHandler]
20151215-19:21:37: [INFO]: **************************************************** [org.dataone.integration.ContextAwareTestCaseDataone]
20151215-19:21:37: [INFO]: ***  context label:   SANDBOX [org.dataone.integration.ContextAwareTestCaseDataone]
20151215-19:21:37: [INFO]: **************************************************** [org.dataone.integration.ContextAwareTestCaseDataone]
20151215-19:21:37: [INFO]: **************************************************** [org.dataone.integration.ContextAwareTestCaseDataone]
20151215-19:21:37: [INFO]: created client for certificate file: cnSandboxORC1 with subject: CN=urn:node:cnSandboxORC1,DC=dataone,DC=org [org.dataone.integration.ContextAwareTestCaseDataone]
20151215-19:21:37: [INFO]: rest call info: GET https://mn-sandbox-ucsb-1.test.dataone.org/knb/d1/mn/v2/monitor/ping [org.dataone.client.rest.RestClient]
20151215-19:21:37: [INFO]: response httpCode: 200 [org.dataone.service.util.ExceptionHandler]
20151215-19:21:37: [INFO]: MN included in test: https://mn-sandbox-ucsb-1.test.dataone.org/knb/d1/mn [org.dataone.integration.ContextAwareTestCaseDataone]
20151215-19:21:37: [INFO]: created client for certificate file: cnSandboxORC1 with subject: CN=urn:node:cnSandboxORC1,DC=dataone,DC=org [org.dataone.integration.ContextAwareTestCaseDataone]
20151215-19:21:37: [INFO]: rest call info: GET https://mn-sandbox-ucsb-2.test.dataone.org/knb/d1/mn/v2/monitor/ping [org.dataone.client.rest.RestClient]
20151215-19:21:37: [INFO]: response httpCode: 200 [org.dataone.service.util.ExceptionHandler]
20151215-19:21:37: [INFO]: MN included in test: https://mn-sandbox-ucsb-2.test.dataone.org/knb/d1/mn [org.dataone.integration.ContextAwareTestCaseDataone]
20151215-19:21:37: [INFO]: created client for certificate file: cnSandboxORC1 with subject: CN=urn:node:cnSandboxORC1,DC=dataone,DC=org [org.dataone.integration.ContextAwareTestCaseDataone]
20151215-19:21:38: [INFO]: rest call info: GET https://mn-sandbox-orc-1.test.dataone.org/mn/v2/monitor/ping [org.dataone.client.rest.RestClient]
20151215-19:21:38: [INFO]: response httpCode: 404 [org.dataone.service.util.ExceptionHandler]
20151215-19:21:38: [INFO]: MN excluded from test: https://mn-sandbox-orc-1.test.dataone.org/mn [org.dataone.integration.ContextAwareTestCaseDataone]
20151215-19:21:38: [INFO]: created client for certificate file: cnSandboxORC1 with subject: CN=urn:node:cnSandboxORC1,DC=dataone,DC=org [org.dataone.integration.ContextAwareTestCaseDataone]
20151215-19:21:39: [INFO]: rest call info: GET http://dfc-mn.renci.org:8080/irods-dataone/rest/mn/v2/monitor/ping [org.dataone.client.rest.RestClient]
20151215-19:21:39: [INFO]: response httpCode: 404 [org.dataone.service.util.ExceptionHandler]
20151215-19:21:39: [INFO]: MN excluded from test: http://dfc-mn.renci.org:8080/irods-dataone/rest/mn [org.dataone.integration.ContextAwareTestCaseDataone]
20151215-19:21:39: [INFO]: created client for certificate file: cnSandboxORC1 with subject: CN=urn:node:cnSandboxORC1,DC=dataone,DC=org [org.dataone.integration.ContextAwareTestCaseDataone]
20151215-19:21:39: [INFO]: rest call info: GET https://trusty.iarc.uaf.edu/mn/v2/monitor/ping [org.dataone.client.rest.RestClient]
20151215-19:21:39: [INFO]: MN excluded from test: https://trusty.iarc.uaf.edu/mn [org.dataone.integration.ContextAwareTestCaseDataone]
20151215-19:21:39: [INFO]: created client for certificate file: cnSandboxORC1 with subject: CN=urn:node:cnSandboxORC1,DC=dataone,DC=org [org.dataone.integration.ContextAwareTestCaseDataone]
20151215-19:21:40: [INFO]: rest call info: GET http://usgs.ornl.gov/USGS_MN/mn/v2/monitor/ping [org.dataone.client.rest.RestClient]
20151215-19:21:40: [INFO]: response httpCode: 404 [org.dataone.service.util.ExceptionHandler]
20151215-19:21:40: [INFO]: MN excluded from test: http://usgs.ornl.gov/USGS_MN/mn [org.dataone.integration.ContextAwareTestCaseDataone]
20151215-19:21:40: [INFO]: created client for certificate file: cnSandboxORC1 with subject: CN=urn:node:cnSandboxORC1,DC=dataone,DC=org [org.dataone.integration.ContextAwareTestCaseDataone]
20151215-19:21:40: [INFO]: rest call info: GET http://alpha.tdar.org/dataone/v2/monitor/ping [org.dataone.client.rest.RestClient]
20151215-19:21:40: [INFO]: response httpCode: 404 [org.dataone.service.util.ExceptionHandler]
20151215-19:21:40: [INFO]: MN excluded from test: http://alpha.tdar.org/dataone [org.dataone.integration.ContextAwareTestCaseDataone]
20151215-19:21:41: [INFO]: rest call info: GET https://cn-sandbox.test.dataone.org/cn/v1/accounts/testId [org.dataone.client.rest.RestClient]
20151215-19:21:41: [INFO]: response httpCode: 404 [org.dataone.service.util.ExceptionHandler]
20151215-19:21:41: [WARN]: [LDAP: error code 32 - No Such Object] [org.dataone.portal.TokenGenerator]
org.dataone.service.exceptions.NotFound: [LDAP: error code 32 - No Such Object]
	at org.dataone.service.util.ExceptionHandler.deserializeXml(ExceptionHandler.java:629)
	at org.dataone.service.util.ExceptionHandler.deserializeXmlAndThrowException(ExceptionHandler.java:517)
	at org.dataone.service.util.ExceptionHandler.deserializeAndThrowException(ExceptionHandler.java:363)
	at org.dataone.service.util.ExceptionHandler.deserializeAndThrowException(ExceptionHandler.java:313)
	at org.dataone.service.util.ExceptionHandler.filterErrors(ExceptionHandler.java:107)
	at org.dataone.client.rest.HttpMultipartRestClient.doGetRequest(HttpMultipartRestClient.java:333)
	at org.dataone.client.rest.HttpMultipartRestClient.doGetRequest(HttpMultipartRestClient.java:318)
	at org.dataone.client.v1.impl.MultipartCNode.getSubjectInfo(MultipartCNode.java:1498)
	at org.dataone.client.v1.impl.MultipartCNode.getSubjectInfo(MultipartCNode.java:1479)
	at org.dataone.portal.TokenGenerator.getSession(TokenGenerator.java:176)
	at org.dataone.integration.it.testImplementations.AuthTokenTestImplementation.getTokenSesssion(AuthTokenTestImplementation.java:61)
	at org.dataone.integration.it.testImplementations.AuthTokenTestImplementation.testMnIsAuthorized(AuthTokenTestImplementation.java:287)
	at org.dataone.integration.it.testImplementations.AuthTokenTestImplementation.testMnIsAuthorized(AuthTokenTestImplementation.java:280)
	at org.dataone.integration.it.functional.v2.AuthTokenFunctionalIT.testMnIsAuthorized(AuthTokenFunctionalIT.java:41)
	at sun.reflect.NativeMethodAccessorImpl.invoke0(Native Method)
	at sun.reflect.NativeMethodAccessorImpl.invoke(NativeMethodAccessorImpl.java:57)
	at sun.reflect.DelegatingMethodAccessorImpl.invoke(DelegatingMethodAccessorImpl.java:43)
	at java.lang.reflect.Method.invoke(Method.java:606)
	at org.junit.runners.model.FrameworkMethod$1.runReflectiveCall(FrameworkMethod.java:44)
	at org.junit.internal.runners.model.ReflectiveCallable.run(ReflectiveCallable.java:15)
	at org.junit.runners.model.FrameworkMethod.invokeExplosively(FrameworkMethod.java:41)
	at org.junit.internal.runners.statements.InvokeMethod.evaluate(InvokeMethod.java:20)
	at org.junit.rules.Verifier$1.evaluate(Verifier.java:34)
	at org.junit.internal.runners.statements.RunBefores.evaluate(RunBefores.java:28)
	at org.junit.runners.BlockJUnit4ClassRunner.runChild(BlockJUnit4ClassRunner.java:76)
	at org.junit.runners.BlockJUnit4ClassRunner.runChild(BlockJUnit4ClassRunner.java:50)
	at org.junit.runners.ParentRunner$3.run(ParentRunner.java:193)
	at org.junit.runners.ParentRunner$1.schedule(ParentRunner.java:52)
	at org.junit.runners.ParentRunner.runChildren(ParentRunner.java:191)
	at org.junit.runners.ParentRunner.access$000(ParentRunner.java:42)
	at org.junit.runners.ParentRunner$2.evaluate(ParentRunner.java:184)
	at org.junit.runners.ParentRunner.run(ParentRunner.java:236)
	at org.apache.maven.surefire.junit4.JUnit4TestSet.execute(JUnit4TestSet.java:53)
	at org.apache.maven.surefire.junit4.JUnit4Provider.executeTestSet(JUnit4Provider.java:119)
	at org.apache.maven.surefire.junit4.JUnit4Provider.invoke(JUnit4Provider.java:101)
	at sun.reflect.NativeMethodAccessorImpl.invoke0(Native Method)
	at sun.reflect.NativeMethodAccessorImpl.invoke(NativeMethodAccessorImpl.java:57)
	at sun.reflect.DelegatingMethodAccessorImpl.invoke(DelegatingMethodAccessorImpl.java:43)
	at java.lang.reflect.Method.invoke(Method.java:606)
	at org.apache.maven.surefire.booter.ProviderFactory$ClassLoaderProxy.invoke(ProviderFactory.java:103)
	at com.sun.proxy.$Proxy0.invoke(Unknown Source)
	at org.apache.maven.surefire.booter.SurefireStarter.invokeProvider(SurefireStarter.java:150)
	at org.apache.maven.surefire.booter.SurefireStarter.runSuitesInProcess(SurefireStarter.java:91)
	at org.apache.maven.surefire.booter.ForkedBooter.main(ForkedBooter.java:69)
20151215-19:21:41: [INFO]: created client for certificate file: cnSandboxORC1 with subject: CN=urn:node:cnSandboxORC1,DC=dataone,DC=org [org.dataone.integration.ContextAwareTestCaseDataone]
20151215-19:21:41: [INFO]: 
***************** running test for testMnIsAuthorized(...) vs. node: https://mn-sandbox-ucsb-1.test.dataone.org/knb/d1/mn ***************** [org.dataone.integration.ContextAwareTestCaseDataone]
20151215-19:21:41: [INFO]: rest call info: GET https://mn-sandbox-ucsb-1.test.dataone.org/knb/d1/mn/v2/meta/testMnIsAuthorized_token_5 [org.dataone.client.rest.RestClient]
20151215-19:21:41: [INFO]: response httpCode: 200 [org.dataone.service.util.ExceptionHandler]
20151215-19:21:41: [INFO]:  ====>>>>> pid of procured test Object: testMnIsAuthorized_token_5 [org.dataone.integration.ContextAwareTestCaseDataone]
20151215-19:21:42: [INFO]: rest call info: GET https://mn-sandbox-ucsb-1.test.dataone.org/knb/d1/mn/v2/isAuthorized/testMnIsAuthorized_token_5?action=read [org.dataone.client.rest.RestClient]
20151215-19:21:42: [INFO]: response httpCode: 200 [org.dataone.service.util.ExceptionHandler]
20151215-19:21:42: [INFO]: rest call info: GET https://cn-sandbox.test.dataone.org/cn/v1/accounts/testId [org.dataone.client.rest.RestClient]
20151215-19:21:42: [INFO]: response httpCode: 404 [org.dataone.service.util.ExceptionHandler]
20151215-19:21:42: [WARN]: [LDAP: error code 32 - No Such Object] [org.dataone.portal.TokenGenerator]
org.dataone.service.exceptions.NotFound: [LDAP: error code 32 - No Such Object]
	at org.dataone.service.util.ExceptionHandler.deserializeXml(ExceptionHandler.java:629)
	at org.dataone.service.util.ExceptionHandler.deserializeXmlAndThrowException(ExceptionHandler.java:517)
	at org.dataone.service.util.ExceptionHandler.deserializeAndThrowException(ExceptionHandler.java:363)
	at org.dataone.service.util.ExceptionHandler.deserializeAndThrowException(ExceptionHandler.java:313)
	at org.dataone.service.util.ExceptionHandler.filterErrors(ExceptionHandler.java:107)
	at org.dataone.client.rest.HttpMultipartRestClient.doGetRequest(HttpMultipartRestClient.java:333)
	at org.dataone.client.rest.HttpMultipartRestClient.doGetRequest(HttpMultipartRestClient.java:318)
	at org.dataone.client.v1.impl.MultipartCNode.getSubjectInfo(MultipartCNode.java:1498)
	at org.dataone.client.v1.impl.MultipartCNode.getSubjectInfo(MultipartCNode.java:1479)
	at org.dataone.portal.TokenGenerator.getSession(TokenGenerator.java:176)
	at org.dataone.integration.it.testImplementations.AuthTokenTestImplementation.getTokenSesssion(AuthTokenTestImplementation.java:61)
	at org.dataone.integration.it.testImplementations.AuthTokenTestImplementation.testMnIsAuthorized(AuthTokenTestImplementation.java:287)
	at org.dataone.integration.it.testImplementations.AuthTokenTestImplementation.testMnIsAuthorized(AuthTokenTestImplementation.java:280)
	at org.dataone.integration.it.functional.v2.AuthTokenFunctionalIT.testMnIsAuthorized(AuthTokenFunctionalIT.java:41)
	at sun.reflect.NativeMethodAccessorImpl.invoke0(Native Method)
	at sun.reflect.NativeMethodAccessorImpl.invoke(NativeMethodAccessorImpl.java:57)
	at sun.reflect.DelegatingMethodAccessorImpl.invoke(DelegatingMethodAccessorImpl.java:43)
	at java.lang.reflect.Method.invoke(Method.java:606)
	at org.junit.runners.model.FrameworkMethod$1.runReflectiveCall(FrameworkMethod.java:44)
	at org.junit.internal.runners.model.ReflectiveCallable.run(ReflectiveCallable.java:15)
	at org.junit.runners.model.FrameworkMethod.invokeExplosively(FrameworkMethod.java:41)
	at org.junit.internal.runners.statements.InvokeMethod.evaluate(InvokeMethod.java:20)
	at org.junit.rules.Verifier$1.evaluate(Verifier.java:34)
	at org.junit.internal.runners.statements.RunBefores.evaluate(RunBefores.java:28)
	at org.junit.runners.BlockJUnit4ClassRunner.runChild(BlockJUnit4ClassRunner.java:76)
	at org.junit.runners.BlockJUnit4ClassRunner.runChild(BlockJUnit4ClassRunner.java:50)
	at org.junit.runners.ParentRunner$3.run(ParentRunner.java:193)
	at org.junit.runners.ParentRunner$1.schedule(ParentRunner.java:52)
	at org.junit.runners.ParentRunner.runChildren(ParentRunner.java:191)
	at org.junit.runners.ParentRunner.access$000(ParentRunner.java:42)
	at org.junit.runners.ParentRunner$2.evaluate(ParentRunner.java:184)
	at org.junit.runners.ParentRunner.run(ParentRunner.java:236)
	at org.apache.maven.surefire.junit4.JUnit4TestSet.execute(JUnit4TestSet.java:53)
	at org.apache.maven.surefire.junit4.JUnit4Provider.executeTestSet(JUnit4Provider.java:119)
	at org.apache.maven.surefire.junit4.JUnit4Provider.invoke(JUnit4Provider.java:101)
	at sun.reflect.NativeMethodAccessorImpl.invoke0(Native Method)
	at sun.reflect.NativeMethodAccessorImpl.invoke(NativeMethodAccessorImpl.java:57)
	at sun.reflect.DelegatingMethodAccessorImpl.invoke(DelegatingMethodAccessorImpl.java:43)
	at java.lang.reflect.Method.invoke(Method.java:606)
	at org.apache.maven.surefire.booter.ProviderFactory$ClassLoaderProxy.invoke(ProviderFactory.java:103)
	at com.sun.proxy.$Proxy0.invoke(Unknown Source)
	at org.apache.maven.surefire.booter.SurefireStarter.invokeProvider(SurefireStarter.java:150)
	at org.apache.maven.surefire.booter.SurefireStarter.runSuitesInProcess(SurefireStarter.java:91)
	at org.apache.maven.surefire.booter.ForkedBooter.main(ForkedBooter.java:69)
20151215-19:21:42: [INFO]: created client for certificate file: cnSandboxORC1 with subject: CN=urn:node:cnSandboxORC1,DC=dataone,DC=org [org.dataone.integration.ContextAwareTestCaseDataone]
20151215-19:21:42: [INFO]: 
***************** running test for testMnIsAuthorized(...) vs. node: https://mn-sandbox-ucsb-2.test.dataone.org/knb/d1/mn ***************** [org.dataone.integration.ContextAwareTestCaseDataone]
20151215-19:21:42: [INFO]: rest call info: GET https://mn-sandbox-ucsb-2.test.dataone.org/knb/d1/mn/v2/meta/testMnIsAuthorized_token_5 [org.dataone.client.rest.RestClient]
20151215-19:21:42: [INFO]: response httpCode: 200 [org.dataone.service.util.ExceptionHandler]
20151215-19:21:42: [INFO]:  ====>>>>> pid of procured test Object: testMnIsAuthorized_token_5 [org.dataone.integration.ContextAwareTestCaseDataone]
20151215-19:21:43: [INFO]: rest call info: GET https://mn-sandbox-ucsb-2.test.dataone.org/knb/d1/mn/v2/isAuthorized/testMnIsAuthorized_token_5?action=read [org.dataone.client.rest.RestClient]
20151215-19:21:43: [INFO]: response httpCode: 200 [org.dataone.service.util.ExceptionHandler]
Tests run: 5, Failures: 1, Errors: 0, Skipped: 0, Time elapsed: 401.441 sec <<< FAILURE!

Results :

Failed tests: 
  testCnQuery(org.dataone.integration.it.functional.v2.AuthTokenFunctionalIT): CN.query resutls should have a non-zero count for pid testCnQuery_token_5 against CN GET https://cn-sandbox-ucsb-1.test.dataone.org/cn/v2/meta/testCnQuery_token_5

Tests run: 5, Failures: 1, Errors: 0, Skipped: 0

[WARNING] File encoding has not been set, using platform encoding UTF-8, i.e. build is platform dependent!
[JENKINS] Recording test results
[INFO] 
[INFO] --- maven-failsafe-plugin:2.8.1:verify (verify) @ d1_integration ---
[INFO] Failsafe report directory: /var/lib/jenkins/jobs/d1_integration_Sandbox_authToken/workspace/d1_integration/target/failsafe-reports
[WARNING] File encoding has not been set, using platform encoding UTF-8, i.e. build is platform dependent!
[ERROR] There are test failures.

Please refer to /var/lib/jenkins/jobs/d1_integration_Sandbox_authToken/workspace/d1_integration/target/failsafe-reports for the individual test results.
[JENKINS] Recording test results
Notifying upstream projects of job completion
Join notifier requires a CauseAction
[INFO] ------------------------------------------------------------------------
[INFO] BUILD SUCCESS
[INFO] ------------------------------------------------------------------------
[INFO] Total time: 7:11.140s
[INFO] Finished at: Tue Dec 15 19:21:43 UTC 2015
[INFO] Final Memory: 53M/753M
[INFO] ------------------------------------------------------------------------
Waiting for Jenkins to finish collecting data
[JENKINS] Archiving /var/lib/jenkins/jobs/d1_integration_Sandbox_authToken/workspace/d1_integration/pom.xml to org.dataone/d1_integration/2.0-SNAPSHOT/d1_integration-2.0-SNAPSHOT.pom
channel stopped
Notifying upstream projects of job completion
Finished: UNSTABLE