AbortedConsole Output

Started by timer
Building in workspace /var/lib/jenkins/jobs/d1_integration_DEV2_mn_v2/workspace
Cleaning local Directory .
Checking out https://repository.dataone.org/software/cicore/trunk/d1_integration at revision '2015-11-18T06:14:18.944 +0000'
A         GeneratingITCertificates.txt
A         cnTestMethodTemplate.pl
A         src
A         src/test
A         src/test/java
A         src/test/java/org
A         src/test/java/org/dataone
A         src/test/java/org/dataone/client
A         src/test/java/org/dataone/client/ClientArchitectureConformityIT.java
A         src/test/java/org/dataone/client/V1ClientArchitectureConformityIT.java
A         src/test/java/org/dataone/client/CNRestURLTest.java
A         src/test/java/org/dataone/client/PoolingHttpClientConnectionManagerTest.java
A         src/test/java/org/dataone/client/ArchitectureUtils.java
A         src/test/java/org/dataone/client/RetryHandler.java
A         src/test/java/org/dataone/integration
A         src/test/java/org/dataone/integration/tools
A         src/test/java/org/dataone/integration/tools/RegisterNodeTools.java
A         src/test/java/org/dataone/integration/tools/ProductionContentCheckingTools.java
A         src/test/java/org/dataone/integration/tools/ProductionResourceMapParsingChecks.java
A         src/test/java/org/dataone/integration/CommonResourcesTest.java
A         src/test/java/org/dataone/integration/contextTests
A         src/test/java/org/dataone/integration/contextTests/TestDefaultSettings.java
A         src/test/java/org/dataone/integration/ContextAwareTestCaseDataoneTest.java
A         src/test/java/org/dataone/integration/it
A         src/test/java/org/dataone/integration/it/functional
A         src/test/java/org/dataone/integration/it/functional/PreRegNodeContentCheck.java
A         src/test/java/org/dataone/integration/it/functional/EnvironmentsCheck.java
A         src/test/java/org/dataone/integration/it/functional/SyncInventoryIT.java
A         src/test/java/org/dataone/integration/it/functional/WebTestConcurrency.java
A         src/test/java/org/dataone/integration/it/functional/D1ObjectIT.java
A         src/test/java/org/dataone/integration/it/functional/PackageIT.java
A         src/test/java/org/dataone/integration/it/functional/ClientAuthIT.java
A         src/test/java/org/dataone/integration/it/functional/SynchronizationIT.java
A         src/test/java/org/dataone/integration/it/functional/MNodeMiscFunctionalIT.java
A         src/test/java/org/dataone/integration/it/functional/DataReplicationIT.java
A         src/test/java/org/dataone/integration/it/functional/D1ClientIT.java
A         src/test/java/org/dataone/integration/it/functional/ClientCertificateInstallationIT.java
A         src/test/java/org/dataone/integration/it/functional/ResourceMapXParsing.java
A         src/test/java/org/dataone/integration/it/functional/MNReplicationIT.java
A         src/test/java/org/dataone/integration/it/functional/XNodeWebServerBasicIT.java
A         src/test/java/org/dataone/integration/it/functional/SysmetaChangeFuncIT.java
A         src/test/java/org/dataone/integration/it/functional/ChecksumAnalysis.java
AU        src/test/java/org/dataone/integration/it/functional/MNodeObjectLifecycleIT.java
A         src/test/java/org/dataone/integration/it/functional/v2
A         src/test/java/org/dataone/integration/it/functional/v2/CNDiagnosticFunctionalIT.java
A         src/test/java/org/dataone/integration/it/functional/v2/CNRegisterFunctionalIT.java
A         src/test/java/org/dataone/integration/it/functional/v2/MNViewFunctionalIT.java
A         src/test/java/org/dataone/integration/it/functional/v2/MNPackageFunctionalIT.java
A         src/test/java/org/dataone/integration/it/functional/v2/LogAggregationFunctionalIT.java
A         src/test/java/org/dataone/integration/it/functional/v2/CNViewFunctionalIT.java
A         src/test/java/org/dataone/integration/it/functional/v2/V1V2InteropFunctionalIT.java
A         src/test/java/org/dataone/integration/it/functional/MNCreateFuncIT.java
A         src/test/java/org/dataone/integration/it/functional/CNCNReplicationIT.java
A         src/test/java/org/dataone/integration/it/functional/MNv2FunctionalTestSuite.java
A         src/test/java/org/dataone/integration/it/CNodeTier1_metacat_IT.java
A         src/test/java/org/dataone/integration/it/CNodeTier1_nodeRegistry_IT.java
A         src/test/java/org/dataone/integration/it/testImplementations
A         src/test/java/org/dataone/integration/it/testImplementations/V1V2InteropFunctionalTestImplementations.java
A         src/test/java/org/dataone/integration/it/testImplementations/CNAuthTestImplementations.java
A         src/test/java/org/dataone/integration/it/testImplementations/MNUpdateSystemMetadataTestImplementations.java
A         src/test/java/org/dataone/integration/it/testImplementations/MNSystemMetadataMutabilityImplementations.java
A         src/test/java/org/dataone/integration/it/testImplementations/MNPackageTestImplementations.java
A         src/test/java/org/dataone/integration/it/testImplementations/UpdateSystemMetadataTestImplementations.java
A         src/test/java/org/dataone/integration/it/testImplementations/CoreTestImplementations.java
A         src/test/java/org/dataone/integration/it/testImplementations/CNDiagnosticFunctionalTestImplementations.java
A         src/test/java/org/dataone/integration/it/testImplementations/CNReplicationTestImplementations.java
A         src/test/java/org/dataone/integration/it/testImplementations/V1IsAuthorizedAuthorizationTestImpl.java
A         src/test/java/org/dataone/integration/it/testImplementations/NodeRegistryExtensibilityTestImplementations.java
A         src/test/java/org/dataone/integration/it/testImplementations/MNSystemMetadataChangedMethodTestImplementations.java
A         src/test/java/org/dataone/integration/it/testImplementations/V2IsAuthorizedAuthorizationTestImpl.java
A         src/test/java/org/dataone/integration/it/testImplementations/SidCNTestImplementations.java
A         src/test/java/org/dataone/integration/it/testImplementations/AuthTestImplementations.java
A         src/test/java/org/dataone/integration/it/testImplementations/MNReplicationTestImplementations.java
A         src/test/java/org/dataone/integration/it/testImplementations/QueryTestImplementations.java
A         src/test/java/org/dataone/integration/it/testImplementations/ContentIntegrityTestImplementations.java
A         src/test/java/org/dataone/integration/it/testImplementations/MNPackageFunctionalTestImplementations.java
A         src/test/java/org/dataone/integration/it/testImplementations/ViewTestImplementations.java
A         src/test/java/org/dataone/integration/it/testImplementations/CNIdentityTestImplementations.java
A         src/test/java/org/dataone/integration/it/testImplementations/SidMNTestImplementations.java
A         src/test/java/org/dataone/integration/it/testImplementations/AbstractAuthorizationTestImplementations.java
A         src/test/java/org/dataone/integration/it/testImplementations/SystemMetadataFunctionalTestImplementation.java
A         src/test/java/org/dataone/integration/it/testImplementations/SidCommonTestImplementations.java
A         src/test/java/org/dataone/integration/it/testImplementations/IsAuthorizedAuthorizationTestImplementations.java
A         src/test/java/org/dataone/integration/it/testImplementations/AuthAPITestImplementations.java
A         src/test/java/org/dataone/integration/it/testImplementations/CNReadTestImplementations.java
A         src/test/java/org/dataone/integration/it/testImplementations/ViewFunctionalTestImplementations.java
A         src/test/java/org/dataone/integration/it/testImplementations/MNStorageTestImplementations.java
A         src/test/java/org/dataone/integration/it/testImplementations/SSLTestImplementations.java
A         src/test/java/org/dataone/integration/it/testImplementations/CNDiagnosticTestImplementations.java
A         src/test/java/org/dataone/integration/it/testImplementations/CNRegisterTestImplementations.java
A         src/test/java/org/dataone/integration/it/testImplementations/MNReadTestImplementations.java
A         src/test/java/org/dataone/integration/it/testImplementations/CNCoreTestImplementations.java
A         src/test/java/org/dataone/integration/it/testImplementations/CNUpdateSystemMetadataTestImplementations.java
A         src/test/java/org/dataone/integration/it/testImplementations/ReadTestImplementations.java
A         src/test/java/org/dataone/integration/it/testImplementations/SynchronizeMetadataTestImplementations.java
A         src/test/java/org/dataone/integration/it/testImplementations/LogAggregationFunctionalTestImplementations.java
A         src/test/java/org/dataone/integration/it/CNodeTier2_nodeRegistry_IT.java
A         src/test/java/org/dataone/integration/it/CNodeTier1_cnService_IT.java
A         src/test/java/org/dataone/integration/it/CNodeTier4_metacat_IT.java
A         src/test/java/org/dataone/integration/it/testDefinitions
A         src/test/java/org/dataone/integration/it/testDefinitions/MNQueryTestDefinitions.java
A         src/test/java/org/dataone/integration/it/testDefinitions/AuthTestDefinitions.java
A         src/test/java/org/dataone/integration/it/testDefinitions/SSLTestDefinitions.java
A         src/test/java/org/dataone/integration/it/testDefinitions/ContentIntegrityTestDefinitions.java
A         src/test/java/org/dataone/integration/it/testDefinitions/CNCoreSidTestDefinitions.java
A         src/test/java/org/dataone/integration/it/testDefinitions/CNIdentityTestDefinitions.java
A         src/test/java/org/dataone/integration/it/testDefinitions/ViewTestDefinitions.java
A         src/test/java/org/dataone/integration/it/testDefinitions/CNv2RegisterTestDefinitions.java
A         src/test/java/org/dataone/integration/it/testDefinitions/MNAuthAPITestDefnitions.java
A         src/test/java/org/dataone/integration/it/testDefinitions/CNv2CoreTestDefinitions.java
A         src/test/java/org/dataone/integration/it/testDefinitions/CNAuthorizationSidTestDefinitions.java
A         src/test/java/org/dataone/integration/it/testDefinitions/MNPackageTestDefinitions.java
A         src/test/java/org/dataone/integration/it/testDefinitions/MNCoreSlowTestDefinitions.java
A         src/test/java/org/dataone/integration/it/testDefinitions/SynchronizeMetadataTestDefinition.java
A         src/test/java/org/dataone/integration/it/testDefinitions/CNReplicationTestDefinitions.java
A         src/test/java/org/dataone/integration/it/testDefinitions/CNReplicationSidTestDefinitions.java
A         src/test/java/org/dataone/integration/it/testDefinitions/NodeRegistryExtensibilityTestDefinitions.java
A         src/test/java/org/dataone/integration/it/testDefinitions/MNAuthorizationSidTestDefinitions.java
A         src/test/java/org/dataone/integration/it/testDefinitions/CNReadTestDefinitions.java
A         src/test/java/org/dataone/integration/it/testDefinitions/CNReadSidTestDefinitions.java
A         src/test/java/org/dataone/integration/it/testDefinitions/GeneralAuthorizationTestDefinitions.java
A         src/test/java/org/dataone/integration/it/testDefinitions/MNStorageSidTestDefinitions.java
A         src/test/java/org/dataone/integration/it/testDefinitions/MNv2SystemMetadataChangedTestDefinitions.java
A         src/test/java/org/dataone/integration/it/testDefinitions/MNReplicationTestDefinitions.java
A         src/test/java/org/dataone/integration/it/testDefinitions/CNDiagnosticTestDefinitions.java
A         src/test/java/org/dataone/integration/it/testDefinitions/CNRegisterTestDefinitions.java
A         src/test/java/org/dataone/integration/it/testDefinitions/QueryTestDefinitions.java
A         src/test/java/org/dataone/integration/it/testDefinitions/MNReadTestDefinitions.java
A         src/test/java/org/dataone/integration/it/testDefinitions/MNReadSidTestDefinitions.java
A         src/test/java/org/dataone/integration/it/testDefinitions/MNv2StorageTestDefinitions.java
A         src/test/java/org/dataone/integration/it/testDefinitions/V2AuthorizationTestDefinitions.java
A         src/test/java/org/dataone/integration/it/testDefinitions/CNCoreTestDefinitions.java
A         src/test/java/org/dataone/integration/it/testDefinitions/CNUpdateSystemMetadataTestDefinitions.java
A         src/test/java/org/dataone/integration/it/testDefinitions/ReadTestDefinitions.java
A         src/test/java/org/dataone/integration/it/testDefinitions/CNAuthTestDefinitions.java
A         src/test/java/org/dataone/integration/it/testDefinitions/MNUpdateSystemMetadataTestDefinitions.java
A         src/test/java/org/dataone/integration/it/testDefinitions/MNCoreTestDefinitions.java
A         src/test/java/org/dataone/integration/it/testDefinitions/SystemMetadataChangedMethodTestDefnitions.java
A         src/test/java/org/dataone/integration/it/testDefinitions/CoreTestDefinitions.java
A         src/test/java/org/dataone/integration/it/testDefinitions/MNSystemMetadataChangedTestDefinitions.java
A         src/test/java/org/dataone/integration/it/testDefinitions/AuthAPITestDefinitions.java
A         src/test/java/org/dataone/integration/it/testDefinitions/MNStorageTestDefinitions.java
A         src/test/java/org/dataone/integration/it/CNodeTier1_identity_IT.java
A         src/test/java/org/dataone/integration/it/CNodeTier2_identity_IT.java
A         src/test/java/org/dataone/integration/it/MNodeTier0IT.java
A         src/test/java/org/dataone/integration/it/MNodeTier1IT.java
A         src/test/java/org/dataone/integration/it/ContextAwareAdapter.java
A         src/test/java/org/dataone/integration/it/MNodeTier2IT.java
A         src/test/java/org/dataone/integration/it/MNodeTier3IT.java
A         src/test/java/org/dataone/integration/it/MNodeTier4IT.java
A         src/test/java/org/dataone/integration/it/MNodeTier1SlowIT.java
A         src/test/java/org/dataone/integration/it/CNodeTier1_logAgg_IT.java
A         src/test/java/org/dataone/integration/it/CNodeTier2Auth_metacat_IT.java
A         src/test/java/org/dataone/integration/it/apiTests
A         src/test/java/org/dataone/integration/it/apiTests/CNReplicationV2IT.java
A         src/test/java/org/dataone/integration/it/apiTests/MNAuthorizationV2IT.java
A         src/test/java/org/dataone/integration/it/apiTests/CNReadV1IT.java
A         src/test/java/org/dataone/integration/it/apiTests/MNQueryV1IT.java
A         src/test/java/org/dataone/integration/it/apiTests/MNStorageV2IT.java
A         src/test/java/org/dataone/integration/it/apiTests/MNReplicationV2IT.java
A         src/test/java/org/dataone/integration/it/apiTests/MNReadV1IT.java
A         src/test/java/org/dataone/integration/it/apiTests/CNDiagnosticV2IT.java
A         src/test/java/org/dataone/integration/it/apiTests/CNRegisterV2IT.java
A         src/test/java/org/dataone/integration/it/apiTests/CNCoreV2IT.java
A         src/test/java/org/dataone/integration/it/apiTests/CNIdentityV2IT.java
A         src/test/java/org/dataone/integration/it/apiTests/MNUpdateSystemMetadataIT.java
A         src/test/java/org/dataone/integration/it/apiTests/CNv1TestSuite.java
A         src/test/java/org/dataone/integration/it/apiTests/MNSystemMetadataMutabilityIt.java
A         src/test/java/org/dataone/integration/it/apiTests/CNv2TestSuite.java
A         src/test/java/org/dataone/integration/it/apiTests/CNAuthorizationV1IT.java
A         src/test/java/org/dataone/integration/it/apiTests/MNCoreV2IT.java
A         src/test/java/org/dataone/integration/it/apiTests/MNv1TestSuite.java
A         src/test/java/org/dataone/integration/it/apiTests/CNQueryV2IT.java
A         src/test/java/org/dataone/integration/it/apiTests/MNCoreV2SlowIT.java
A         src/test/java/org/dataone/integration/it/apiTests/CNReplicationV1IT.java
A         src/test/java/org/dataone/integration/it/apiTests/MNAuthorizationV1IT.java
A         src/test/java/org/dataone/integration/it/apiTests/CNViewV2IT.java
A         src/test/java/org/dataone/integration/it/apiTests/CNReadV2IT.java
A         src/test/java/org/dataone/integration/it/apiTests/MNStorageV1IT.java
A         src/test/java/org/dataone/integration/it/apiTests/MNQueryV2IT.java
A         src/test/java/org/dataone/integration/it/apiTests/CNContentIntegrityV1V2IT.java
A         src/test/java/org/dataone/integration/it/apiTests/MNReplicationV1IT.java
A         src/test/java/org/dataone/integration/it/apiTests/CNRegisterV1IT.java
A         src/test/java/org/dataone/integration/it/apiTests/MNViewV2IT.java
A         src/test/java/org/dataone/integration/it/apiTests/MNReadV2IT.java
A         src/test/java/org/dataone/integration/it/apiTests/CNAuthenticationV1V2IT.java
A         src/test/java/org/dataone/integration/it/apiTests/CNCoreV1IT.java
A         src/test/java/org/dataone/integration/it/apiTests/CNIdentityV1IT.java
A         src/test/java/org/dataone/integration/it/apiTests/MNContentIntegrityV1V2IT.java
A         src/test/java/org/dataone/integration/it/apiTests/MNAuthenticationV1V2IT.java
A         src/test/java/org/dataone/integration/it/apiTests/CNAuthorizationV2IT.java
A         src/test/java/org/dataone/integration/it/apiTests/MNCoreV1IT.java
A         src/test/java/org/dataone/integration/it/apiTests/CNQueryV1IT.java
A         src/test/java/org/dataone/integration/it/apiTests/MNPackageV2IT.java
A         src/test/java/org/dataone/integration/it/apiTests/MNCoreV1SlowIT.java
A         src/test/java/org/dataone/integration/it/CNodeTier1_search_IT.java
A         src/test/java/org/dataone/integration/webTest
A         src/test/java/org/dataone/integration/webTest/TestManifestAccess.java
A         src/test/java/org/dataone/integration/webTest/MockV1ITCase.java
A         src/test/java/org/dataone/integration/webTest/TestingTestRunnerServlet.java
A         src/test/java/org/dataone/integration/webTest/TestLauncher.java
A         src/test/java/org/dataone/configuration
A         src/test/java/org/dataone/configuration/TestSettingsTest.java
A         src/test/python
A         src/test/python/org
A         src/test/python/org/dataone
A         src/test/python/org/dataone/client
AU        src/test/python/org/dataone/client/test_client.py
A         src/test/python/org/dataone/client/d1_test_case.py
A         src/test/python/org/dataone/integration
A         src/test/python/org/dataone/integration/context.py
A         src/test/python/org/dataone/integration/tier_1_mn_core_getobjectstatistics.py
A         src/test/python/org/dataone/integration/tier_3_mn_storage_create.py
A         src/test/python/org/dataone/integration/tier_1_mn_core_getstatus.py
A         src/test/python/org/dataone/integration/tier_1_mn_read_getchecksum.py
A         src/test/python/org/dataone/integration/tier_1_mn_core_getcapabilities.py
A         src/test/python/org/dataone/integration/tier_1_mn_read_synchronizationfailed.py
A         src/test/python/org/dataone/integration/tier_1_mn_core_ping.py
A         src/test/python/org/dataone/integration/tier_3_mn_storage_update.py
AU        src/test/python/org/dataone/integration/test_all.py
A         src/test/python/org/dataone/integration/tier_1_mn_read_get.py
A         src/test/python/org/dataone/integration/tier_1_mn_core_getlogrecords.py
A         src/test/python/org/dataone/integration/tier_1_mn_read_describe.py
A         src/test/python/org/dataone/integration/test_utilities.py
A         src/test/python/org/dataone/integration/tier_1_mn_read_getsystemmetadata.py
A         src/test/python/org/dataone/integration/tier_1_mn_read_listobjects.py
A         src/test/python/org/dataone/integration/tier_1_mn_core_getoperationstatistics.py
A         src/test/resources
A         src/test/resources/d1_testdocs
A         src/test/resources/d1_testdocs/eml200
A         src/test/resources/d1_testdocs/eml200/IPCC.200802107062739.1
A         src/test/resources/d1_testdocs/eml200/dpennington.195.2
A         src/test/resources/d1_testdocs/eml200/SystemMetadata
A         src/test/resources/d1_testdocs/eml200/SystemMetadata/dpennington.195.2
A         src/test/resources/d1_testdocs/eml200/SystemMetadata/dpennington.resourcemap
A         src/test/resources/d1_testdocs/eml200/SystemMetadata/IPCC.200802107062739.1
A         src/test/resources/d1_testdocs/eml200/SystemMetadata/README.txt
A         src/test/resources/d1_testdocs/eml200/dpennington.resourcemap
A         src/test/resources/d1_testdocs/eml201
A         src/test/resources/d1_testdocs/eml201/TPT001_018MHP2000R00_20110121.50.1.xml
A         src/test/resources/d1_testdocs/eml201/SystemMetadata
A         src/test/resources/d1_testdocs/eml201/SystemMetadata/README.txt
A         src/test/resources/d1_testdocs/eml201/SystemMetadata/msucci.24.1
A         src/test/resources/d1_testdocs/eml201/SystemMetadata/msucci.23.3
A         src/test/resources/d1_testdocs/eml201/SystemMetadata/msucci.resourcemap
A         src/test/resources/d1_testdocs/eml201/msucci.24.1
A         src/test/resources/d1_testdocs/eml201/msucci.23.3
A         src/test/resources/d1_testdocs/eml201/msucci.resourcemap
A         src/test/resources/d1_testdocs/eml201/TPT001_018MHP2000R00_20110121.40.1.csv
A         src/test/resources/d1_testdocs/eml210
A         src/test/resources/d1_testdocs/eml210/peggym.127.1
A         src/test/resources/d1_testdocs/eml210/peggym.128.1
A         src/test/resources/d1_testdocs/eml210/peggym.129.1
A         src/test/resources/d1_testdocs/eml210/SystemMetadata
A         src/test/resources/d1_testdocs/eml210/SystemMetadata/README.txt
A         src/test/resources/d1_testdocs/eml210/SystemMetadata/peggym.130.4
A         src/test/resources/d1_testdocs/eml210/SystemMetadata/peggym.resourcemap
A         src/test/resources/d1_testdocs/eml210/SystemMetadata/peggym.127.1
A         src/test/resources/d1_testdocs/eml210/SystemMetadata/peggym.128.1
A         src/test/resources/d1_testdocs/eml210/SystemMetadata/peggym.129.1
A         src/test/resources/d1_testdocs/eml210/peggym.130.4
A         src/test/resources/d1_testdocs/eml210/peggym.resourcemap
A         src/test/resources/d1_testdocs/encodingTestSet
AU        src/test/resources/d1_testdocs/encodingTestSet/IMPORTANT_README.txt
A         src/test/resources/d1_testdocs/encodingTestSet/singleAsciiCharacterTests.utf8.txt
AU        src/test/resources/d1_testdocs/encodingTestSet/testUnicodeStrings.utf8.txt
A         src/test/resources/d1_testdocs/encodingTestSet/testAsciiStrings.utf8.txt
A         src/test/resources/d1_testdocs/IT_contexts
A         src/test/resources/d1_testdocs/IT_contexts/default.LOCAL.test.properties
A         src/test/resources/d1_testdocs/IT_contexts/default.DEV.test.properties
A         src/test/resources/d1_testdocs/fgdc
A         src/test/resources/d1_testdocs/fgdc/www.nbii.gov_metadata_mdata_CSIRO_csiro_d_abayadultprawns.sysmeta.xml
A         src/test/resources/d1_testdocs/fgdc/www.nbii.gov_metadata_mdata_NPS_VegMap_nps_d_metawababdy.sysmeta.xml
A         src/test/resources/d1_testdocs/fgdc/README.txt
A         src/test/resources/d1_testdocs/fgdc/www.nbii.gov_metadata_mdata_NASA_nasa_d_FEDGPS1293.xml
A         src/test/resources/d1_testdocs/fgdc/www.nbii.gov_metadata_mdata_USGS_PIERC_brdpierc0020.xml
A         src/test/resources/d1_testdocs/fgdc/www.nbii.gov_metadata_mdata_CSIRO_csiro_d_abayadultprawns.xml
A         src/test/resources/d1_testdocs/fgdc/www.nbii.gov_metadata_mdata_NASA_nasa_d_FEDGPS1293.sysmeta.xml
A         src/test/resources/d1_testdocs/fgdc/www.nbii.gov_metadata_mdata_NPS_VegMap_nps_d_metawababdy.xml
A         src/test/resources/d1_testdocs/fgdc/www.nbii.gov_metadata_mdata_USGS_PIERC_brdpierc0020.sysmeta.xml
A         src/test/resources/d1_testdocs/knb-lter-cdr.329066.1.data
A         src/test/resources/d1_testdocs/knb-lter-gce.247.12.xml
A         src/test/resources/d1_testdocs/knb-lter-luq.76.2.xml
A         src/test/resources/d1_testdocs/checksumTestSet
A         src/test/resources/d1_testdocs/checksumTestSet/sciMD-eml-201-NoLastLForCR.xml
A         src/test/resources/d1_testdocs/BAYXXX_015ADCP015R00_20051215.50.9.xml
A         src/test/resources/d1_testdocs/nodelist
A         src/test/resources/d1_testdocs/nodelist/nodeRegistry.xml
A         src/test/resources/d1_testdocs/EXAMPLE_MANIFEST.MF
A         src/test/resources/d1_testdocs/BAYXXX_015ADCP015R00_20051215.50.9_SYSMETA.xml
A         src/test/resources/d1_testdocs/knb-lter-luq.76.2-broken.xml
A         src/test/resources/d1_testdocs/ore_example_from_openarchives.xml
A         src/test/resources/d1_testdocs/iso19115
A         src/test/resources/d1_testdocs/iso19115/README.txt
A         src/test/resources/d1_testdocs/iso19115/test.xml
A         src/test/resources/d1_testdocs/iso19115/ornldaac_iso_122.xml
A         src/test/resources/d1_testdocs/iso19115/ornldaac_iso_868.xml
A         src/test/resources/d1_testdocs/iso19115/ornldaac_iso_645.xml
A         src/test/resources/d1_testdocs/knb-lter-gce.114.11.xml
A         src/test/resources/nodes.json
A         src/test/resources/org
A         src/test/resources/org/dataone
A         src/test/resources/org/dataone/configuration
A         src/test/resources/org/dataone/configuration/overriding.properties
A         src/main
A         src/main/java
A         src/main/java/org
A         src/main/java/org/dataone
A         src/main/java/org/dataone/client
A         src/main/java/org/dataone/service
A         src/main/java/org/dataone/service/util
A         src/main/java/org/dataone/integration
A         src/main/java/org/dataone/integration/adapters
A         src/main/java/org/dataone/integration/adapters/CommonCallAdapter.java
A         src/main/java/org/dataone/integration/adapters/MNCallAdapter.java
A         src/main/java/org/dataone/integration/adapters/CNCallAdapter.java
A         src/main/java/org/dataone/integration/EMLBuilderUtils.java
AU        src/main/java/org/dataone/integration/ExampleUtilities.java
A         src/main/java/org/dataone/integration/APITestUtils.java
A         src/main/java/org/dataone/integration/ContextAwareTestCaseDataone.java
A         src/main/java/org/dataone/integration/IntegrationTestContextParameters.java
A         src/main/java/org/dataone/integration/webTest
AU        src/main/java/org/dataone/integration/webTest/TestRunnerIndexServlet.java
A         src/main/java/org/dataone/integration/webTest/StreamableSerializer.java
A         src/main/java/org/dataone/integration/webTest/TestRunnerApp.java
A         src/main/java/org/dataone/integration/webTest/AtomicTest.java
A         src/main/java/org/dataone/integration/webTest/StreamingWebTestListener.java
A         src/main/java/org/dataone/integration/webTest/TestRunnerHttpServlet.java
A         src/main/java/org/dataone/integration/webTest/WebTestName.java
A         src/main/java/org/dataone/integration/webTest/Launcher.java
A         src/main/java/org/dataone/integration/webTest/WebTestDescription.java
A         src/main/java/org/dataone/integration/webTest/WebTestImplementation.java
A         src/main/java/org/dataone/integration/webTest/WebTestListener.java
A         src/main/java/org/dataone/integration/webTest/MavenTestRunnerHttpServlet.java
A         src/main/java/org/dataone/integration/hazelcast
A         src/main/java/org/dataone/integration/TestIterationEndingException.java
A         src/main/java/org/dataone/configuration
A         src/main/java/org/dataone/configuration/TestSettings.java
A         src/main/resources
AU        src/main/resources/logback.xml
A         src/main/resources/results.html
A         src/main/resources/results_head.html
A         src/main/resources/org
A         src/main/resources/org/dataone
A         src/main/resources/org/dataone/configuration
A         src/main/resources/org/dataone/configuration/context.DEV.test.properties
A         src/main/resources/org/dataone/configuration/context.SANDBOX.test.properties
A         src/main/resources/org/dataone/configuration/customHudsonDevNodelist.xml
AU        src/main/resources/org/dataone/configuration/context.DEV2.test.properties
A         src/main/resources/org/dataone/configuration/context.STAGE-2.test.properties
A         src/main/resources/org/dataone/configuration/context.STAGE.test.properties
A         src/main/resources/org/dataone/configuration/context.LOCAL_METACAT.test.properties
A         src/main/resources/org/dataone/configuration/default.common.test.properties
A         src/main/resources/org/dataone/configuration/context.LOCAL.test.properties
A         src/main/resources/commons-logging.properties
AU        src/main/resources/log4j.properties
A         src/main/webapp
A         src/main/webapp/WEB-INF
AU        src/main/webapp/WEB-INF/web.xml
A         src/main/webapp/resultsHelp.html
A         src/main/webapp/index.jsp
A         src/main/webapp/results.html
A         src/main/webapp/images
AU        src/main/webapp/images/help.png
AU        src/main/webapp/images/red.png
AU        src/main/webapp/images/yellow.png
AU        src/main/webapp/images/sunny.gif
AU        src/main/webapp/images/grey.png
AU        src/main/webapp/images/blue.png
A         src/main/webapp/results_head.html
A         src/license-header.txt
A         pom.xml
A         tierTestingMethodTemplater.pl
A         README.txt
A         nbactions.xml
AU        LICENSE.txt
 U        .
At revision 16925
Parsing POMs
Established TCP socket on 49185
[workspace] $ /usr/lib/jvm/java-7-openjdk-amd64/bin/java -cp /var/lib/jenkins/plugins/maven-plugin/WEB-INF/lib/maven3-agent-1.7.jar:/usr/share/maven/boot/plexus-classworlds-2.x.jar org.jvnet.hudson.maven3.agent.Maven3Main /usr/share/maven /var/cache/jenkins/war/WEB-INF/lib/remoting-2.52.jar /var/lib/jenkins/plugins/maven-plugin/WEB-INF/lib/maven3-interceptor-1.7.jar /var/lib/jenkins/plugins/maven-plugin/WEB-INF/lib/maven3-interceptor-commons-1.7.jar 49185
<===[JENKINS REMOTING CAPACITY]===>channel started
Executing Maven:  -B -f /var/lib/jenkins/jobs/d1_integration_DEV2_mn_v2/workspace/pom.xml -Dit.test=MNCoreV2IT,MNCoreV2SlowIT,MNReadV2IT,MNAuthorizationV2IT,MNQueryV2IT,MNReplicationV2IT,MNStorageV2IT,MNPackageV2IT,MNViewV2IT -Dcontext.label=DEV2 -Dtest=foo -DfailIfNoTests=false verify
[INFO] Scanning for projects...
[WARNING] 
[WARNING] Some problems were encountered while building the effective model for org.dataone:d1_integration:war:2.0-SNAPSHOT
[WARNING] 'build.plugins.plugin.version' for org.apache.maven.plugins:maven-compiler-plugin is missing. @ line 197, column 15
[WARNING] 'build.plugins.plugin.version' for org.codehaus.mojo:buildnumber-maven-plugin is missing. @ line 221, column 15
[WARNING] 'build.plugins.plugin.version' for com.mycila.maven-license-plugin:maven-license-plugin is missing. @ line 214, column 15
[WARNING] 'build.plugins.plugin.version' for org.apache.maven.plugins:maven-war-plugin is missing. @ line 237, column 15
[WARNING] 
[WARNING] It is highly recommended to fix these problems because they threaten the stability of your build.
[WARNING] 
[WARNING] For this reason, future Maven versions might no longer support building such malformed projects.
[WARNING] 
[INFO]                                                                         
[INFO] ------------------------------------------------------------------------
[INFO] Building DataONE Integration Testing Package 2.0-SNAPSHOT
[INFO] ------------------------------------------------------------------------
[INFO] 
[INFO] --- buildnumber-maven-plugin:1.2:create (default) @ d1_integration ---
[INFO] Checking for local modifications: skipped.
[INFO] Updating project files from SCM: skipped.
[INFO] Executing: /bin/sh -c cd /var/lib/jenkins/jobs/d1_integration_DEV2_mn_v2/workspace && svn --non-interactive info
[INFO] Working directory: /var/lib/jenkins/jobs/d1_integration_DEV2_mn_v2/workspace
[INFO] Storing buildNumber: 16925 at timestamp: 1447827275282
[INFO] Executing: /bin/sh -c cd /var/lib/jenkins/jobs/d1_integration_DEV2_mn_v2/workspace && svn --non-interactive info
[INFO] Working directory: /var/lib/jenkins/jobs/d1_integration_DEV2_mn_v2/workspace
[INFO] Storing buildScmBranch: trunk
[INFO] 
[INFO] --- maven-resources-plugin:2.3:resources (default-resources) @ d1_integration ---
[WARNING] Using platform encoding (UTF-8 actually) to copy filtered resources, i.e. build is platform dependent!
[INFO] Copying 14 resources
[INFO] 
[INFO] --- maven-compiler-plugin:2.0.2:compile (default-compile) @ d1_integration ---
[INFO] Compiling 22 source files to /var/lib/jenkins/jobs/d1_integration_DEV2_mn_v2/workspace/target/classes
[INFO] 
[INFO] --- maven-resources-plugin:2.3:testResources (default-testResources) @ d1_integration ---
[WARNING] Using platform encoding (UTF-8 actually) to copy filtered resources, i.e. build is platform dependent!
[INFO] Copying 60 resources
[INFO] 
[INFO] --- maven-compiler-plugin:2.0.2:testCompile (default-testCompile) @ d1_integration ---
[INFO] Compiling 144 source files to /var/lib/jenkins/jobs/d1_integration_DEV2_mn_v2/workspace/target/test-classes
[INFO] 
[INFO] --- maven-surefire-plugin:2.10:test (default-test) @ d1_integration ---
[INFO] Surefire report directory: /var/lib/jenkins/jobs/d1_integration_DEV2_mn_v2/workspace/target/surefire-reports

-------------------------------------------------------
 T E S T S
-------------------------------------------------------

Results :

Tests run: 0, Failures: 0, Errors: 0, Skipped: 0

[JENKINS] Recording test results[INFO] 
[INFO] --- maven-antrun-plugin:1.3:run (execution1) @ d1_integration ---

[INFO] Executing tasks
     [copy] Copying 236 files to /var/lib/jenkins/jobs/d1_integration_DEV2_mn_v2/workspace/target/classes
     [copy] Copying 3 files to /var/lib/jenkins/jobs/d1_integration_DEV2_mn_v2/workspace/target/d1_integration-2.0-SNAPSHOT/org/dataone/integration/webTest
[INFO] Executed tasks
[INFO] 
[INFO] --- maven-dependency-plugin:2.3:unpack-dependencies (jetty-classpath) @ d1_integration ---
[INFO] Unpacking /var/lib/jenkins/.m2/repository/org/eclipse/jetty/orbit/org.apache.jasper.glassfish/2.2.2.v201112011158/org.apache.jasper.glassfish-2.2.2.v201112011158.jar to /var/lib/jenkins/jobs/d1_integration_DEV2_mn_v2/workspace/target/d1_integration-2.0-SNAPSHOT with includes "" and excludes ""
[INFO] Unpacking /var/lib/jenkins/.m2/repository/org/slf4j/slf4j-simple/1.6.4/slf4j-simple-1.6.4.jar to /var/lib/jenkins/jobs/d1_integration_DEV2_mn_v2/workspace/target/d1_integration-2.0-SNAPSHOT with includes "" and excludes ""
[INFO] Unpacking /var/lib/jenkins/.m2/repository/org/eclipse/jetty/jetty-websocket/8.1.15.v20140411/jetty-websocket-8.1.15.v20140411.jar to /var/lib/jenkins/jobs/d1_integration_DEV2_mn_v2/workspace/target/d1_integration-2.0-SNAPSHOT with includes "" and excludes ""
[INFO] Unpacking /var/lib/jenkins/.m2/repository/org/eclipse/jetty/orbit/javax.security.auth.message/1.0.0.v201108011116/javax.security.auth.message-1.0.0.v201108011116.jar to /var/lib/jenkins/jobs/d1_integration_DEV2_mn_v2/workspace/target/d1_integration-2.0-SNAPSHOT with includes "" and excludes ""
[INFO] Unpacking /var/lib/jenkins/.m2/repository/org/eclipse/jetty/orbit/javax.servlet.jsp.jstl/1.2.0.v201105211821/javax.servlet.jsp.jstl-1.2.0.v201105211821.jar to /var/lib/jenkins/jobs/d1_integration_DEV2_mn_v2/workspace/target/d1_integration-2.0-SNAPSHOT with includes "" and excludes ""
[INFO] Unpacking /var/lib/jenkins/.m2/repository/org/eclipse/jetty/orbit/com.sun.el/2.2.0.v201108011116/com.sun.el-2.2.0.v201108011116.jar to /var/lib/jenkins/jobs/d1_integration_DEV2_mn_v2/workspace/target/d1_integration-2.0-SNAPSHOT with includes "" and excludes ""
[INFO] Unpacking /var/lib/jenkins/.m2/repository/org/eclipse/jetty/orbit/javax.mail.glassfish/1.4.1.v201005082020/javax.mail.glassfish-1.4.1.v201005082020.jar to /var/lib/jenkins/jobs/d1_integration_DEV2_mn_v2/workspace/target/d1_integration-2.0-SNAPSHOT with includes "" and excludes ""
[INFO] Unpacking /var/lib/jenkins/.m2/repository/org/slf4j/slf4j-api/1.6.4/slf4j-api-1.6.4.jar to /var/lib/jenkins/jobs/d1_integration_DEV2_mn_v2/workspace/target/d1_integration-2.0-SNAPSHOT with includes "" and excludes ""
[INFO] Unpacking /var/lib/jenkins/.m2/repository/org/eclipse/jetty/jetty-io/8.1.15.v20140411/jetty-io-8.1.15.v20140411.jar to /var/lib/jenkins/jobs/d1_integration_DEV2_mn_v2/workspace/target/d1_integration-2.0-SNAPSHOT with includes "" and excludes ""
[INFO] Unpacking /var/lib/jenkins/.m2/repository/org/eclipse/jetty/orbit/javax.servlet.jsp/2.2.0.v201112011158/javax.servlet.jsp-2.2.0.v201112011158.jar to /var/lib/jenkins/jobs/d1_integration_DEV2_mn_v2/workspace/target/d1_integration-2.0-SNAPSHOT with includes "" and excludes ""
[INFO] Unpacking /var/lib/jenkins/.m2/repository/org/eclipse/jetty/aggregate/jetty-all-server/8.1.15.v20140411/jetty-all-server-8.1.15.v20140411.jar to /var/lib/jenkins/jobs/d1_integration_DEV2_mn_v2/workspace/target/d1_integration-2.0-SNAPSHOT with includes "" and excludes ""
[INFO] Unpacking /var/lib/jenkins/.m2/repository/org/eclipse/jetty/jetty-jsp/8.1.15.v20140411/jetty-jsp-8.1.15.v20140411.jar to /var/lib/jenkins/jobs/d1_integration_DEV2_mn_v2/workspace/target/d1_integration-2.0-SNAPSHOT with includes "" and excludes ""
[INFO] Unpacking /var/lib/jenkins/.m2/repository/org/eclipse/jetty/orbit/org.apache.taglibs.standard.glassfish/1.2.0.v201112081803/org.apache.taglibs.standard.glassfish-1.2.0.v201112081803.jar to /var/lib/jenkins/jobs/d1_integration_DEV2_mn_v2/workspace/target/d1_integration-2.0-SNAPSHOT with includes "" and excludes ""
[INFO] Unpacking /var/lib/jenkins/.m2/repository/javax/servlet/servlet-api/2.5/servlet-api-2.5.jar to /var/lib/jenkins/jobs/d1_integration_DEV2_mn_v2/workspace/target/d1_integration-2.0-SNAPSHOT with includes "" and excludes ""
[INFO] Unpacking /var/lib/jenkins/.m2/repository/org/eclipse/jetty/orbit/javax.activation/1.1.0.v201105071233/javax.activation-1.1.0.v201105071233.jar to /var/lib/jenkins/jobs/d1_integration_DEV2_mn_v2/workspace/target/d1_integration-2.0-SNAPSHOT with includes "" and excludes ""
[INFO] Unpacking /var/lib/jenkins/.m2/repository/org/eclipse/jetty/orbit/javax.annotation/1.1.0.v201108011116/javax.annotation-1.1.0.v201108011116.jar to /var/lib/jenkins/jobs/d1_integration_DEV2_mn_v2/workspace/target/d1_integration-2.0-SNAPSHOT with includes "" and excludes ""
[INFO] Unpacking /var/lib/jenkins/.m2/repository/org/eclipse/jetty/jetty-http/8.1.15.v20140411/jetty-http-8.1.15.v20140411.jar to /var/lib/jenkins/jobs/d1_integration_DEV2_mn_v2/workspace/target/d1_integration-2.0-SNAPSHOT with includes "" and excludes ""
[INFO] Unpacking /var/lib/jenkins/.m2/repository/org/eclipse/jetty/jetty-util/8.1.15.v20140411/jetty-util-8.1.15.v20140411.jar to /var/lib/jenkins/jobs/d1_integration_DEV2_mn_v2/workspace/target/d1_integration-2.0-SNAPSHOT with includes "" and excludes ""
[INFO] Unpacking /var/lib/jenkins/.m2/repository/org/eclipse/jetty/orbit/org.eclipse.jdt.core/3.7.1/org.eclipse.jdt.core-3.7.1.jar to /var/lib/jenkins/jobs/d1_integration_DEV2_mn_v2/workspace/target/d1_integration-2.0-SNAPSHOT with includes "" and excludes ""
[INFO] Unpacking /var/lib/jenkins/.m2/repository/org/eclipse/jetty/orbit/javax.servlet/3.0.0.v201112011016/javax.servlet-3.0.0.v201112011016.jar to /var/lib/jenkins/jobs/d1_integration_DEV2_mn_v2/workspace/target/d1_integration-2.0-SNAPSHOT with includes "" and excludes ""
[INFO] Unpacking /var/lib/jenkins/.m2/repository/org/eclipse/jetty/orbit/javax.el/2.2.0.v201108011116/javax.el-2.2.0.v201108011116.jar to /var/lib/jenkins/jobs/d1_integration_DEV2_mn_v2/workspace/target/d1_integration-2.0-SNAPSHOT with includes "" and excludes ""
[INFO] 
[INFO] --- maven-war-plugin:2.1.1:war (default-war) @ d1_integration ---
[INFO] Packaging webapp
[INFO] Assembling webapp [d1_integration] in [/var/lib/jenkins/jobs/d1_integration_DEV2_mn_v2/workspace/target/d1_integration-2.0-SNAPSHOT]
[INFO] Processing war project
[INFO] Copying webapp resources [/var/lib/jenkins/jobs/d1_integration_DEV2_mn_v2/workspace/src/main/webapp]
[INFO] Webapp assembled in [407 msecs]
[INFO] Building war: /var/lib/jenkins/jobs/d1_integration_DEV2_mn_v2/workspace/target/d1_integration-2.0-SNAPSHOT.war
[INFO] WEB-INF/web.xml already added, skipping
[INFO] 
[INFO] --- maven-antrun-plugin:1.3:run (execution2) @ d1_integration ---
[INFO] Executing tasks
     [move] Moving 1 file to /var/lib/jenkins/jobs/d1_integration_DEV2_mn_v2/workspace/target
[INFO] Executed tasks
[INFO] 
[INFO] --- maven-failsafe-plugin:2.8.1:integration-test (integration-test) @ d1_integration ---
[INFO] Failsafe report directory: /var/lib/jenkins/jobs/d1_integration_DEV2_mn_v2/workspace/target/failsafe-reports

-------------------------------------------------------
 T E S T S
-------------------------------------------------------
Running org.dataone.integration.it.apiTests.MNStorageV2IT
20151118-06:14:58: [INFO]: **************************************************** [org.dataone.integration.ContextAwareTestCaseDataone]
20151118-06:14:58: [INFO]: ***  context label:   DEV2 [org.dataone.integration.ContextAwareTestCaseDataone]
20151118-06:14:58: [INFO]: **************************************************** [org.dataone.integration.ContextAwareTestCaseDataone]
~~~ Context is from d1client.properties: https://cn-dev-2.test.dataone.org/cn
20151118-06:14:58: [INFO]: rest call info: GET https://cn-dev-2.test.dataone.org/cn/v1/node [org.dataone.client.rest.RestClient]
20151118-06:14:59: [INFO]: isNodeAlive for Node: https://cn-dev-2.test.dataone.org/cn ... [org.dataone.integration.ContextAwareTestCaseDataone]
20151118-06:14:59: [INFO]: ... calling node ... [org.dataone.integration.ContextAwareTestCaseDataone]
20151118-06:14:59: [INFO]: rest call info: GET https://cn-dev-2.test.dataone.org/cn [org.dataone.client.rest.RestClient]
20151118-06:14:59: [INFO]: ... called node [org.dataone.integration.ContextAwareTestCaseDataone]
20151118-06:14:59: [INFO]: *** Adding CN to list: cn-dev-2 [ https://cn-dev-2.test.dataone.org/cn ] [org.dataone.integration.ContextAwareTestCaseDataone]
20151118-06:14:59: [INFO]: isNodeAlive for Node: https://cn-dev-ucsb-2.test.dataone.org/cn ... [org.dataone.integration.ContextAwareTestCaseDataone]
20151118-06:14:59: [INFO]: ... calling node ... [org.dataone.integration.ContextAwareTestCaseDataone]
20151118-06:15:09: [INFO]: rest call info: GET https://cn-dev-ucsb-2.test.dataone.org/cn [org.dataone.client.rest.RestClient]
20151118-06:15:09: [INFO]: ... called node [org.dataone.integration.ContextAwareTestCaseDataone]
20151118-06:15:09: [WARN]: *** Failed to add CN to list: cn-dev-ucsb-2 [ https://cn-dev-ucsb-2.test.dataone.org/cn ].  Could not reach the node:GET https://cn-dev-2.test.dataone.org/cn/v1/node [org.dataone.integration.ContextAwareTestCaseDataone]
20151118-06:15:09: [INFO]: isNodeAlive for Node: https://cn-dev-unm-2.test.dataone.org/cn ... [org.dataone.integration.ContextAwareTestCaseDataone]
20151118-06:15:09: [INFO]: ... calling node ... [org.dataone.integration.ContextAwareTestCaseDataone]
20151118-06:15:10: [INFO]: rest call info: GET https://cn-dev-unm-2.test.dataone.org/cn [org.dataone.client.rest.RestClient]
20151118-06:15:10: [INFO]: ... called node [org.dataone.integration.ContextAwareTestCaseDataone]
20151118-06:15:10: [INFO]: *** Adding CN to list: cn-dev-unm-2 [ https://cn-dev-unm-2.test.dataone.org/cn ] [org.dataone.integration.ContextAwareTestCaseDataone]
20151118-06:15:10: [INFO]: isNodeAlive for Node: https://mn-dev-ucsb-1.test.dataone.org/metacat/d1/mn ... [org.dataone.integration.ContextAwareTestCaseDataone]
20151118-06:15:10: [INFO]: ... calling node ... [org.dataone.integration.ContextAwareTestCaseDataone]
20151118-06:15:10: [INFO]: rest call info: GET https://mn-dev-ucsb-1.test.dataone.org/metacat/d1/mn [org.dataone.client.rest.RestClient]
20151118-06:15:10: [INFO]: ... called node [org.dataone.integration.ContextAwareTestCaseDataone]
20151118-06:15:10: [INFO]: *** Adding MN to list: mn-dev-ucsb-1 [ https://mn-dev-ucsb-1.test.dataone.org/metacat/d1/mn ] [org.dataone.integration.ContextAwareTestCaseDataone]
20151118-06:15:10: [INFO]: isNodeAlive for Node: https://mn-dev-ucsb-2.test.dataone.org/metacat/d1/mn ... [org.dataone.integration.ContextAwareTestCaseDataone]
20151118-06:15:10: [INFO]: ... calling node ... [org.dataone.integration.ContextAwareTestCaseDataone]
20151118-06:15:11: [INFO]: rest call info: GET https://mn-dev-ucsb-2.test.dataone.org/metacat/d1/mn [org.dataone.client.rest.RestClient]
20151118-06:15:11: [INFO]: ... called node [org.dataone.integration.ContextAwareTestCaseDataone]
20151118-06:15:11: [INFO]: *** Adding MN to list: mn-dev-ucsb-2 [ https://mn-dev-ucsb-2.test.dataone.org/metacat/d1/mn ] [org.dataone.integration.ContextAwareTestCaseDataone]
20151118-06:15:11: [INFO]: isNodeAlive for Node: https://mn-dev-unm-1.test.dataone.org/metacat/d1/mn ... [org.dataone.integration.ContextAwareTestCaseDataone]
20151118-06:15:11: [INFO]: ... calling node ... [org.dataone.integration.ContextAwareTestCaseDataone]
20151118-06:15:11: [INFO]: rest call info: GET https://mn-dev-unm-1.test.dataone.org/metacat/d1/mn [org.dataone.client.rest.RestClient]
20151118-06:15:11: [INFO]: ... called node [org.dataone.integration.ContextAwareTestCaseDataone]
20151118-06:15:11: [INFO]: *** Adding MN to list: mn-dev-unm-1 [ https://mn-dev-unm-1.test.dataone.org/metacat/d1/mn ] [org.dataone.integration.ContextAwareTestCaseDataone]
20151118-06:15:11: [INFO]: isNodeAlive for Node: https://mn-dev-unm-2.test.dataone.org/metacat/d1/mn ... [org.dataone.integration.ContextAwareTestCaseDataone]
20151118-06:15:11: [INFO]: ... calling node ... [org.dataone.integration.ContextAwareTestCaseDataone]
20151118-06:15:12: [INFO]: rest call info: GET https://mn-dev-unm-2.test.dataone.org/metacat/d1/mn [org.dataone.client.rest.RestClient]
20151118-06:15:12: [INFO]: ... called node [org.dataone.integration.ContextAwareTestCaseDataone]
20151118-06:15:12: [INFO]: *** Adding MN to list: mn-dev-unm-2 [ https://mn-dev-unm-2.test.dataone.org/metacat/d1/mn ] [org.dataone.integration.ContextAwareTestCaseDataone]
20151118-06:15:12: [INFO]: trying to filter CN list for the round robin CN... original size: 2, includes nodes: [org.dataone.integration.ContextAwareTestCaseDataone]
20151118-06:15:12: [INFO]:     CN: https://cn-dev-2.test.dataone.org/cn "Development 2 Round Robin Router Node" [org.dataone.integration.ContextAwareTestCaseDataone]
20151118-06:15:12: [INFO]:     CN: https://cn-dev-unm-2.test.dataone.org/cn "UNM Development 2 Protocol Coordinating Node" [org.dataone.integration.ContextAwareTestCaseDataone]
20151118-06:15:12: [INFO]: excluding round robin CN: https://cn-dev-2.test.dataone.org/cn "Development 2 Round Robin Router Node" [org.dataone.integration.ContextAwareTestCaseDataone]
20151118-06:15:12: [INFO]: including CN: https://cn-dev-unm-2.test.dataone.org/cn "UNM Development 2 Protocol Coordinating Node" [org.dataone.integration.ContextAwareTestCaseDataone]
20151118-06:15:12: [INFO]: filtered CN list without round robin CN. size: 1, including nodes: [org.dataone.integration.ContextAwareTestCaseDataone]
20151118-06:15:12: [INFO]:     CN: https://cn-dev-unm-2.test.dataone.org/cn "UNM Development 2 Protocol Coordinating Node" [org.dataone.integration.ContextAwareTestCaseDataone]
20151118-06:15:12: [INFO]: **************************************************** [org.dataone.integration.ContextAwareTestCaseDataone]
20151118-06:15:12: [INFO]: certificate directory: /etc/dataone/client/testClientCerts/ [org.dataone.integration.ContextAwareTestCaseDataone]
20151118-06:15:12: [INFO]: certificate filename: cnDevUNM2 [org.dataone.integration.ContextAwareTestCaseDataone]
20151118-06:15:12: [INFO]: client setup as Subject: CN=urn:node:cnDevUNM2,DC=dataone,DC=org [org.dataone.integration.ContextAwareTestCaseDataone]
20151118-06:15:12: [INFO]: rest call info: GET https://mn-dev-ucsb-1.test.dataone.org/metacat/d1/mn/v2/monitor/ping [org.dataone.client.rest.RestClient]
20151118-06:15:12: [INFO]: MN excluded from test: https://mn-dev-ucsb-1.test.dataone.org/metacat/d1/mn [org.dataone.integration.ContextAwareTestCaseDataone]
20151118-06:15:13: [INFO]: rest call info: GET https://mn-dev-ucsb-2.test.dataone.org/metacat/d1/mn/v2/monitor/ping [org.dataone.client.rest.RestClient]
20151118-06:15:13: [INFO]: MN included in test: https://mn-dev-ucsb-2.test.dataone.org/metacat/d1/mn [org.dataone.integration.ContextAwareTestCaseDataone]
20151118-06:15:13: [INFO]: rest call info: GET https://mn-dev-unm-1.test.dataone.org/metacat/d1/mn/v2/monitor/ping [org.dataone.client.rest.RestClient]
20151118-06:15:13: [INFO]: MN excluded from test: https://mn-dev-unm-1.test.dataone.org/metacat/d1/mn [org.dataone.integration.ContextAwareTestCaseDataone]
20151118-06:15:13: [INFO]: rest call info: GET https://mn-dev-unm-2.test.dataone.org/metacat/d1/mn/v2/monitor/ping [org.dataone.client.rest.RestClient]
20151118-06:15:13: [INFO]: MN included in test: https://mn-dev-unm-2.test.dataone.org/metacat/d1/mn [org.dataone.integration.ContextAwareTestCaseDataone]
20151118-06:15:13: [INFO]: certificate directory: /etc/dataone/client/testClientCerts/ [org.dataone.integration.ContextAwareTestCaseDataone]
20151118-06:15:13: [INFO]: certificate filename: testRightsHolder [org.dataone.integration.ContextAwareTestCaseDataone]
20151118-06:15:13: [INFO]: client setup as Subject: CN=testRightsHolder,DC=dataone,DC=org [org.dataone.integration.ContextAwareTestCaseDataone]
20151118-06:15:13: [INFO]: 
***************** running test for testCreate() vs. node: https://mn-dev-ucsb-2.test.dataone.org/metacat/d1/mn/v2 ***************** [org.dataone.integration.ContextAwareTestCaseDataone]
20151118-06:15:13: [INFO]: refreshing objectFormatCache from cn: null [org.dataone.client.v2.formats.ObjectFormatCache]
20151118-06:15:13: [INFO]: rest call info: GET https://cn-dev-2.test.dataone.org/cn/v2/formats [org.dataone.client.rest.RestClient]
20151118-06:15:13: [INFO]: successful cache refresh from cn.listFormats() [org.dataone.client.v2.formats.ObjectFormatCache]
20151118-06:15:15: [INFO]: rest call info: POST https://mn-dev-ucsb-2.test.dataone.org/metacat/d1/mn/v2/object; MMP message has: ParamPart:pid = mNodeTier3TestCreate2015321221513463; FilePart:object = /tmp/mmp.output.6875566909976313124.tmp (684336 bytes); FilePart:sysmeta = /tmp/mmp.output.6895583927783352716.tmp (872 bytes);  [org.dataone.client.rest.RestClient]
20151118-06:15:16: [INFO]: rest call info: GET https://mn-dev-ucsb-2.test.dataone.org/metacat/d1/mn/v2/object/mNodeTier3TestCreate2015321221513463 [org.dataone.client.rest.RestClient]
20151118-06:15:16: [INFO]: 
***************** running test for testCreate() vs. node: https://mn-dev-unm-2.test.dataone.org/metacat/d1/mn/v2 ***************** [org.dataone.integration.ContextAwareTestCaseDataone]
20151118-06:15:17: [INFO]: rest call info: POST https://mn-dev-unm-2.test.dataone.org/metacat/d1/mn/v2/object; MMP message has: ParamPart:pid = mNodeTier3TestCreate2015321221516564; FilePart:object = /tmp/mmp.output.1058706881245781508.tmp (684336 bytes); FilePart:sysmeta = /tmp/mmp.output.3263876481891666079.tmp (872 bytes);  [org.dataone.client.rest.RestClient]
20151118-06:15:17: [INFO]: rest call info: GET https://mn-dev-unm-2.test.dataone.org/metacat/d1/mn/v2/object/mNodeTier3TestCreate2015321221516564 [org.dataone.client.rest.RestClient]
20151118-06:15:17: [INFO]: **************************************************** [org.dataone.integration.ContextAwareTestCaseDataone]
20151118-06:15:17: [INFO]: ***  context label:   DEV2 [org.dataone.integration.ContextAwareTestCaseDataone]
20151118-06:15:17: [INFO]: **************************************************** [org.dataone.integration.ContextAwareTestCaseDataone]
20151118-06:15:17: [INFO]: **************************************************** [org.dataone.integration.ContextAwareTestCaseDataone]
20151118-06:15:17: [INFO]: rest call info: GET https://mn-dev-ucsb-1.test.dataone.org/metacat/d1/mn/v2/monitor/ping [org.dataone.client.rest.RestClient]
20151118-06:15:17: [INFO]: MN excluded from test: https://mn-dev-ucsb-1.test.dataone.org/metacat/d1/mn [org.dataone.integration.ContextAwareTestCaseDataone]
20151118-06:15:17: [INFO]: rest call info: GET https://mn-dev-ucsb-2.test.dataone.org/metacat/d1/mn/v2/monitor/ping [org.dataone.client.rest.RestClient]
20151118-06:15:17: [INFO]: MN included in test: https://mn-dev-ucsb-2.test.dataone.org/metacat/d1/mn [org.dataone.integration.ContextAwareTestCaseDataone]
20151118-06:15:17: [INFO]: rest call info: GET https://mn-dev-unm-1.test.dataone.org/metacat/d1/mn/v2/monitor/ping [org.dataone.client.rest.RestClient]
20151118-06:15:17: [INFO]: MN excluded from test: https://mn-dev-unm-1.test.dataone.org/metacat/d1/mn [org.dataone.integration.ContextAwareTestCaseDataone]
20151118-06:15:17: [INFO]: rest call info: GET https://mn-dev-unm-2.test.dataone.org/metacat/d1/mn/v2/monitor/ping [org.dataone.client.rest.RestClient]
20151118-06:15:17: [INFO]: MN included in test: https://mn-dev-unm-2.test.dataone.org/metacat/d1/mn [org.dataone.integration.ContextAwareTestCaseDataone]
20151118-06:15:17: [INFO]: 
***************** running test for testCreate_NoCert() vs. node: https://mn-dev-ucsb-2.test.dataone.org/metacat/d1/mn/v2 ***************** [org.dataone.integration.ContextAwareTestCaseDataone]
20151118-06:15:19: [INFO]: rest call info: POST https://mn-dev-ucsb-2.test.dataone.org/metacat/d1/mn/v2/object; MMP message has: ParamPart:pid = mNodeTier3TestCreate2015321221517905; FilePart:object = /tmp/mmp.output.623927130741711252.tmp (684336 bytes); FilePart:sysmeta = /tmp/mmp.output.373775168620643992.tmp (810 bytes);  [org.dataone.client.rest.RestClient]
20151118-06:15:19: [INFO]: 
***************** running test for testCreate_NoCert() vs. node: https://mn-dev-unm-2.test.dataone.org/metacat/d1/mn/v2 ***************** [org.dataone.integration.ContextAwareTestCaseDataone]
20151118-06:15:19: [INFO]: rest call info: POST https://mn-dev-unm-2.test.dataone.org/metacat/d1/mn/v2/object; MMP message has: ParamPart:pid = mNodeTier3TestCreate2015321221519254; FilePart:object = /tmp/mmp.output.3153522853393879253.tmp (684336 bytes); FilePart:sysmeta = /tmp/mmp.output.5504848105589545849.tmp (810 bytes);  [org.dataone.client.rest.RestClient]
20151118-06:15:19: [INFO]: **************************************************** [org.dataone.integration.ContextAwareTestCaseDataone]
20151118-06:15:19: [INFO]: ***  context label:   DEV2 [org.dataone.integration.ContextAwareTestCaseDataone]
20151118-06:15:19: [INFO]: **************************************************** [org.dataone.integration.ContextAwareTestCaseDataone]
20151118-06:15:19: [INFO]: **************************************************** [org.dataone.integration.ContextAwareTestCaseDataone]
20151118-06:15:19: [INFO]: rest call info: GET https://mn-dev-ucsb-1.test.dataone.org/metacat/d1/mn/v2/monitor/ping [org.dataone.client.rest.RestClient]
20151118-06:15:19: [INFO]: MN excluded from test: https://mn-dev-ucsb-1.test.dataone.org/metacat/d1/mn [org.dataone.integration.ContextAwareTestCaseDataone]
20151118-06:15:19: [INFO]: rest call info: GET https://mn-dev-ucsb-2.test.dataone.org/metacat/d1/mn/v2/monitor/ping [org.dataone.client.rest.RestClient]
20151118-06:15:19: [INFO]: MN included in test: https://mn-dev-ucsb-2.test.dataone.org/metacat/d1/mn [org.dataone.integration.ContextAwareTestCaseDataone]
20151118-06:15:19: [INFO]: rest call info: GET https://mn-dev-unm-1.test.dataone.org/metacat/d1/mn/v2/monitor/ping [org.dataone.client.rest.RestClient]
20151118-06:15:19: [INFO]: MN excluded from test: https://mn-dev-unm-1.test.dataone.org/metacat/d1/mn [org.dataone.integration.ContextAwareTestCaseDataone]
20151118-06:15:19: [INFO]: rest call info: GET https://mn-dev-unm-2.test.dataone.org/metacat/d1/mn/v2/monitor/ping [org.dataone.client.rest.RestClient]
20151118-06:15:19: [INFO]: MN included in test: https://mn-dev-unm-2.test.dataone.org/metacat/d1/mn [org.dataone.integration.ContextAwareTestCaseDataone]
20151118-06:15:19: [INFO]: 
***************** running test for testUpdate() vs. node: https://mn-dev-ucsb-2.test.dataone.org/metacat/d1/mn/v2 ***************** [org.dataone.integration.ContextAwareTestCaseDataone]
20151118-06:15:19: [INFO]: certificate directory: /etc/dataone/client/testClientCerts/ [org.dataone.integration.ContextAwareTestCaseDataone]
20151118-06:15:19: [INFO]: certificate filename: cnDevUNM2 [org.dataone.integration.ContextAwareTestCaseDataone]
20151118-06:15:19: [INFO]: client setup as Subject: CN=urn:node:cnDevUNM2,DC=dataone,DC=org [org.dataone.integration.ContextAwareTestCaseDataone]
20151118-06:15:19: [INFO]: creating a test object.  pid = testUpdate_2015321221519819 on https://mn-dev-ucsb-2.test.dataone.org/metacat/d1/mn/v2 [org.dataone.integration.ContextAwareTestCaseDataone]
20151118-06:15:19: [INFO]: SystemMetadata for pid: testUpdate_2015321221519819
<?xml version="1.0" encoding="UTF-8"?><d1_v2.0:systemMetadata xmlns:d1_v2.0="http://ns.dataone.org/service/types/v2.0" xmlns:d1="http://ns.dataone.org/service/types/v1"><serialVersion>1</serialVersion><identifier>testUpdate_2015321221519819</identifier><formatId>eml://ecoinformatics.org/eml-2.0.1</formatId><size>17181</size><checksum algorithm="MD5">03ce09c6b4c3efc1681f3023402998a2</checksum><submitter>CN=urn:node:cnDevUNM2,DC=dataone,DC=org</submitter><rightsHolder>CN=testRightsHolder,DC=dataone,DC=org</rightsHolder><accessPolicy><allow><subject>CN=testRightsHolder,DC=dataone,DC=org</subject><permission>changePermission</permission></allow></accessPolicy><dateUploaded>2015-11-18T06:15:19.840+00:00</dateUploaded><dateSysMetadataModified>2015-11-18T06:15:19.840+00:00</dateSysMetadataModified><originMemberNode>urn:node:mnDevUCSB2</originMemberNode><authoritativeMemberNode>urn:node:mnDevUCSB2</authoritativeMemberNode></d1_v2.0:systemMetadata> [org.dataone.integration.ContextAwareTestCaseDataone]
20151118-06:15:21: [INFO]: rest call info: POST https://mn-dev-ucsb-2.test.dataone.org/metacat/d1/mn/v2/object; MMP message has: ParamPart:pid = testUpdate_2015321221519819; FilePart:object = /tmp/mmp.output.7592806229293415883.tmp (17181 bytes); FilePart:sysmeta = /tmp/mmp.output.7170838738645531339.tmp (953 bytes);  [org.dataone.client.rest.RestClient]
20151118-06:15:21: [INFO]: object created.  pid = testUpdate_2015321221519819 [org.dataone.integration.ContextAwareTestCaseDataone]
20151118-06:15:21: [INFO]: rest call info: GET https://mn-dev-ucsb-2.test.dataone.org/metacat/d1/mn/v2/meta/testUpdate_2015321221519819 [org.dataone.client.rest.RestClient]
20151118-06:15:23: [INFO]: rest call info: PUT https://mn-dev-ucsb-2.test.dataone.org/metacat/d1/mn/v2/object/testUpdate_2015321221519819; MMP message has: ParamPart:newPid = testUpdate_2015321221521910; FilePart:object = /tmp/mmp.output.3369817346198747190.tmp (684336 bytes); FilePart:sysmeta = /tmp/mmp.output.720459028107056868.tmp (885 bytes);  [org.dataone.client.rest.RestClient]
20151118-06:15:23: [INFO]: rest call info: GET https://mn-dev-ucsb-2.test.dataone.org/metacat/d1/mn/v2/meta/testUpdate_2015321221521910 [org.dataone.client.rest.RestClient]
20151118-06:15:24: [INFO]: rest call info: GET https://mn-dev-ucsb-2.test.dataone.org/metacat/d1/mn/v2/meta/testUpdate_2015321221519819 [org.dataone.client.rest.RestClient]
20151118-06:15:24: [INFO]: rest call info: GET https://mn-dev-ucsb-2.test.dataone.org/metacat/d1/mn/v2/object?fromDate=2015-11-18T06:15:20.026%2B00:00 [org.dataone.client.rest.RestClient]
20151118-06:15:24: [INFO]: 
***************** running test for testUpdate() vs. node: https://mn-dev-unm-2.test.dataone.org/metacat/d1/mn/v2 ***************** [org.dataone.integration.ContextAwareTestCaseDataone]
20151118-06:15:24: [INFO]: certificate directory: /etc/dataone/client/testClientCerts/ [org.dataone.integration.ContextAwareTestCaseDataone]
20151118-06:15:24: [INFO]: certificate filename: cnDevUNM2 [org.dataone.integration.ContextAwareTestCaseDataone]
20151118-06:15:24: [INFO]: client setup as Subject: CN=urn:node:cnDevUNM2,DC=dataone,DC=org [org.dataone.integration.ContextAwareTestCaseDataone]
20151118-06:15:24: [INFO]: creating a test object.  pid = testUpdate_2015321221524796 on https://mn-dev-unm-2.test.dataone.org/metacat/d1/mn/v2 [org.dataone.integration.ContextAwareTestCaseDataone]
20151118-06:15:24: [INFO]: SystemMetadata for pid: testUpdate_2015321221524796
<?xml version="1.0" encoding="UTF-8"?><d1_v2.0:systemMetadata xmlns:d1_v2.0="http://ns.dataone.org/service/types/v2.0" xmlns:d1="http://ns.dataone.org/service/types/v1"><serialVersion>1</serialVersion><identifier>testUpdate_2015321221524796</identifier><formatId>eml://ecoinformatics.org/eml-2.0.1</formatId><size>17181</size><checksum algorithm="MD5">03ce09c6b4c3efc1681f3023402998a2</checksum><submitter>CN=urn:node:cnDevUNM2,DC=dataone,DC=org</submitter><rightsHolder>CN=testRightsHolder,DC=dataone,DC=org</rightsHolder><accessPolicy><allow><subject>CN=testRightsHolder,DC=dataone,DC=org</subject><permission>changePermission</permission></allow></accessPolicy><dateUploaded>2015-11-18T06:15:24.812+00:00</dateUploaded><dateSysMetadataModified>2015-11-18T06:15:24.812+00:00</dateSysMetadataModified><originMemberNode>urn:node:mnDevUNM2</originMemberNode><authoritativeMemberNode>urn:node:mnDevUNM2</authoritativeMemberNode></d1_v2.0:systemMetadata> [org.dataone.integration.ContextAwareTestCaseDataone]
20151118-06:15:25: [INFO]: rest call info: POST https://mn-dev-unm-2.test.dataone.org/metacat/d1/mn/v2/object; MMP message has: ParamPart:pid = testUpdate_2015321221524796; FilePart:object = /tmp/mmp.output.5545301086114382040.tmp (17181 bytes); FilePart:sysmeta = /tmp/mmp.output.3858072261047921635.tmp (951 bytes);  [org.dataone.client.rest.RestClient]
20151118-06:15:25: [INFO]: object created.  pid = testUpdate_2015321221524796 [org.dataone.integration.ContextAwareTestCaseDataone]
20151118-06:15:25: [INFO]: rest call info: GET https://mn-dev-unm-2.test.dataone.org/metacat/d1/mn/v2/meta/testUpdate_2015321221524796 [org.dataone.client.rest.RestClient]
20151118-06:15:26: [INFO]: rest call info: PUT https://mn-dev-unm-2.test.dataone.org/metacat/d1/mn/v2/object/testUpdate_2015321221524796; MMP message has: ParamPart:newPid = testUpdate_2015321221525925; FilePart:object = /tmp/mmp.output.4881920746268039871.tmp (684336 bytes); FilePart:sysmeta = /tmp/mmp.output.5431601555308969451.tmp (883 bytes);  [org.dataone.client.rest.RestClient]
20151118-06:15:26: [INFO]: rest call info: GET https://mn-dev-unm-2.test.dataone.org/metacat/d1/mn/v2/meta/testUpdate_2015321221525925 [org.dataone.client.rest.RestClient]
20151118-06:15:26: [INFO]: rest call info: GET https://mn-dev-unm-2.test.dataone.org/metacat/d1/mn/v2/meta/testUpdate_2015321221524796 [org.dataone.client.rest.RestClient]
20151118-06:15:26: [INFO]: rest call info: GET https://mn-dev-unm-2.test.dataone.org/metacat/d1/mn/v2/object?fromDate=2015-11-18T06:15:27.220%2B00:00 [org.dataone.client.rest.RestClient]
20151118-06:15:26: [INFO]: **************************************************** [org.dataone.integration.ContextAwareTestCaseDataone]
20151118-06:15:26: [INFO]: ***  context label:   DEV2 [org.dataone.integration.ContextAwareTestCaseDataone]
20151118-06:15:26: [INFO]: **************************************************** [org.dataone.integration.ContextAwareTestCaseDataone]
20151118-06:15:26: [INFO]: **************************************************** [org.dataone.integration.ContextAwareTestCaseDataone]
20151118-06:15:27: [INFO]: rest call info: GET https://mn-dev-ucsb-1.test.dataone.org/metacat/d1/mn/v2/monitor/ping [org.dataone.client.rest.RestClient]
20151118-06:15:27: [INFO]: MN excluded from test: https://mn-dev-ucsb-1.test.dataone.org/metacat/d1/mn [org.dataone.integration.ContextAwareTestCaseDataone]
20151118-06:15:27: [INFO]: rest call info: GET https://mn-dev-ucsb-2.test.dataone.org/metacat/d1/mn/v2/monitor/ping [org.dataone.client.rest.RestClient]
20151118-06:15:27: [INFO]: MN included in test: https://mn-dev-ucsb-2.test.dataone.org/metacat/d1/mn [org.dataone.integration.ContextAwareTestCaseDataone]
20151118-06:15:27: [INFO]: rest call info: GET https://mn-dev-unm-1.test.dataone.org/metacat/d1/mn/v2/monitor/ping [org.dataone.client.rest.RestClient]
20151118-06:15:27: [INFO]: MN excluded from test: https://mn-dev-unm-1.test.dataone.org/metacat/d1/mn [org.dataone.integration.ContextAwareTestCaseDataone]
20151118-06:15:27: [INFO]: rest call info: GET https://mn-dev-unm-2.test.dataone.org/metacat/d1/mn/v2/monitor/ping [org.dataone.client.rest.RestClient]
20151118-06:15:27: [INFO]: MN included in test: https://mn-dev-unm-2.test.dataone.org/metacat/d1/mn [org.dataone.integration.ContextAwareTestCaseDataone]
20151118-06:15:27: [INFO]: 
***************** running test for testUpdate_badObsoletedByInfo() vs. node: https://mn-dev-ucsb-2.test.dataone.org/metacat/d1/mn/v2 ***************** [org.dataone.integration.ContextAwareTestCaseDataone]
20151118-06:15:27: [INFO]: certificate directory: /etc/dataone/client/testClientCerts/ [org.dataone.integration.ContextAwareTestCaseDataone]
20151118-06:15:27: [INFO]: certificate filename: cnDevUNM2 [org.dataone.integration.ContextAwareTestCaseDataone]
20151118-06:15:27: [INFO]: client setup as Subject: CN=urn:node:cnDevUNM2,DC=dataone,DC=org [org.dataone.integration.ContextAwareTestCaseDataone]
20151118-06:15:27: [INFO]: creating a test object.  pid = testUpdate_2015321221527250 on https://mn-dev-ucsb-2.test.dataone.org/metacat/d1/mn/v2 [org.dataone.integration.ContextAwareTestCaseDataone]
20151118-06:15:27: [INFO]: SystemMetadata for pid: testUpdate_2015321221527250
<?xml version="1.0" encoding="UTF-8"?><d1_v2.0:systemMetadata xmlns:d1_v2.0="http://ns.dataone.org/service/types/v2.0" xmlns:d1="http://ns.dataone.org/service/types/v1"><serialVersion>1</serialVersion><identifier>testUpdate_2015321221527250</identifier><formatId>eml://ecoinformatics.org/eml-2.0.1</formatId><size>17181</size><checksum algorithm="MD5">03ce09c6b4c3efc1681f3023402998a2</checksum><submitter>CN=urn:node:cnDevUNM2,DC=dataone,DC=org</submitter><rightsHolder>CN=testRightsHolder,DC=dataone,DC=org</rightsHolder><accessPolicy><allow><subject>CN=testRightsHolder,DC=dataone,DC=org</subject><permission>changePermission</permission></allow></accessPolicy><dateUploaded>2015-11-18T06:15:27.266+00:00</dateUploaded><dateSysMetadataModified>2015-11-18T06:15:27.266+00:00</dateSysMetadataModified><originMemberNode>urn:node:mnDevUCSB2</originMemberNode><authoritativeMemberNode>urn:node:mnDevUCSB2</authoritativeMemberNode></d1_v2.0:systemMetadata> [org.dataone.integration.ContextAwareTestCaseDataone]
20151118-06:15:28: [INFO]: rest call info: POST https://mn-dev-ucsb-2.test.dataone.org/metacat/d1/mn/v2/object; MMP message has: ParamPart:pid = testUpdate_2015321221527250; FilePart:object = /tmp/mmp.output.1092153661154852769.tmp (17181 bytes); FilePart:sysmeta = /tmp/mmp.output.3296847511140580865.tmp (953 bytes);  [org.dataone.client.rest.RestClient]
20151118-06:15:28: [INFO]: object created.  pid = testUpdate_2015321221527250 [org.dataone.integration.ContextAwareTestCaseDataone]
20151118-06:15:29: [INFO]: rest call info: GET https://mn-dev-ucsb-2.test.dataone.org/metacat/d1/mn/v2/meta/testUpdate_2015321221527250 [org.dataone.client.rest.RestClient]
20151118-06:15:30: [INFO]: rest call info: PUT https://mn-dev-ucsb-2.test.dataone.org/metacat/d1/mn/v2/object/testUpdate_2015321221527250; MMP message has: ParamPart:newPid = mNodeTier3TestUpdate2015321221529420; FilePart:object = /tmp/mmp.output.2951106743131793396.tmp (684336 bytes); FilePart:sysmeta = /tmp/mmp.output.8861977169807650597.tmp (948 bytes);  [org.dataone.client.rest.RestClient]
20151118-06:15:30: [INFO]: 
***************** running test for testUpdate_badObsoletedByInfo() vs. node: https://mn-dev-unm-2.test.dataone.org/metacat/d1/mn/v2 ***************** [org.dataone.integration.ContextAwareTestCaseDataone]
20151118-06:15:30: [INFO]: certificate directory: /etc/dataone/client/testClientCerts/ [org.dataone.integration.ContextAwareTestCaseDataone]
20151118-06:15:30: [INFO]: certificate filename: cnDevUNM2 [org.dataone.integration.ContextAwareTestCaseDataone]
20151118-06:15:30: [INFO]: client setup as Subject: CN=urn:node:cnDevUNM2,DC=dataone,DC=org [org.dataone.integration.ContextAwareTestCaseDataone]
20151118-06:15:30: [INFO]: creating a test object.  pid = testUpdate_2015321221530469 on https://mn-dev-unm-2.test.dataone.org/metacat/d1/mn/v2 [org.dataone.integration.ContextAwareTestCaseDataone]
20151118-06:15:30: [INFO]: SystemMetadata for pid: testUpdate_2015321221530469
<?xml version="1.0" encoding="UTF-8"?><d1_v2.0:systemMetadata xmlns:d1_v2.0="http://ns.dataone.org/service/types/v2.0" xmlns:d1="http://ns.dataone.org/service/types/v1"><serialVersion>1</serialVersion><identifier>testUpdate_2015321221530469</identifier><formatId>eml://ecoinformatics.org/eml-2.0.1</formatId><size>17181</size><checksum algorithm="MD5">03ce09c6b4c3efc1681f3023402998a2</checksum><submitter>CN=urn:node:cnDevUNM2,DC=dataone,DC=org</submitter><rightsHolder>CN=testRightsHolder,DC=dataone,DC=org</rightsHolder><accessPolicy><allow><subject>CN=testRightsHolder,DC=dataone,DC=org</subject><permission>changePermission</permission></allow></accessPolicy><dateUploaded>2015-11-18T06:15:30.485+00:00</dateUploaded><dateSysMetadataModified>2015-11-18T06:15:30.485+00:00</dateSysMetadataModified><originMemberNode>urn:node:mnDevUNM2</originMemberNode><authoritativeMemberNode>urn:node:mnDevUNM2</authoritativeMemberNode></d1_v2.0:systemMetadata> [org.dataone.integration.ContextAwareTestCaseDataone]
20151118-06:15:31: [INFO]: rest call info: POST https://mn-dev-unm-2.test.dataone.org/metacat/d1/mn/v2/object; MMP message has: ParamPart:pid = testUpdate_2015321221530469; FilePart:object = /tmp/mmp.output.5921003590510177279.tmp (17181 bytes); FilePart:sysmeta = /tmp/mmp.output.2179554484051963847.tmp (951 bytes);  [org.dataone.client.rest.RestClient]
20151118-06:15:31: [INFO]: object created.  pid = testUpdate_2015321221530469 [org.dataone.integration.ContextAwareTestCaseDataone]
20151118-06:15:31: [INFO]: rest call info: GET https://mn-dev-unm-2.test.dataone.org/metacat/d1/mn/v2/meta/testUpdate_2015321221530469 [org.dataone.client.rest.RestClient]
20151118-06:15:31: [INFO]: rest call info: PUT https://mn-dev-unm-2.test.dataone.org/metacat/d1/mn/v2/object/testUpdate_2015321221530469; MMP message has: ParamPart:newPid = mNodeTier3TestUpdate2015321221531583; FilePart:object = /tmp/mmp.output.3371265833950010354.tmp (684336 bytes); FilePart:sysmeta = /tmp/mmp.output.1133065298637427902.tmp (946 bytes);  [org.dataone.client.rest.RestClient]
20151118-06:15:31: [INFO]: **************************************************** [org.dataone.integration.ContextAwareTestCaseDataone]
20151118-06:15:31: [INFO]: ***  context label:   DEV2 [org.dataone.integration.ContextAwareTestCaseDataone]
20151118-06:15:31: [INFO]: **************************************************** [org.dataone.integration.ContextAwareTestCaseDataone]
20151118-06:15:31: [INFO]: **************************************************** [org.dataone.integration.ContextAwareTestCaseDataone]
20151118-06:15:31: [INFO]: rest call info: GET https://mn-dev-ucsb-1.test.dataone.org/metacat/d1/mn/v2/monitor/ping [org.dataone.client.rest.RestClient]
20151118-06:15:31: [INFO]: MN excluded from test: https://mn-dev-ucsb-1.test.dataone.org/metacat/d1/mn [org.dataone.integration.ContextAwareTestCaseDataone]
20151118-06:15:32: [INFO]: rest call info: GET https://mn-dev-ucsb-2.test.dataone.org/metacat/d1/mn/v2/monitor/ping [org.dataone.client.rest.RestClient]
20151118-06:15:32: [INFO]: MN included in test: https://mn-dev-ucsb-2.test.dataone.org/metacat/d1/mn [org.dataone.integration.ContextAwareTestCaseDataone]
20151118-06:15:32: [INFO]: rest call info: GET https://mn-dev-unm-1.test.dataone.org/metacat/d1/mn/v2/monitor/ping [org.dataone.client.rest.RestClient]
20151118-06:15:32: [INFO]: MN excluded from test: https://mn-dev-unm-1.test.dataone.org/metacat/d1/mn [org.dataone.integration.ContextAwareTestCaseDataone]
20151118-06:15:32: [INFO]: rest call info: GET https://mn-dev-unm-2.test.dataone.org/metacat/d1/mn/v2/monitor/ping [org.dataone.client.rest.RestClient]
20151118-06:15:32: [INFO]: MN included in test: https://mn-dev-unm-2.test.dataone.org/metacat/d1/mn [org.dataone.integration.ContextAwareTestCaseDataone]
20151118-06:15:32: [INFO]: 
***************** running test for testUpdate_badObsoletesInfo() vs. node: https://mn-dev-ucsb-2.test.dataone.org/metacat/d1/mn/v2 ***************** [org.dataone.integration.ContextAwareTestCaseDataone]
20151118-06:15:32: [INFO]: certificate directory: /etc/dataone/client/testClientCerts/ [org.dataone.integration.ContextAwareTestCaseDataone]
20151118-06:15:32: [INFO]: certificate filename: cnDevUNM2 [org.dataone.integration.ContextAwareTestCaseDataone]
20151118-06:15:32: [INFO]: client setup as Subject: CN=urn:node:cnDevUNM2,DC=dataone,DC=org [org.dataone.integration.ContextAwareTestCaseDataone]
20151118-06:15:32: [INFO]: creating a test object.  pid = testUpdate_2015321221532133 on https://mn-dev-ucsb-2.test.dataone.org/metacat/d1/mn/v2 [org.dataone.integration.ContextAwareTestCaseDataone]
20151118-06:15:32: [INFO]: SystemMetadata for pid: testUpdate_2015321221532133
<?xml version="1.0" encoding="UTF-8"?><d1_v2.0:systemMetadata xmlns:d1_v2.0="http://ns.dataone.org/service/types/v2.0" xmlns:d1="http://ns.dataone.org/service/types/v1"><serialVersion>1</serialVersion><identifier>testUpdate_2015321221532133</identifier><formatId>eml://ecoinformatics.org/eml-2.0.1</formatId><size>17181</size><checksum algorithm="MD5">03ce09c6b4c3efc1681f3023402998a2</checksum><submitter>CN=urn:node:cnDevUNM2,DC=dataone,DC=org</submitter><rightsHolder>CN=testRightsHolder,DC=dataone,DC=org</rightsHolder><accessPolicy><allow><subject>CN=testRightsHolder,DC=dataone,DC=org</subject><permission>changePermission</permission></allow></accessPolicy><dateUploaded>2015-11-18T06:15:32.148+00:00</dateUploaded><dateSysMetadataModified>2015-11-18T06:15:32.148+00:00</dateSysMetadataModified><originMemberNode>urn:node:mnDevUCSB2</originMemberNode><authoritativeMemberNode>urn:node:mnDevUCSB2</authoritativeMemberNode></d1_v2.0:systemMetadata> [org.dataone.integration.ContextAwareTestCaseDataone]
20151118-06:15:33: [INFO]: rest call info: POST https://mn-dev-ucsb-2.test.dataone.org/metacat/d1/mn/v2/object; MMP message has: ParamPart:pid = testUpdate_2015321221532133; FilePart:object = /tmp/mmp.output.4362871541076686515.tmp (17181 bytes); FilePart:sysmeta = /tmp/mmp.output.8372738123140844745.tmp (953 bytes);  [org.dataone.client.rest.RestClient]
20151118-06:15:33: [INFO]: object created.  pid = testUpdate_2015321221532133 [org.dataone.integration.ContextAwareTestCaseDataone]
20151118-06:15:34: [INFO]: rest call info: GET https://mn-dev-ucsb-2.test.dataone.org/metacat/d1/mn/v2/meta/testUpdate_2015321221532133 [org.dataone.client.rest.RestClient]
20151118-06:15:36: [INFO]: rest call info: PUT https://mn-dev-ucsb-2.test.dataone.org/metacat/d1/mn/v2/object/testUpdate_2015321221532133; MMP message has: ParamPart:newPid = testUpdate_badObsoletesInfo_2015321221534401; FilePart:object = /tmp/mmp.output.4805531452725786033.tmp (684336 bytes); FilePart:sysmeta = /tmp/mmp.output.7754529487706493244.tmp (932 bytes);  [org.dataone.client.rest.RestClient]
20151118-06:15:36: [INFO]: 
***************** running test for testUpdate_badObsoletesInfo() vs. node: https://mn-dev-unm-2.test.dataone.org/metacat/d1/mn/v2 ***************** [org.dataone.integration.ContextAwareTestCaseDataone]
20151118-06:15:36: [INFO]: certificate directory: /etc/dataone/client/testClientCerts/ [org.dataone.integration.ContextAwareTestCaseDataone]
20151118-06:15:36: [INFO]: certificate filename: cnDevUNM2 [org.dataone.integration.ContextAwareTestCaseDataone]
20151118-06:15:36: [INFO]: client setup as Subject: CN=urn:node:cnDevUNM2,DC=dataone,DC=org [org.dataone.integration.ContextAwareTestCaseDataone]
20151118-06:15:36: [INFO]: creating a test object.  pid = testUpdate_2015321221536649 on https://mn-dev-unm-2.test.dataone.org/metacat/d1/mn/v2 [org.dataone.integration.ContextAwareTestCaseDataone]
20151118-06:15:36: [INFO]: SystemMetadata for pid: testUpdate_2015321221536649
<?xml version="1.0" encoding="UTF-8"?><d1_v2.0:systemMetadata xmlns:d1_v2.0="http://ns.dataone.org/service/types/v2.0" xmlns:d1="http://ns.dataone.org/service/types/v1"><serialVersion>1</serialVersion><identifier>testUpdate_2015321221536649</identifier><formatId>eml://ecoinformatics.org/eml-2.0.1</formatId><size>17181</size><checksum algorithm="MD5">03ce09c6b4c3efc1681f3023402998a2</checksum><submitter>CN=urn:node:cnDevUNM2,DC=dataone,DC=org</submitter><rightsHolder>CN=testRightsHolder,DC=dataone,DC=org</rightsHolder><accessPolicy><allow><subject>CN=testRightsHolder,DC=dataone,DC=org</subject><permission>changePermission</permission></allow></accessPolicy><dateUploaded>2015-11-18T06:15:36.664+00:00</dateUploaded><dateSysMetadataModified>2015-11-18T06:15:36.664+00:00</dateSysMetadataModified><originMemberNode>urn:node:mnDevUNM2</originMemberNode><authoritativeMemberNode>urn:node:mnDevUNM2</authoritativeMemberNode></d1_v2.0:systemMetadata> [org.dataone.integration.ContextAwareTestCaseDataone]
20151118-06:15:37: [INFO]: rest call info: POST https://mn-dev-unm-2.test.dataone.org/metacat/d1/mn/v2/object; MMP message has: ParamPart:pid = testUpdate_2015321221536649; FilePart:object = /tmp/mmp.output.6774686044999969159.tmp (17181 bytes); FilePart:sysmeta = /tmp/mmp.output.8830416509728046949.tmp (951 bytes);  [org.dataone.client.rest.RestClient]
20151118-06:15:37: [INFO]: object created.  pid = testUpdate_2015321221536649 [org.dataone.integration.ContextAwareTestCaseDataone]
20151118-06:15:37: [INFO]: rest call info: GET https://mn-dev-unm-2.test.dataone.org/metacat/d1/mn/v2/meta/testUpdate_2015321221536649 [org.dataone.client.rest.RestClient]
20151118-06:15:37: [INFO]: rest call info: PUT https://mn-dev-unm-2.test.dataone.org/metacat/d1/mn/v2/object/testUpdate_2015321221536649; MMP message has: ParamPart:newPid = testUpdate_badObsoletesInfo_2015321221537689; FilePart:object = /tmp/mmp.output.4509562739496427270.tmp (684336 bytes); FilePart:sysmeta = /tmp/mmp.output.7348962229690291316.tmp (930 bytes);  [org.dataone.client.rest.RestClient]
20151118-06:15:37: [INFO]: **************************************************** [org.dataone.integration.ContextAwareTestCaseDataone]
20151118-06:15:37: [INFO]: ***  context label:   DEV2 [org.dataone.integration.ContextAwareTestCaseDataone]
20151118-06:15:37: [INFO]: **************************************************** [org.dataone.integration.ContextAwareTestCaseDataone]
20151118-06:15:37: [INFO]: **************************************************** [org.dataone.integration.ContextAwareTestCaseDataone]
20151118-06:15:38: [INFO]: rest call info: GET https://mn-dev-ucsb-1.test.dataone.org/metacat/d1/mn/v2/monitor/ping [org.dataone.client.rest.RestClient]
20151118-06:15:38: [INFO]: MN excluded from test: https://mn-dev-ucsb-1.test.dataone.org/metacat/d1/mn [org.dataone.integration.ContextAwareTestCaseDataone]
20151118-06:15:38: [INFO]: rest call info: GET https://mn-dev-ucsb-2.test.dataone.org/metacat/d1/mn/v2/monitor/ping [org.dataone.client.rest.RestClient]
20151118-06:15:38: [INFO]: MN included in test: https://mn-dev-ucsb-2.test.dataone.org/metacat/d1/mn [org.dataone.integration.ContextAwareTestCaseDataone]
20151118-06:15:38: [INFO]: rest call info: GET https://mn-dev-unm-1.test.dataone.org/metacat/d1/mn/v2/monitor/ping [org.dataone.client.rest.RestClient]
20151118-06:15:38: [INFO]: MN excluded from test: https://mn-dev-unm-1.test.dataone.org/metacat/d1/mn [org.dataone.integration.ContextAwareTestCaseDataone]
20151118-06:15:38: [INFO]: rest call info: GET https://mn-dev-unm-2.test.dataone.org/metacat/d1/mn/v2/monitor/ping [org.dataone.client.rest.RestClient]
20151118-06:15:38: [INFO]: MN included in test: https://mn-dev-unm-2.test.dataone.org/metacat/d1/mn [org.dataone.integration.ContextAwareTestCaseDataone]
20151118-06:15:38: [INFO]: 
***************** running test for testUpdate_NoCert() vs. node: https://mn-dev-ucsb-2.test.dataone.org/metacat/d1/mn/v2 ***************** [org.dataone.integration.ContextAwareTestCaseDataone]
20151118-06:15:39: [INFO]: rest call info: POST https://mn-dev-ucsb-2.test.dataone.org/metacat/d1/mn/v2/object; MMP message has: ParamPart:pid = mNodeTier3TestUpdate2015321221538266; FilePart:object = /tmp/mmp.output.4461207568104645011.tmp (684336 bytes); FilePart:sysmeta = /tmp/mmp.output.3628285495124480058.tmp (872 bytes);  [org.dataone.client.rest.RestClient]
20151118-06:15:39: [INFO]: rest call info: PUT https://mn-dev-ucsb-2.test.dataone.org/metacat/d1/mn/v2/object/mNodeTier3TestUpdate2015321221538266; MMP message has: ParamPart:newPid = mNodeTier3TestUpdate2015321221539384; FilePart:object = /tmp/mmp.output.3087245400632015954.tmp (684336 bytes); FilePart:sysmeta = /tmp/mmp.output.8224472531137781419.tmp (872 bytes);  [org.dataone.client.rest.RestClient]
20151118-06:15:39: [INFO]: 
***************** running test for testUpdate_NoCert() vs. node: https://mn-dev-unm-2.test.dataone.org/metacat/d1/mn/v2 ***************** [org.dataone.integration.ContextAwareTestCaseDataone]
20151118-06:15:40: [INFO]: rest call info: POST https://mn-dev-unm-2.test.dataone.org/metacat/d1/mn/v2/object; MMP message has: ParamPart:pid = mNodeTier3TestUpdate2015321221539892; FilePart:object = /tmp/mmp.output.1185912007043094829.tmp (684336 bytes); FilePart:sysmeta = /tmp/mmp.output.6856819316833411788.tmp (872 bytes);  [org.dataone.client.rest.RestClient]
20151118-06:15:40: [INFO]: rest call info: PUT https://mn-dev-unm-2.test.dataone.org/metacat/d1/mn/v2/object/mNodeTier3TestUpdate2015321221539892; MMP message has: ParamPart:newPid = mNodeTier3TestUpdate2015321221540170; FilePart:object = /tmp/mmp.output.8848344932216385004.tmp (684336 bytes); FilePart:sysmeta = /tmp/mmp.output.2323128333049932228.tmp (872 bytes);  [org.dataone.client.rest.RestClient]
20151118-06:15:40: [INFO]: **************************************************** [org.dataone.integration.ContextAwareTestCaseDataone]
20151118-06:15:40: [INFO]: ***  context label:   DEV2 [org.dataone.integration.ContextAwareTestCaseDataone]
20151118-06:15:40: [INFO]: **************************************************** [org.dataone.integration.ContextAwareTestCaseDataone]
20151118-06:15:40: [INFO]: **************************************************** [org.dataone.integration.ContextAwareTestCaseDataone]
20151118-06:15:40: [INFO]: rest call info: GET https://mn-dev-ucsb-1.test.dataone.org/metacat/d1/mn/v2/monitor/ping [org.dataone.client.rest.RestClient]
20151118-06:15:40: [INFO]: MN excluded from test: https://mn-dev-ucsb-1.test.dataone.org/metacat/d1/mn [org.dataone.integration.ContextAwareTestCaseDataone]
20151118-06:15:40: [INFO]: rest call info: GET https://mn-dev-ucsb-2.test.dataone.org/metacat/d1/mn/v2/monitor/ping [org.dataone.client.rest.RestClient]
20151118-06:15:40: [INFO]: MN included in test: https://mn-dev-ucsb-2.test.dataone.org/metacat/d1/mn [org.dataone.integration.ContextAwareTestCaseDataone]
20151118-06:15:40: [INFO]: rest call info: GET https://mn-dev-unm-1.test.dataone.org/metacat/d1/mn/v2/monitor/ping [org.dataone.client.rest.RestClient]
20151118-06:15:40: [INFO]: MN excluded from test: https://mn-dev-unm-1.test.dataone.org/metacat/d1/mn [org.dataone.integration.ContextAwareTestCaseDataone]
20151118-06:15:40: [INFO]: rest call info: GET https://mn-dev-unm-2.test.dataone.org/metacat/d1/mn/v2/monitor/ping [org.dataone.client.rest.RestClient]
20151118-06:15:40: [INFO]: MN included in test: https://mn-dev-unm-2.test.dataone.org/metacat/d1/mn [org.dataone.integration.ContextAwareTestCaseDataone]
20151118-06:15:40: [INFO]: certificate directory: /etc/dataone/client/testClientCerts/ [org.dataone.integration.ContextAwareTestCaseDataone]
20151118-06:15:40: [INFO]: certificate filename: testSubmitter [org.dataone.integration.ContextAwareTestCaseDataone]
20151118-06:15:40: [INFO]: client setup as Subject: CN=testSubmitter,DC=dataone,DC=org [org.dataone.integration.ContextAwareTestCaseDataone]
20151118-06:15:40: [INFO]: 
***************** running test for testUpdate_NoRightsOnObsoleted() vs. node: https://mn-dev-ucsb-2.test.dataone.org/metacat/d1/mn/v2 ***************** [org.dataone.integration.ContextAwareTestCaseDataone]
20151118-06:15:42: [INFO]: rest call info: POST https://mn-dev-ucsb-2.test.dataone.org/metacat/d1/mn/v2/object; MMP message has: ParamPart:pid = mNodeTier3TestUpdate2015321221540585; FilePart:object = /tmp/mmp.output.8221887051126074358.tmp (684336 bytes); FilePart:sysmeta = /tmp/mmp.output.2578763558749422466.tmp (872 bytes);  [org.dataone.client.rest.RestClient]
20151118-06:15:44: [INFO]: rest call info: PUT https://mn-dev-ucsb-2.test.dataone.org/metacat/d1/mn/v2/object/mNodeTier3TestUpdate2015321221540585; MMP message has: ParamPart:newPid = mNodeTier3TestUpdate2015321221542964; FilePart:object = /tmp/mmp.output.7221089518340440442.tmp (684336 bytes); FilePart:sysmeta = /tmp/mmp.output.7854647776140967936.tmp (866 bytes);  [org.dataone.client.rest.RestClient]
20151118-06:15:44: [INFO]: rest call info: GET https://mn-dev-ucsb-2.test.dataone.org/metacat/d1/mn/v2/meta/mNodeTier3TestUpdate2015321221540585 [org.dataone.client.rest.RestClient]
20151118-06:15:44: [INFO]: 
***************** running test for testUpdate_NoRightsOnObsoleted() vs. node: https://mn-dev-unm-2.test.dataone.org/metacat/d1/mn/v2 ***************** [org.dataone.integration.ContextAwareTestCaseDataone]
20151118-06:15:45: [INFO]: rest call info: POST https://mn-dev-unm-2.test.dataone.org/metacat/d1/mn/v2/object; MMP message has: ParamPart:pid = mNodeTier3TestUpdate2015321221544922; FilePart:object = /tmp/mmp.output.7944236651007187114.tmp (684336 bytes); FilePart:sysmeta = /tmp/mmp.output.3680497121757391277.tmp (872 bytes);  [org.dataone.client.rest.RestClient]
20151118-06:15:45: [INFO]: rest call info: PUT https://mn-dev-unm-2.test.dataone.org/metacat/d1/mn/v2/object/mNodeTier3TestUpdate2015321221544922; MMP message has: ParamPart:newPid = mNodeTier3TestUpdate2015321221545432; FilePart:object = /tmp/mmp.output.4102654547365872004.tmp (684336 bytes); FilePart:sysmeta = /tmp/mmp.output.8256136103369656520.tmp (866 bytes);  [org.dataone.client.rest.RestClient]
20151118-06:15:46: [INFO]: rest call info: GET https://mn-dev-unm-2.test.dataone.org/metacat/d1/mn/v2/meta/mNodeTier3TestUpdate2015321221544922 [org.dataone.client.rest.RestClient]
20151118-06:15:46: [INFO]: **************************************************** [org.dataone.integration.ContextAwareTestCaseDataone]
20151118-06:15:46: [INFO]: ***  context label:   DEV2 [org.dataone.integration.ContextAwareTestCaseDataone]
20151118-06:15:46: [INFO]: **************************************************** [org.dataone.integration.ContextAwareTestCaseDataone]
20151118-06:15:46: [INFO]: **************************************************** [org.dataone.integration.ContextAwareTestCaseDataone]
20151118-06:15:46: [INFO]: rest call info: GET https://mn-dev-ucsb-1.test.dataone.org/metacat/d1/mn/v2/monitor/ping [org.dataone.client.rest.RestClient]
20151118-06:15:46: [INFO]: MN excluded from test: https://mn-dev-ucsb-1.test.dataone.org/metacat/d1/mn [org.dataone.integration.ContextAwareTestCaseDataone]
20151118-06:15:46: [INFO]: rest call info: GET https://mn-dev-ucsb-2.test.dataone.org/metacat/d1/mn/v2/monitor/ping [org.dataone.client.rest.RestClient]
20151118-06:15:46: [INFO]: MN included in test: https://mn-dev-ucsb-2.test.dataone.org/metacat/d1/mn [org.dataone.integration.ContextAwareTestCaseDataone]
20151118-06:15:46: [INFO]: rest call info: GET https://mn-dev-unm-1.test.dataone.org/metacat/d1/mn/v2/monitor/ping [org.dataone.client.rest.RestClient]
20151118-06:15:46: [INFO]: MN excluded from test: https://mn-dev-unm-1.test.dataone.org/metacat/d1/mn [org.dataone.integration.ContextAwareTestCaseDataone]
20151118-06:15:46: [INFO]: rest call info: GET https://mn-dev-unm-2.test.dataone.org/metacat/d1/mn/v2/monitor/ping [org.dataone.client.rest.RestClient]
20151118-06:15:46: [INFO]: MN included in test: https://mn-dev-unm-2.test.dataone.org/metacat/d1/mn [org.dataone.integration.ContextAwareTestCaseDataone]
20151118-06:15:46: [INFO]: 
***************** running test for testArchive() vs. node: https://mn-dev-ucsb-2.test.dataone.org/metacat/d1/mn/v2 ***************** [org.dataone.integration.ContextAwareTestCaseDataone]
20151118-06:15:47: [INFO]: rest call info: POST https://mn-dev-ucsb-2.test.dataone.org/metacat/d1/mn/v2/object; MMP message has: ParamPart:pid = mNodeTier3TestDelete2015321221546811; FilePart:object = /tmp/mmp.output.8386107188559814011.tmp (684336 bytes); FilePart:sysmeta = /tmp/mmp.output.4909158675362529469.tmp (872 bytes);  [org.dataone.client.rest.RestClient]
20151118-06:15:48: [INFO]: rest call info: PUT https://mn-dev-ucsb-2.test.dataone.org/metacat/d1/mn/v2/archive/mNodeTier3TestDelete2015321221546811; MMP entity is null [org.dataone.client.rest.RestClient]
20151118-06:15:49: [INFO]: rest call info: GET https://mn-dev-ucsb-2.test.dataone.org/metacat/d1/mn/v2/meta/mNodeTier3TestDelete2015321221546811 [org.dataone.client.rest.RestClient]
20151118-06:15:49: [INFO]: 
***************** running test for testArchive() vs. node: https://mn-dev-unm-2.test.dataone.org/metacat/d1/mn/v2 ***************** [org.dataone.integration.ContextAwareTestCaseDataone]
20151118-06:15:49: [INFO]: rest call info: POST https://mn-dev-unm-2.test.dataone.org/metacat/d1/mn/v2/object; MMP message has: ParamPart:pid = mNodeTier3TestDelete2015321221549255; FilePart:object = /tmp/mmp.output.5059531837253014100.tmp (684336 bytes); FilePart:sysmeta = /tmp/mmp.output.8550881495860049553.tmp (872 bytes);  [org.dataone.client.rest.RestClient]
20151118-06:15:49: [INFO]: rest call info: PUT https://mn-dev-unm-2.test.dataone.org/metacat/d1/mn/v2/archive/mNodeTier3TestDelete2015321221549255; MMP entity is null [org.dataone.client.rest.RestClient]
20151118-06:15:49: [INFO]: rest call info: GET https://mn-dev-unm-2.test.dataone.org/metacat/d1/mn/v2/meta/mNodeTier3TestDelete2015321221549255 [org.dataone.client.rest.RestClient]
20151118-06:15:49: [INFO]: **************************************************** [org.dataone.integration.ContextAwareTestCaseDataone]
20151118-06:15:49: [INFO]: ***  context label:   DEV2 [org.dataone.integration.ContextAwareTestCaseDataone]
20151118-06:15:49: [INFO]: **************************************************** [org.dataone.integration.ContextAwareTestCaseDataone]
20151118-06:15:49: [INFO]: **************************************************** [org.dataone.integration.ContextAwareTestCaseDataone]
20151118-06:15:50: [INFO]: rest call info: GET https://mn-dev-ucsb-1.test.dataone.org/metacat/d1/mn/v2/monitor/ping [org.dataone.client.rest.RestClient]
20151118-06:15:50: [INFO]: MN excluded from test: https://mn-dev-ucsb-1.test.dataone.org/metacat/d1/mn [org.dataone.integration.ContextAwareTestCaseDataone]
20151118-06:15:50: [INFO]: rest call info: GET https://mn-dev-ucsb-2.test.dataone.org/metacat/d1/mn/v2/monitor/ping [org.dataone.client.rest.RestClient]
20151118-06:15:50: [INFO]: MN included in test: https://mn-dev-ucsb-2.test.dataone.org/metacat/d1/mn [org.dataone.integration.ContextAwareTestCaseDataone]
20151118-06:15:50: [INFO]: rest call info: GET https://mn-dev-unm-1.test.dataone.org/metacat/d1/mn/v2/monitor/ping [org.dataone.client.rest.RestClient]
20151118-06:15:50: [INFO]: MN excluded from test: https://mn-dev-unm-1.test.dataone.org/metacat/d1/mn [org.dataone.integration.ContextAwareTestCaseDataone]
20151118-06:15:50: [INFO]: rest call info: GET https://mn-dev-unm-2.test.dataone.org/metacat/d1/mn/v2/monitor/ping [org.dataone.client.rest.RestClient]
20151118-06:15:50: [INFO]: MN included in test: https://mn-dev-unm-2.test.dataone.org/metacat/d1/mn [org.dataone.integration.ContextAwareTestCaseDataone]
20151118-06:15:50: [INFO]: 
***************** running test for testArchive() vs. node: https://mn-dev-ucsb-2.test.dataone.org/metacat/d1/mn/v2 ***************** [org.dataone.integration.ContextAwareTestCaseDataone]
20151118-06:15:50: [INFO]: rest call info: PUT https://mn-dev-ucsb-2.test.dataone.org/metacat/d1/mn/v2/archive/fakeID.2015321221550295; MMP entity is null [org.dataone.client.rest.RestClient]
20151118-06:15:50: [INFO]: 
***************** running test for testArchive() vs. node: https://mn-dev-unm-2.test.dataone.org/metacat/d1/mn/v2 ***************** [org.dataone.integration.ContextAwareTestCaseDataone]
20151118-06:15:50: [INFO]: rest call info: PUT https://mn-dev-unm-2.test.dataone.org/metacat/d1/mn/v2/archive/fakeID.2015321221550790; MMP entity is null [org.dataone.client.rest.RestClient]
20151118-06:15:50: [INFO]: **************************************************** [org.dataone.integration.ContextAwareTestCaseDataone]
20151118-06:15:50: [INFO]: ***  context label:   DEV2 [org.dataone.integration.ContextAwareTestCaseDataone]
20151118-06:15:50: [INFO]: **************************************************** [org.dataone.integration.ContextAwareTestCaseDataone]
20151118-06:15:50: [INFO]: **************************************************** [org.dataone.integration.ContextAwareTestCaseDataone]
20151118-06:15:51: [INFO]: rest call info: GET https://mn-dev-ucsb-1.test.dataone.org/metacat/d1/mn/v2/monitor/ping [org.dataone.client.rest.RestClient]
20151118-06:15:51: [INFO]: MN excluded from test: https://mn-dev-ucsb-1.test.dataone.org/metacat/d1/mn [org.dataone.integration.ContextAwareTestCaseDataone]
20151118-06:15:51: [INFO]: rest call info: GET https://mn-dev-ucsb-2.test.dataone.org/metacat/d1/mn/v2/monitor/ping [org.dataone.client.rest.RestClient]
20151118-06:15:51: [INFO]: MN included in test: https://mn-dev-ucsb-2.test.dataone.org/metacat/d1/mn [org.dataone.integration.ContextAwareTestCaseDataone]
20151118-06:15:51: [INFO]: rest call info: GET https://mn-dev-unm-1.test.dataone.org/metacat/d1/mn/v2/monitor/ping [org.dataone.client.rest.RestClient]
20151118-06:15:51: [INFO]: MN excluded from test: https://mn-dev-unm-1.test.dataone.org/metacat/d1/mn [org.dataone.integration.ContextAwareTestCaseDataone]
20151118-06:15:51: [INFO]: rest call info: GET https://mn-dev-unm-2.test.dataone.org/metacat/d1/mn/v2/monitor/ping [org.dataone.client.rest.RestClient]
20151118-06:15:51: [INFO]: MN included in test: https://mn-dev-unm-2.test.dataone.org/metacat/d1/mn [org.dataone.integration.ContextAwareTestCaseDataone]
20151118-06:15:51: [INFO]: 
***************** running test for testArchive_NoCert() vs. node: https://mn-dev-ucsb-2.test.dataone.org/metacat/d1/mn/v2 ***************** [org.dataone.integration.ContextAwareTestCaseDataone]
20151118-06:15:53: [INFO]: rest call info: POST https://mn-dev-ucsb-2.test.dataone.org/metacat/d1/mn/v2/object; MMP message has: ParamPart:pid = mNodeTier3TestArchive2015321221551304; FilePart:object = /tmp/mmp.output.9143320652207370163.tmp (684336 bytes); FilePart:sysmeta = /tmp/mmp.output.3712283947980240195.tmp (873 bytes);  [org.dataone.client.rest.RestClient]
20151118-06:15:53: [INFO]: rest call info: PUT https://mn-dev-ucsb-2.test.dataone.org/metacat/d1/mn/v2/archive/mNodeTier3TestArchive2015321221551304; MMP entity is null [org.dataone.client.rest.RestClient]
20151118-06:15:54: [INFO]: rest call info: GET https://mn-dev-ucsb-2.test.dataone.org/metacat/d1/mn/v2/object/mNodeTier3TestArchive2015321221551304 [org.dataone.client.rest.RestClient]
20151118-06:15:54: [INFO]: 
***************** running test for testArchive_NoCert() vs. node: https://mn-dev-unm-2.test.dataone.org/metacat/d1/mn/v2 ***************** [org.dataone.integration.ContextAwareTestCaseDataone]
20151118-06:15:54: [INFO]: rest call info: POST https://mn-dev-unm-2.test.dataone.org/metacat/d1/mn/v2/object; MMP message has: ParamPart:pid = mNodeTier3TestArchive2015321221554605; FilePart:object = /tmp/mmp.output.3742511695640646655.tmp (684336 bytes); FilePart:sysmeta = /tmp/mmp.output.8102925408266322056.tmp (873 bytes);  [org.dataone.client.rest.RestClient]
20151118-06:15:54: [INFO]: rest call info: PUT https://mn-dev-unm-2.test.dataone.org/metacat/d1/mn/v2/archive/mNodeTier3TestArchive2015321221554605; MMP entity is null [org.dataone.client.rest.RestClient]
20151118-06:15:55: [INFO]: rest call info: GET https://mn-dev-unm-2.test.dataone.org/metacat/d1/mn/v2/object/mNodeTier3TestArchive2015321221554605 [org.dataone.client.rest.RestClient]
20151118-06:15:55: [INFO]: **************************************************** [org.dataone.integration.ContextAwareTestCaseDataone]
20151118-06:15:55: [INFO]: ***  context label:   DEV2 [org.dataone.integration.ContextAwareTestCaseDataone]
20151118-06:15:55: [INFO]: **************************************************** [org.dataone.integration.ContextAwareTestCaseDataone]
20151118-06:15:55: [INFO]: **************************************************** [org.dataone.integration.ContextAwareTestCaseDataone]
20151118-06:15:55: [INFO]: rest call info: GET https://mn-dev-ucsb-1.test.dataone.org/metacat/d1/mn/v2/monitor/ping [org.dataone.client.rest.RestClient]
20151118-06:15:55: [INFO]: MN excluded from test: https://mn-dev-ucsb-1.test.dataone.org/metacat/d1/mn [org.dataone.integration.ContextAwareTestCaseDataone]
20151118-06:15:55: [INFO]: rest call info: GET https://mn-dev-ucsb-2.test.dataone.org/metacat/d1/mn/v2/monitor/ping [org.dataone.client.rest.RestClient]
20151118-06:15:55: [INFO]: MN included in test: https://mn-dev-ucsb-2.test.dataone.org/metacat/d1/mn [org.dataone.integration.ContextAwareTestCaseDataone]
20151118-06:15:55: [INFO]: rest call info: GET https://mn-dev-unm-1.test.dataone.org/metacat/d1/mn/v2/monitor/ping [org.dataone.client.rest.RestClient]
20151118-06:15:55: [INFO]: MN excluded from test: https://mn-dev-unm-1.test.dataone.org/metacat/d1/mn [org.dataone.integration.ContextAwareTestCaseDataone]
20151118-06:15:55: [INFO]: rest call info: GET https://mn-dev-unm-2.test.dataone.org/metacat/d1/mn/v2/monitor/ping [org.dataone.client.rest.RestClient]
20151118-06:15:55: [INFO]: MN included in test: https://mn-dev-unm-2.test.dataone.org/metacat/d1/mn [org.dataone.integration.ContextAwareTestCaseDataone]
20151118-06:15:55: [INFO]: 
***************** running test for testDelete_NoCert() vs. node: https://mn-dev-ucsb-2.test.dataone.org/metacat/d1/mn/v2 ***************** [org.dataone.integration.ContextAwareTestCaseDataone]
20151118-06:15:57: [INFO]: rest call info: POST https://mn-dev-ucsb-2.test.dataone.org/metacat/d1/mn/v2/object; MMP message has: ParamPart:pid = mNodeTier3TestDelete2015321221555677; FilePart:object = /tmp/mmp.output.5872046951897801815.tmp (684336 bytes); FilePart:sysmeta = /tmp/mmp.output.9092302296119338415.tmp (872 bytes);  [org.dataone.client.rest.RestClient]
20151118-06:15:57: [INFO]: rest call info: DELETE https://mn-dev-ucsb-2.test.dataone.org/metacat/d1/mn/v2/object/mNodeTier3TestDelete2015321221555677 [org.dataone.client.rest.RestClient]
20151118-06:15:58: [INFO]: rest call info: GET https://mn-dev-ucsb-2.test.dataone.org/metacat/d1/mn/v2/object/mNodeTier3TestDelete2015321221555677 [org.dataone.client.rest.RestClient]
20151118-06:15:59: [INFO]: 
***************** running test for testDelete_NoCert() vs. node: https://mn-dev-unm-2.test.dataone.org/metacat/d1/mn/v2 ***************** [org.dataone.integration.ContextAwareTestCaseDataone]
20151118-06:15:59: [INFO]: rest call info: POST https://mn-dev-unm-2.test.dataone.org/metacat/d1/mn/v2/object; MMP message has: ParamPart:pid = mNodeTier3TestDelete201532122155928; FilePart:object = /tmp/mmp.output.8613032305706289763.tmp (684336 bytes); FilePart:sysmeta = /tmp/mmp.output.4361513666421814635.tmp (871 bytes);  [org.dataone.client.rest.RestClient]
20151118-06:15:59: [INFO]: rest call info: DELETE https://mn-dev-unm-2.test.dataone.org/metacat/d1/mn/v2/object/mNodeTier3TestDelete201532122155928 [org.dataone.client.rest.RestClient]
20151118-06:15:59: [INFO]: rest call info: GET https://mn-dev-unm-2.test.dataone.org/metacat/d1/mn/v2/object/mNodeTier3TestDelete201532122155928 [org.dataone.client.rest.RestClient]
20151118-06:15:59: [INFO]: **************************************************** [org.dataone.integration.ContextAwareTestCaseDataone]
20151118-06:15:59: [INFO]: ***  context label:   DEV2 [org.dataone.integration.ContextAwareTestCaseDataone]
20151118-06:15:59: [INFO]: **************************************************** [org.dataone.integration.ContextAwareTestCaseDataone]
20151118-06:15:59: [INFO]: **************************************************** [org.dataone.integration.ContextAwareTestCaseDataone]
20151118-06:15:59: [INFO]: rest call info: GET https://mn-dev-ucsb-1.test.dataone.org/metacat/d1/mn/v2/monitor/ping [org.dataone.client.rest.RestClient]
20151118-06:15:59: [INFO]: MN excluded from test: https://mn-dev-ucsb-1.test.dataone.org/metacat/d1/mn [org.dataone.integration.ContextAwareTestCaseDataone]
20151118-06:16:00: [INFO]: rest call info: GET https://mn-dev-ucsb-2.test.dataone.org/metacat/d1/mn/v2/monitor/ping [org.dataone.client.rest.RestClient]
20151118-06:16:00: [INFO]: MN included in test: https://mn-dev-ucsb-2.test.dataone.org/metacat/d1/mn [org.dataone.integration.ContextAwareTestCaseDataone]
20151118-06:16:00: [INFO]: rest call info: GET https://mn-dev-unm-1.test.dataone.org/metacat/d1/mn/v2/monitor/ping [org.dataone.client.rest.RestClient]
20151118-06:16:00: [INFO]: MN excluded from test: https://mn-dev-unm-1.test.dataone.org/metacat/d1/mn [org.dataone.integration.ContextAwareTestCaseDataone]
20151118-06:16:00: [INFO]: rest call info: GET https://mn-dev-unm-2.test.dataone.org/metacat/d1/mn/v2/monitor/ping [org.dataone.client.rest.RestClient]
20151118-06:16:00: [INFO]: MN included in test: https://mn-dev-unm-2.test.dataone.org/metacat/d1/mn [org.dataone.integration.ContextAwareTestCaseDataone]
20151118-06:16:00: [INFO]: 
***************** running test for Testing IdentifierEncoding - setting up identifiers to check ***************** [org.dataone.integration.ContextAwareTestCaseDataone]
0   common-unicode-ascii-safe-ABCDEFGHIJKLMNOPQRSTUVWXYZ	common-unicode-ascii-safe-ABCDEFGHIJKLMNOPQRSTUVWXYZ
1   common-unicode-ascii-safe-abcdefghijklmnopqrstuvwxyz	common-unicode-ascii-safe-abcdefghijklmnopqrstuvwxyz
2   common-unicode-ascii-safe-0123456789	common-unicode-ascii-safe-0123456789
3   common-unicode-ascii-safe-:@$-_.!*()',~	common-unicode-ascii-safe-:@$-_.!*()',~
4   common-unicode-ascii-safe-unreserved-._~	common-unicode-ascii-safe-unreserved-._~
5   common-unicode-ascii-safe-sub-delims-$!*()',	common-unicode-ascii-safe-sub-delims-$!*()',
6   common-unicode-ascii-safe-gen-delims-:@	common-unicode-ascii-safe-gen-delims-:@
7   common-unicode-ascii-escaped-"#<>[]^`{}|	common-unicode-ascii-escaped-%22%23%3C%3E%5B%5D%5E%60%7B%7D%7C
8   common-unicode-ascii-escaped-tomcatBlocked-\	common-unicode-ascii-escaped-tomcatBlocked-%5C
9   common-unicode-ascii-escaped-tomcatBlocked-%5C	common-unicode-ascii-escaped-tomcatBlocked-%255C
10   common-unicode-ascii-semi-colon-test-%3B	common-unicode-ascii-semi-colon-test-%253B
11   common-unicode-ascii-escaped-%	common-unicode-ascii-escaped-%25
12   common-unicode-ascii-escaped-space x x	common-unicode-ascii-escaped-space%20x%20x
13   common-unicode-ascii-escape-anyway-+	common-unicode-ascii-escape-anyway-%2B
14   common-unicode-ascii-escape-space-v-plus-+ +%20 %20+	common-unicode-ascii-escape-space-v-plus-%2B%20%2B%2520%20%2520%2B
15   path-unicode-ascii-safe-&=&=	path-unicode-ascii-safe-&=&=
16   path-unicode-ascii-escaped-;	path-unicode-ascii-escaped-%3B
17   path-unicode-ascii-escaped-?	path-unicode-ascii-escaped-%3F
18   path-unicode-ascii-escaped-/	path-unicode-ascii-escaped-%2F
19   path-unicode-ascii-escaped-%3F	path-unicode-ascii-escaped-%253F
20   path-unicode-ascii-escaped-%2F	path-unicode-ascii-escaped-%252F
21   path-unicode-ascii-escaped-double-//case	path-unicode-ascii-escaped-double-%2F%2Fcase
22   path-unicode-ascii-escaped-double-trailing//	path-unicode-ascii-escaped-double-trailing%2F%2F
23   path-unicode-ascii-escaped-double-%2F%2Fcase	path-unicode-ascii-escaped-double-%252F%252Fcase
24   path-unicode-ascii-escaped-double-trailing%2F%2F	path-unicode-ascii-escaped-double-trailing%252F%252F
25   common-unicode-bmp-1byte-escaped-¡¢£	common-unicode-bmp-1byte-escaped-%C2%A1%C2%A2%C2%A3
26   common-unicode-bmp-2byte-escaped-䦹䦺	common-unicode-bmp-2byte-escaped-%E4%A6%B9%E4%A6%BA
27   common-ascii-doc-example-urn:lsid:ubio.org:namebank:11815	common-ascii-doc-example-urn:lsid:ubio.org:namebank:11815
28   path-ascii-doc-example-10.1000/182	path-ascii-doc-example-10.1000%2F182
29   path-ascii-doc-example-http://example.com/data/mydata?row=24	path-ascii-doc-example-http:%2F%2Fexample.com%2Fdata%2Fmydata%3Frow=24
30   path-ascii-doc-example-ldap://ldap1.example.net:6666/o=University%20of%20Michigan, c=US??sub?(cn=Babs%20Jensen)	path-ascii-doc-example-ldap:%2F%2Fldap1.example.net:6666%2Fo=University%2520of%2520Michigan,%20c=US%3F%3Fsub%3F(cn=Babs%2520Jensen)
31   common-bmp-doc-example-ฉันกินกระจกได้	common-bmp-doc-example-%E0%B8%89%E0%B8%B1%E0%B8%99%E0%B8%81%E0%B8%B4%E0%B8%99%E0%B8%81%E0%B8%A3%E0%B8%B0%E0%B8%88%E0%B8%81%E0%B9%84%E0%B8%94%E0%B9%89
32   common-bmp-doc-example-Is_féidir_liom_ithe_gloine	common-bmp-doc-example-Is_f%C3%A9idir_liom_ithe_gloine
20151118-06:16:00: [INFO]: 
***************** running test for testCreateData_IdentifierEncoding() vs. node: https://mn-dev-ucsb-2.test.dataone.org/metacat/d1/mn/v2 ***************** [org.dataone.integration.ContextAwareTestCaseDataone]
20151118-06:16:00: [INFO]: 
***************** running test for   Node:: https://mn-dev-ucsb-2.test.dataone.org/metacat/d1/mn/v2 ***************** [org.dataone.integration.ContextAwareTestCaseDataone]
20151118-06:16:01: [INFO]: rest call info: POST https://mn-dev-ucsb-2.test.dataone.org/metacat/d1/mn/v2/object; MMP message has: ParamPart:pid = testMNodeTier3:201532122160151_common-unicode-ascii-safe-ABCDEFGHIJKLMNOPQRSTUVWXYZ; FilePart:object = /tmp/mmp.output.6250178100015628662.tmp (684336 bytes); FilePart:sysmeta = /tmp/mmp.output.2640188734560562555.tmp (919 bytes);  [org.dataone.client.rest.RestClient]
20151118-06:16:05: [INFO]: rest call info: GET https://mn-dev-ucsb-2.test.dataone.org/metacat/d1/mn/v2/object/testMNodeTier3:201532122160151_common-unicode-ascii-safe-ABCDEFGHIJKLMNOPQRSTUVWXYZ [org.dataone.client.rest.RestClient]
20151118-06:16:06: [INFO]: rest call info: POST https://mn-dev-ucsb-2.test.dataone.org/metacat/d1/mn/v2/object; MMP message has: ParamPart:pid = testMNodeTier3:201532122165197_common-unicode-ascii-safe-abcdefghijklmnopqrstuvwxyz; FilePart:object = /tmp/mmp.output.162530170987584523.tmp (684336 bytes); FilePart:sysmeta = /tmp/mmp.output.697680231859163434.tmp (919 bytes);  [org.dataone.client.rest.RestClient]
20151118-06:16:09: [INFO]: rest call info: GET https://mn-dev-ucsb-2.test.dataone.org/metacat/d1/mn/v2/object/testMNodeTier3:201532122165197_common-unicode-ascii-safe-abcdefghijklmnopqrstuvwxyz [org.dataone.client.rest.RestClient]
20151118-06:16:11: [INFO]: rest call info: POST https://mn-dev-ucsb-2.test.dataone.org/metacat/d1/mn/v2/object; MMP message has: ParamPart:pid = testMNodeTier3:201532122169595_common-unicode-ascii-safe-0123456789; FilePart:object = /tmp/mmp.output.5341040331105335825.tmp (684336 bytes); FilePart:sysmeta = /tmp/mmp.output.4353359555365379221.tmp (903 bytes);  [org.dataone.client.rest.RestClient]
20151118-06:16:14: [INFO]: rest call info: GET https://mn-dev-ucsb-2.test.dataone.org/metacat/d1/mn/v2/object/testMNodeTier3:201532122169595_common-unicode-ascii-safe-0123456789 [org.dataone.client.rest.RestClient]
20151118-06:16:15: [INFO]: rest call info: POST https://mn-dev-ucsb-2.test.dataone.org/metacat/d1/mn/v2/object; MMP message has: ParamPart:pid = testMNodeTier3:2015321221614547_common-unicode-ascii-safe-:@$-_.!*()',~; FilePart:object = /tmp/mmp.output.4620878926865200367.tmp (684336 bytes); FilePart:sysmeta = /tmp/mmp.output.1105056078334829268.tmp (907 bytes);  [org.dataone.client.rest.RestClient]
20151118-06:16:18: [INFO]: rest call info: GET https://mn-dev-ucsb-2.test.dataone.org/metacat/d1/mn/v2/object/testMNodeTier3:2015321221614547_common-unicode-ascii-safe-:@$-_.!*()',~ [org.dataone.client.rest.RestClient]
20151118-06:16:19: [INFO]: rest call info: POST https://mn-dev-ucsb-2.test.dataone.org/metacat/d1/mn/v2/object; MMP message has: ParamPart:pid = testMNodeTier3:201532122161913_common-unicode-ascii-safe-unreserved-._~; FilePart:object = /tmp/mmp.output.7760052659296912021.tmp (684336 bytes); FilePart:sysmeta = /tmp/mmp.output.2251881155369260085.tmp (907 bytes);  [org.dataone.client.rest.RestClient]
20151118-06:16:23: [INFO]: rest call info: GET https://mn-dev-ucsb-2.test.dataone.org/metacat/d1/mn/v2/object/testMNodeTier3:201532122161913_common-unicode-ascii-safe-unreserved-._~ [org.dataone.client.rest.RestClient]
20151118-06:16:24: [INFO]: rest call info: POST https://mn-dev-ucsb-2.test.dataone.org/metacat/d1/mn/v2/object; MMP message has: ParamPart:pid = testMNodeTier3:2015321221623536_common-unicode-ascii-safe-sub-delims-$!*()',; FilePart:object = /tmp/mmp.output.1373027730229113768.tmp (684336 bytes); FilePart:sysmeta = /tmp/mmp.output.194616331451970497.tmp (912 bytes);  [org.dataone.client.rest.RestClient]
20151118-06:16:27: [INFO]: rest call info: GET https://mn-dev-ucsb-2.test.dataone.org/metacat/d1/mn/v2/object/testMNodeTier3:2015321221623536_common-unicode-ascii-safe-sub-delims-$!*()', [org.dataone.client.rest.RestClient]
20151118-06:16:29: [INFO]: rest call info: POST https://mn-dev-ucsb-2.test.dataone.org/metacat/d1/mn/v2/object; MMP message has: ParamPart:pid = testMNodeTier3:201532122162883_common-unicode-ascii-safe-gen-delims-:@; FilePart:object = /tmp/mmp.output.3172511231073479908.tmp (684336 bytes); FilePart:sysmeta = /tmp/mmp.output.8321659375722184193.tmp (906 bytes);  [org.dataone.client.rest.RestClient]
20151118-06:16:32: [INFO]: rest call info: GET https://mn-dev-ucsb-2.test.dataone.org/metacat/d1/mn/v2/object/testMNodeTier3:201532122162883_common-unicode-ascii-safe-gen-delims-:@ [org.dataone.client.rest.RestClient]
20151118-06:16:33: [INFO]: rest call info: POST https://mn-dev-ucsb-2.test.dataone.org/metacat/d1/mn/v2/object; MMP message has: ParamPart:pid = testMNodeTier3:2015321221632888_common-unicode-ascii-escaped-%22%23%3C%3E%5B%5D%5E%60%7B%7D%7C; FilePart:object = /tmp/mmp.output.7142346894690091257.tmp (684336 bytes); FilePart:sysmeta = /tmp/mmp.output.5310677474360420341.tmp (930 bytes);  [org.dataone.client.rest.RestClient]
20151118-06:16:37: [INFO]: rest call info: GET https://mn-dev-ucsb-2.test.dataone.org/metacat/d1/mn/v2/object/testMNodeTier3:2015321221632888_common-unicode-ascii-escaped-%2522%2523%253C%253E%255B%255D%255E%2560%257B%257D%257C [org.dataone.client.rest.RestClient]
20151118-06:16:38: [INFO]: rest call info: POST https://mn-dev-ucsb-2.test.dataone.org/metacat/d1/mn/v2/object; MMP message has: ParamPart:pid = testMNodeTier3:2015321221637573_common-unicode-ascii-escaped-tomcatBlocked-%5C; FilePart:object = /tmp/mmp.output.6310516740409765751.tmp (684336 bytes); FilePart:sysmeta = /tmp/mmp.output.847285887064103656.tmp (914 bytes);  [org.dataone.client.rest.RestClient]
20151118-06:16:41: [INFO]: rest call info: GET https://mn-dev-ucsb-2.test.dataone.org/metacat/d1/mn/v2/object/testMNodeTier3:2015321221637573_common-unicode-ascii-escaped-tomcatBlocked-%255C [org.dataone.client.rest.RestClient]
20151118-06:16:43: [INFO]: rest call info: POST https://mn-dev-ucsb-2.test.dataone.org/metacat/d1/mn/v2/object; MMP message has: ParamPart:pid = testMNodeTier3:201532122164287_common-unicode-ascii-escaped-tomcatBlocked-%255C; FilePart:object = /tmp/mmp.output.7313242850034952977.tmp (684336 bytes); FilePart:sysmeta = /tmp/mmp.output.1834629297740522871.tmp (915 bytes);  [org.dataone.client.rest.RestClient]
20151118-06:16:46: [INFO]: rest call info: GET https://mn-dev-ucsb-2.test.dataone.org/metacat/d1/mn/v2/object/testMNodeTier3:201532122164287_common-unicode-ascii-escaped-tomcatBlocked-%25255C [org.dataone.client.rest.RestClient]
20151118-06:16:48: [INFO]: rest call info: POST https://mn-dev-ucsb-2.test.dataone.org/metacat/d1/mn/v2/object; MMP message has: ParamPart:pid = testMNodeTier3:2015321221646914_common-unicode-ascii-semi-colon-test-%253B; FilePart:object = /tmp/mmp.output.537254575273788574.tmp (684336 bytes); FilePart:sysmeta = /tmp/mmp.output.1405048101645296978.tmp (910 bytes);  [org.dataone.client.rest.RestClient]
20151118-06:16:51: [INFO]: rest call info: GET https://mn-dev-ucsb-2.test.dataone.org/metacat/d1/mn/v2/object/testMNodeTier3:2015321221646914_common-unicode-ascii-semi-colon-test-%25253B [org.dataone.client.rest.RestClient]
20151118-06:16:53: [INFO]: rest call info: POST https://mn-dev-ucsb-2.test.dataone.org/metacat/d1/mn/v2/object; MMP message has: ParamPart:pid = testMNodeTier3:2015321221651753_common-unicode-ascii-escaped-%25; FilePart:object = /tmp/mmp.output.8211024950332554483.tmp (684336 bytes); FilePart:sysmeta = /tmp/mmp.output.4532213879097085977.tmp (900 bytes);  [org.dataone.client.rest.RestClient]
20151118-06:16:56: [INFO]: rest call info: GET https://mn-dev-ucsb-2.test.dataone.org/metacat/d1/mn/v2/object/testMNodeTier3:2015321221651753_common-unicode-ascii-escaped-%2525 [org.dataone.client.rest.RestClient]
20151118-06:16:59: [INFO]: rest call info: POST https://mn-dev-ucsb-2.test.dataone.org/metacat/d1/mn/v2/object; MMP message has: ParamPart:pid = testMNodeTier3:2015321221656664_common-unicode-ascii-escaped-space%20x%20x; FilePart:object = /tmp/mmp.output.8129274117656894060.tmp (684336 bytes); FilePart:sysmeta = /tmp/mmp.output.838097127812169814.tmp (910 bytes);  [org.dataone.client.rest.RestClient]
20151118-06:17:02: [INFO]: rest call info: GET https://mn-dev-ucsb-2.test.dataone.org/metacat/d1/mn/v2/object/testMNodeTier3:2015321221656664_common-unicode-ascii-escaped-space%2520x%2520x [org.dataone.client.rest.RestClient]
20151118-06:17:04: [INFO]: rest call info: POST https://mn-dev-ucsb-2.test.dataone.org/metacat/d1/mn/v2/object; MMP message has: ParamPart:pid = testMNodeTier3:201532122172524_common-unicode-ascii-escape-anyway-%2B; FilePart:object = /tmp/mmp.output.4828931054031577583.tmp (684336 bytes); FilePart:sysmeta = /tmp/mmp.output.7547112598326267599.tmp (905 bytes);  [org.dataone.client.rest.RestClient]
20151118-06:17:07: [INFO]: rest call info: GET https://mn-dev-ucsb-2.test.dataone.org/metacat/d1/mn/v2/object/testMNodeTier3:201532122172524_common-unicode-ascii-escape-anyway-%252B [org.dataone.client.rest.RestClient]
20151118-06:17:09: [INFO]: rest call info: POST https://mn-dev-ucsb-2.test.dataone.org/metacat/d1/mn/v2/object; MMP message has: ParamPart:pid = testMNodeTier3:201532122177820_common-unicode-ascii-escape-space-v-plus-%2B%20%2B%2520%20%2520%2B; FilePart:object = /tmp/mmp.output.6294411205798927166.tmp (684336 bytes); FilePart:sysmeta = /tmp/mmp.output.3027909663551579937.tmp (933 bytes);  [org.dataone.client.rest.RestClient]
20151118-06:17:12: [INFO]: rest call info: GET https://mn-dev-ucsb-2.test.dataone.org/metacat/d1/mn/v2/object/testMNodeTier3:201532122177820_common-unicode-ascii-escape-space-v-plus-%252B%2520%252B%252520%2520%252520%252B [org.dataone.client.rest.RestClient]
20151118-06:17:13: [INFO]: rest call info: POST https://mn-dev-ucsb-2.test.dataone.org/metacat/d1/mn/v2/object; MMP message has: ParamPart:pid = testMNodeTier3:2015321221712466_path-unicode-ascii-safe-&=&=; FilePart:object = /tmp/mmp.output.4043820052211617601.tmp (684336 bytes); FilePart:sysmeta = /tmp/mmp.output.6457170702597610331.tmp (904 bytes);  [org.dataone.client.rest.RestClient]
20151118-06:17:17: [INFO]: rest call info: GET https://mn-dev-ucsb-2.test.dataone.org/metacat/d1/mn/v2/object/testMNodeTier3:2015321221712466_path-unicode-ascii-safe-&=&= [org.dataone.client.rest.RestClient]
20151118-06:17:18: [INFO]: rest call info: POST https://mn-dev-ucsb-2.test.dataone.org/metacat/d1/mn/v2/object; MMP message has: ParamPart:pid = testMNodeTier3:2015321221717521_path-unicode-ascii-escaped-%3B; FilePart:object = /tmp/mmp.output.8060897215399350269.tmp (684336 bytes); FilePart:sysmeta = /tmp/mmp.output.3680349289520079224.tmp (898 bytes);  [org.dataone.client.rest.RestClient]
20151118-06:17:21: [INFO]: rest call info: GET https://mn-dev-ucsb-2.test.dataone.org/metacat/d1/mn/v2/object/testMNodeTier3:2015321221717521_path-unicode-ascii-escaped-%253B [org.dataone.client.rest.RestClient]
20151118-06:17:23: [INFO]: rest call info: POST https://mn-dev-ucsb-2.test.dataone.org/metacat/d1/mn/v2/object; MMP message has: ParamPart:pid = testMNodeTier3:2015321221722156_path-unicode-ascii-escaped-%3F; FilePart:object = /tmp/mmp.output.1827949972471836324.tmp (684336 bytes); FilePart:sysmeta = /tmp/mmp.output.7475987797334620427.tmp (898 bytes);  [org.dataone.client.rest.RestClient]
20151118-06:17:26: [INFO]: rest call info: GET https://mn-dev-ucsb-2.test.dataone.org/metacat/d1/mn/v2/object/testMNodeTier3:2015321221722156_path-unicode-ascii-escaped-%253F [org.dataone.client.rest.RestClient]
20151118-06:17:27: [INFO]: rest call info: POST https://mn-dev-ucsb-2.test.dataone.org/metacat/d1/mn/v2/object; MMP message has: ParamPart:pid = testMNodeTier3:2015321221726937_path-unicode-ascii-escaped-%2F; FilePart:object = /tmp/mmp.output.3354882747470868580.tmp (684336 bytes); FilePart:sysmeta = /tmp/mmp.output.8187443341336377306.tmp (898 bytes);  [org.dataone.client.rest.RestClient]
20151118-06:17:31: [INFO]: rest call info: GET https://mn-dev-ucsb-2.test.dataone.org/metacat/d1/mn/v2/object/testMNodeTier3:2015321221726937_path-unicode-ascii-escaped-%252F [org.dataone.client.rest.RestClient]
20151118-06:17:32: [INFO]: rest call info: POST https://mn-dev-ucsb-2.test.dataone.org/metacat/d1/mn/v2/object; MMP message has: ParamPart:pid = testMNodeTier3:2015321221731556_path-unicode-ascii-escaped-%253F; FilePart:object = /tmp/mmp.output.3970608515237381927.tmp (684336 bytes); FilePart:sysmeta = /tmp/mmp.output.9193351690220028488.tmp (900 bytes);  [org.dataone.client.rest.RestClient]
20151118-06:17:35: [INFO]: rest call info: GET https://mn-dev-ucsb-2.test.dataone.org/metacat/d1/mn/v2/object/testMNodeTier3:2015321221731556_path-unicode-ascii-escaped-%25253F [org.dataone.client.rest.RestClient]
20151118-06:17:37: [INFO]: rest call info: POST https://mn-dev-ucsb-2.test.dataone.org/metacat/d1/mn/v2/object; MMP message has: ParamPart:pid = testMNodeTier3:2015321221736152_path-unicode-ascii-escaped-%252F; FilePart:object = /tmp/mmp.output.4895347163879217905.tmp (684336 bytes); FilePart:sysmeta = /tmp/mmp.output.8933403039821879505.tmp (900 bytes);  [org.dataone.client.rest.RestClient]
20151118-06:17:40: [INFO]: rest call info: GET https://mn-dev-ucsb-2.test.dataone.org/metacat/d1/mn/v2/object/testMNodeTier3:2015321221736152_path-unicode-ascii-escaped-%25252F [org.dataone.client.rest.RestClient]
20151118-06:17:41: [INFO]: rest call info: POST https://mn-dev-ucsb-2.test.dataone.org/metacat/d1/mn/v2/object; MMP message has: ParamPart:pid = testMNodeTier3:2015321221740756_path-unicode-ascii-escaped-double-%2F%2Fcase; FilePart:object = /tmp/mmp.output.8342063357446792119.tmp (684336 bytes); FilePart:sysmeta = /tmp/mmp.output.7522772035937834946.tmp (912 bytes);  [org.dataone.client.rest.RestClient]
20151118-06:17:44: [INFO]: rest call info: GET https://mn-dev-ucsb-2.test.dataone.org/metacat/d1/mn/v2/object/testMNodeTier3:2015321221740756_path-unicode-ascii-escaped-double-%252F%252Fcase [org.dataone.client.rest.RestClient]
20151118-06:17:46: [INFO]: rest call info: POST https://mn-dev-ucsb-2.test.dataone.org/metacat/d1/mn/v2/object; MMP message has: ParamPart:pid = testMNodeTier3:2015321221745361_path-unicode-ascii-escaped-double-trailing%2F%2F; FilePart:object = /tmp/mmp.output.7384828784071318838.tmp (684336 bytes); FilePart:sysmeta = /tmp/mmp.output.3433901389840856097.tmp (916 bytes);  [org.dataone.client.rest.RestClient]
20151118-06:17:50: [INFO]: rest call info: GET https://mn-dev-ucsb-2.test.dataone.org/metacat/d1/mn/v2/object/testMNodeTier3:2015321221745361_path-unicode-ascii-escaped-double-trailing%252F%252F [org.dataone.client.rest.RestClient]
20151118-06:17:51: [INFO]: rest call info: POST https://mn-dev-ucsb-2.test.dataone.org/metacat/d1/mn/v2/object; MMP message has: ParamPart:pid = testMNodeTier3:2015321221750753_path-unicode-ascii-escaped-double-%252F%252Fcase; FilePart:object = /tmp/mmp.output.6160382092113963785.tmp (684336 bytes); FilePart:sysmeta = /tmp/mmp.output.368331332042709183.tmp (916 bytes);  [org.dataone.client.rest.RestClient]
20151118-06:17:55: [INFO]: rest call info: GET https://mn-dev-ucsb-2.test.dataone.org/metacat/d1/mn/v2/object/testMNodeTier3:2015321221750753_path-unicode-ascii-escaped-double-%25252F%25252Fcase [org.dataone.client.rest.RestClient]
20151118-06:17:57: [INFO]: rest call info: POST https://mn-dev-ucsb-2.test.dataone.org/metacat/d1/mn/v2/object; MMP message has: ParamPart:pid = testMNodeTier3:2015321221755439_path-unicode-ascii-escaped-double-trailing%252F%252F; FilePart:object = /tmp/mmp.output.6251465761605660532.tmp (684336 bytes); FilePart:sysmeta = /tmp/mmp.output.4823915058180830648.tmp (920 bytes);  [org.dataone.client.rest.RestClient]
20151118-06:18:00: [INFO]: rest call info: GET https://mn-dev-ucsb-2.test.dataone.org/metacat/d1/mn/v2/object/testMNodeTier3:2015321221755439_path-unicode-ascii-escaped-double-trailing%25252F%25252F [org.dataone.client.rest.RestClient]
20151118-06:18:01: [INFO]: rest call info: POST https://mn-dev-ucsb-2.test.dataone.org/metacat/d1/mn/v2/object; MMP message has: ParamPart:pid = testMNodeTier3:201532122180797_common-unicode-bmp-1byte-escaped-%C2%A1%C2%A2%C2%A3; FilePart:object = /tmp/mmp.output.8158409977982027939.tmp (684336 bytes); FilePart:sysmeta = /tmp/mmp.output.1555156854047479507.tmp (918 bytes);  [org.dataone.client.rest.RestClient]
20151118-06:18:05: [INFO]: rest call info: GET https://mn-dev-ucsb-2.test.dataone.org/metacat/d1/mn/v2/object/testMNodeTier3:201532122180797_common-unicode-bmp-1byte-escaped-%25C2%25A1%25C2%25A2%25C2%25A3 [org.dataone.client.rest.RestClient]
20151118-06:18:07: [INFO]: rest call info: POST https://mn-dev-ucsb-2.test.dataone.org/metacat/d1/mn/v2/object; MMP message has: ParamPart:pid = testMNodeTier3:201532122185962_common-unicode-bmp-2byte-escaped-%E4%A6%B9%E4%A6%BA; FilePart:object = /tmp/mmp.output.4767357772897213106.tmp (684336 bytes); FilePart:sysmeta = /tmp/mmp.output.5887699234090141253.tmp (918 bytes);  [org.dataone.client.rest.RestClient]
Process 1447827295900 is killed.
Build was aborted
Aborted by administrator
[WARNING] File encoding has not been set, using platform encoding UTF-8, i.e. build is platform dependent!
channel stopped
[INFO] ------------------------------------------------------------------------
[INFO] BUILD FAILURE
[INFO] ------------------------------------------------------------------------
[INFO] Total time: 3:36.422s
[INFO] Finished at: Wed Nov 18 06:18:08 UTC 2015
Notifying upstream projects of job completion
Warning: you have no plugins providing access control for builds, so falling back to legacy behavior of permitting any downstream builds to be triggered
Finished: ABORTED