UnstableConsole Output

Skipping 2,649 KB.. Full Log
d of procured test Object: TierTesting:mn-dev-ucsb-2:Public_READ.14 [org.dataone.integration.ContextAwareTestCaseDataone]
20151117-10:32:36: [INFO]: rest call info: HEAD https://mn-dev-ucsb-2.test.dataone.org/metacat/d1/mn/v2/object/TierTesting:mn-dev-ucsb-2:Public_READ.14 [org.dataone.client.rest.RestClient]
20151117-10:32:36: [INFO]: 
***************** running test for testDescribe() vs. node: https://mn-dev-unm-2.test.dataone.org/metacat/d1/mn/v2 ***************** [org.dataone.integration.ContextAwareTestCaseDataone]
20151117-10:32:36: [INFO]: rest call info: GET https://mn-dev-unm-2.test.dataone.org/metacat/d1/mn/v2/meta/TierTesting:mn-dev-unm-2:Public_READ.14 [org.dataone.client.rest.RestClient]
20151117-10:32:36: [INFO]:  ====>>>>> pid of procured test Object: TierTesting:mn-dev-unm-2:Public_READ.14 [org.dataone.integration.ContextAwareTestCaseDataone]
20151117-10:32:36: [INFO]: rest call info: HEAD https://mn-dev-unm-2.test.dataone.org/metacat/d1/mn/v2/object/TierTesting:mn-dev-unm-2:Public_READ.14 [org.dataone.client.rest.RestClient]
20151117-10:32:36: [INFO]: **************************************************** [org.dataone.integration.ContextAwareTestCaseDataone]
20151117-10:32:36: [INFO]: ***  context label:   DEV2 [org.dataone.integration.ContextAwareTestCaseDataone]
20151117-10:32:36: [INFO]: **************************************************** [org.dataone.integration.ContextAwareTestCaseDataone]
20151117-10:32:36: [INFO]: **************************************************** [org.dataone.integration.ContextAwareTestCaseDataone]
20151117-10:32:38: [INFO]: rest call info: GET https://mn-dev-ucsb-1.test.dataone.org/metacat/d1/mn/v2/monitor/ping [org.dataone.client.rest.RestClient]
20151117-10:32:38: [INFO]: MN excluded from test: https://mn-dev-ucsb-1.test.dataone.org/metacat/d1/mn [org.dataone.integration.ContextAwareTestCaseDataone]
20151117-10:32:39: [INFO]: rest call info: GET https://mn-dev-ucsb-2.test.dataone.org/metacat/d1/mn/v2/monitor/ping [org.dataone.client.rest.RestClient]
20151117-10:32:39: [INFO]: MN included in test: https://mn-dev-ucsb-2.test.dataone.org/metacat/d1/mn [org.dataone.integration.ContextAwareTestCaseDataone]
20151117-10:32:39: [INFO]: rest call info: GET https://mn-dev-unm-1.test.dataone.org/metacat/d1/mn/v2/monitor/ping [org.dataone.client.rest.RestClient]
20151117-10:32:39: [INFO]: MN excluded from test: https://mn-dev-unm-1.test.dataone.org/metacat/d1/mn [org.dataone.integration.ContextAwareTestCaseDataone]
20151117-10:32:39: [INFO]: rest call info: GET https://mn-dev-unm-2.test.dataone.org/metacat/d1/mn/v2/monitor/ping [org.dataone.client.rest.RestClient]
20151117-10:32:39: [INFO]: MN included in test: https://mn-dev-unm-2.test.dataone.org/metacat/d1/mn [org.dataone.integration.ContextAwareTestCaseDataone]
20151117-10:32:39: [INFO]: 
***************** running test for testDescribe() vs. node: https://mn-dev-ucsb-2.test.dataone.org/metacat/d1/mn/v2 ***************** [org.dataone.integration.ContextAwareTestCaseDataone]
20151117-10:32:39: [INFO]: rest call info: HEAD https://mn-dev-ucsb-2.test.dataone.org/metacat/d1/mn/v2/object/TestingNotFound:201532123239499 [org.dataone.client.rest.RestClient]
20151117-10:32:39: [INFO]: 
***************** running test for testDescribe() vs. node: https://mn-dev-unm-2.test.dataone.org/metacat/d1/mn/v2 ***************** [org.dataone.integration.ContextAwareTestCaseDataone]
20151117-10:32:39: [INFO]: rest call info: HEAD https://mn-dev-unm-2.test.dataone.org/metacat/d1/mn/v2/object/TestingNotFound:201532123239802 [org.dataone.client.rest.RestClient]
20151117-10:32:39: [INFO]: **************************************************** [org.dataone.integration.ContextAwareTestCaseDataone]
20151117-10:32:39: [INFO]: ***  context label:   DEV2 [org.dataone.integration.ContextAwareTestCaseDataone]
20151117-10:32:39: [INFO]: **************************************************** [org.dataone.integration.ContextAwareTestCaseDataone]
20151117-10:32:39: [INFO]: **************************************************** [org.dataone.integration.ContextAwareTestCaseDataone]
20151117-10:32:40: [INFO]: rest call info: GET https://mn-dev-ucsb-1.test.dataone.org/metacat/d1/mn/v2/monitor/ping [org.dataone.client.rest.RestClient]
20151117-10:32:40: [INFO]: MN excluded from test: https://mn-dev-ucsb-1.test.dataone.org/metacat/d1/mn [org.dataone.integration.ContextAwareTestCaseDataone]
20151117-10:32:42: [INFO]: rest call info: GET https://mn-dev-ucsb-2.test.dataone.org/metacat/d1/mn/v2/monitor/ping [org.dataone.client.rest.RestClient]
20151117-10:32:42: [INFO]: MN included in test: https://mn-dev-ucsb-2.test.dataone.org/metacat/d1/mn [org.dataone.integration.ContextAwareTestCaseDataone]
20151117-10:32:42: [INFO]: rest call info: GET https://mn-dev-unm-1.test.dataone.org/metacat/d1/mn/v2/monitor/ping [org.dataone.client.rest.RestClient]
20151117-10:32:42: [INFO]: MN excluded from test: https://mn-dev-unm-1.test.dataone.org/metacat/d1/mn [org.dataone.integration.ContextAwareTestCaseDataone]
20151117-10:32:42: [INFO]: rest call info: GET https://mn-dev-unm-2.test.dataone.org/metacat/d1/mn/v2/monitor/ping [org.dataone.client.rest.RestClient]
20151117-10:32:42: [INFO]: MN included in test: https://mn-dev-unm-2.test.dataone.org/metacat/d1/mn [org.dataone.integration.ContextAwareTestCaseDataone]
20151117-10:32:42: [INFO]: 
***************** running test for Testing IdentifierEncoding - setting up identifiers to check ***************** [org.dataone.integration.ContextAwareTestCaseDataone]
20151117-10:32:42: [INFO]: 
***************** running test for testDescribe_IdentifierEncoding() vs. node: https://mn-dev-ucsb-2.test.dataone.org/metacat/d1/mn/v2 ***************** [org.dataone.integration.ContextAwareTestCaseDataone]
20151117-10:32:42: [INFO]: 
***************** running test for   Node:: https://mn-dev-ucsb-2.test.dataone.org/metacat/d1/mn/v2 ***************** [org.dataone.integration.ContextAwareTestCaseDataone]
20151117-10:32:44: [INFO]: rest call info: HEAD https://mn-dev-ucsb-2.test.dataone.org/metacat/d1/mn/v2/object/Test201532123242299_common-unicode-ascii-safe-ABCDEFGHIJKLMNOPQRSTUVWXYZ [org.dataone.client.rest.RestClient]
20151117-10:32:45: [INFO]: rest call info: HEAD https://mn-dev-ucsb-2.test.dataone.org/metacat/d1/mn/v2/object/Test20153212324436_common-unicode-ascii-safe-abcdefghijklmnopqrstuvwxyz [org.dataone.client.rest.RestClient]
20151117-10:32:46: [INFO]: rest call info: HEAD https://mn-dev-ucsb-2.test.dataone.org/metacat/d1/mn/v2/object/Test201532123245315_common-unicode-ascii-safe-0123456789 [org.dataone.client.rest.RestClient]
20151117-10:32:46: [INFO]: rest call info: HEAD https://mn-dev-ucsb-2.test.dataone.org/metacat/d1/mn/v2/object/Test20153212324665_common-unicode-ascii-safe-:@$-_.!*()',~ [org.dataone.client.rest.RestClient]
20151117-10:32:47: [INFO]: rest call info: HEAD https://mn-dev-ucsb-2.test.dataone.org/metacat/d1/mn/v2/object/Test201532123246798_common-unicode-ascii-safe-unreserved-._~ [org.dataone.client.rest.RestClient]
20151117-10:32:48: [INFO]: rest call info: HEAD https://mn-dev-ucsb-2.test.dataone.org/metacat/d1/mn/v2/object/Test201532123247545_common-unicode-ascii-safe-sub-delims-$!*()', [org.dataone.client.rest.RestClient]
20151117-10:32:50: [INFO]: rest call info: HEAD https://mn-dev-ucsb-2.test.dataone.org/metacat/d1/mn/v2/object/Test201532123248830_common-unicode-ascii-safe-gen-delims-:@ [org.dataone.client.rest.RestClient]
20151117-10:32:51: [INFO]: rest call info: HEAD https://mn-dev-ucsb-2.test.dataone.org/metacat/d1/mn/v2/object/Test201532123250132_common-unicode-ascii-escaped-%22%23%3C%3E%5B%5D%5E%60%7B%7D%7C [org.dataone.client.rest.RestClient]
20151117-10:32:52: [INFO]: rest call info: HEAD https://mn-dev-ucsb-2.test.dataone.org/metacat/d1/mn/v2/object/Test201532123251420_common-unicode-ascii-escaped-tomcatBlocked-%5C [org.dataone.client.rest.RestClient]
20151117-10:32:52: [INFO]: rest call info: HEAD https://mn-dev-ucsb-2.test.dataone.org/metacat/d1/mn/v2/object/Test201532123252169_common-unicode-ascii-escaped-tomcatBlocked-%255C [org.dataone.client.rest.RestClient]
20151117-10:32:53: [INFO]: rest call info: HEAD https://mn-dev-ucsb-2.test.dataone.org/metacat/d1/mn/v2/object/Test201532123252926_common-unicode-ascii-semi-colon-test-%253B [org.dataone.client.rest.RestClient]
20151117-10:32:54: [INFO]: rest call info: HEAD https://mn-dev-ucsb-2.test.dataone.org/metacat/d1/mn/v2/object/Test201532123253675_common-unicode-ascii-escaped-%25 [org.dataone.client.rest.RestClient]
20151117-10:32:55: [INFO]: rest call info: HEAD https://mn-dev-ucsb-2.test.dataone.org/metacat/d1/mn/v2/object/Test201532123254415_common-unicode-ascii-escape-anyway-%2B [org.dataone.client.rest.RestClient]
20151117-10:32:55: [INFO]: rest call info: HEAD https://mn-dev-ucsb-2.test.dataone.org/metacat/d1/mn/v2/object/Test201532123255153_path-unicode-ascii-safe-&=&= [org.dataone.client.rest.RestClient]
20151117-10:32:58: [INFO]: rest call info: HEAD https://mn-dev-ucsb-2.test.dataone.org/metacat/d1/mn/v2/object/Test201532123255912_path-unicode-ascii-escaped-%3B [org.dataone.client.rest.RestClient]
20151117-10:32:58: [INFO]: rest call info: HEAD https://mn-dev-ucsb-2.test.dataone.org/metacat/d1/mn/v2/object/Test201532123258189_path-unicode-ascii-escaped-%3F [org.dataone.client.rest.RestClient]
20151117-10:33:01: [INFO]: rest call info: HEAD https://mn-dev-ucsb-2.test.dataone.org/metacat/d1/mn/v2/object/Test201532123258943_path-unicode-ascii-escaped-%2F [org.dataone.client.rest.RestClient]
20151117-10:33:03: [INFO]: rest call info: HEAD https://mn-dev-ucsb-2.test.dataone.org/metacat/d1/mn/v2/object/Test20153212331456_path-unicode-ascii-escaped-%253F [org.dataone.client.rest.RestClient]
20151117-10:33:06: [INFO]: rest call info: HEAD https://mn-dev-ucsb-2.test.dataone.org/metacat/d1/mn/v2/object/Test20153212333765_path-unicode-ascii-escaped-%252F [org.dataone.client.rest.RestClient]
20151117-10:33:07: [INFO]: rest call info: HEAD https://mn-dev-ucsb-2.test.dataone.org/metacat/d1/mn/v2/object/Test20153212336683_path-unicode-ascii-escaped-double-%2F%2Fcase [org.dataone.client.rest.RestClient]
20151117-10:33:08: [INFO]: rest call info: HEAD https://mn-dev-ucsb-2.test.dataone.org/metacat/d1/mn/v2/object/Test20153212337966_path-unicode-ascii-escaped-double-trailing%2F%2F [org.dataone.client.rest.RestClient]
20151117-10:33:10: [INFO]: rest call info: HEAD https://mn-dev-ucsb-2.test.dataone.org/metacat/d1/mn/v2/object/Test20153212338722_path-unicode-ascii-escaped-double-%252F%252Fcase [org.dataone.client.rest.RestClient]
20151117-10:33:13: [INFO]: rest call info: HEAD https://mn-dev-ucsb-2.test.dataone.org/metacat/d1/mn/v2/object/Test201532123310692_path-unicode-ascii-escaped-double-trailing%252F%252F [org.dataone.client.rest.RestClient]
20151117-10:33:14: [INFO]: rest call info: HEAD https://mn-dev-ucsb-2.test.dataone.org/metacat/d1/mn/v2/object/Test201532123313432_common-unicode-bmp-1byte-escaped-%C2%A1%C2%A2%C2%A3 [org.dataone.client.rest.RestClient]
20151117-10:33:15: [INFO]: rest call info: HEAD https://mn-dev-ucsb-2.test.dataone.org/metacat/d1/mn/v2/object/Test201532123314171_common-unicode-bmp-2byte-escaped-%E4%A6%B9%E4%A6%BA [org.dataone.client.rest.RestClient]
20151117-10:33:17: [INFO]: rest call info: HEAD https://mn-dev-ucsb-2.test.dataone.org/metacat/d1/mn/v2/object/Test201532123315475_common-ascii-doc-example-urn:lsid:ubio.org:namebank:11815 [org.dataone.client.rest.RestClient]
20151117-10:33:18: [INFO]: rest call info: HEAD https://mn-dev-ucsb-2.test.dataone.org/metacat/d1/mn/v2/object/Test201532123317759_path-ascii-doc-example-10.1000%2F182 [org.dataone.client.rest.RestClient]
20151117-10:33:19: [INFO]: rest call info: HEAD https://mn-dev-ucsb-2.test.dataone.org/metacat/d1/mn/v2/object/Test201532123318520_path-ascii-doc-example-http:%2F%2Fexample.com%2Fdata%2Fmydata%3Frow=24 [org.dataone.client.rest.RestClient]
20151117-10:33:20: [INFO]: rest call info: HEAD https://mn-dev-ucsb-2.test.dataone.org/metacat/d1/mn/v2/object/Test201532123319280_common-bmp-doc-example-%E0%B8%89%E0%B8%B1%E0%B8%99%E0%B8%81%E0%B8%B4%E0%B8%99%E0%B8%81%E0%B8%A3%E0%B8%B0%E0%B8%88%E0%B8%81%E0%B9%84%E0%B8%94%E0%B9%89 [org.dataone.client.rest.RestClient]
20151117-10:33:20: [INFO]: rest call info: HEAD https://mn-dev-ucsb-2.test.dataone.org/metacat/d1/mn/v2/object/Test20153212332031_common-bmp-doc-example-Is_f%C3%A9idir_liom_ithe_gloine [org.dataone.client.rest.RestClient]
20151117-10:33:20: [INFO]: 
***************** running test for Testing IdentifierEncoding - setting up identifiers to check ***************** [org.dataone.integration.ContextAwareTestCaseDataone]
20151117-10:33:20: [INFO]: 
***************** running test for testDescribe_IdentifierEncoding() vs. node: https://mn-dev-unm-2.test.dataone.org/metacat/d1/mn/v2 ***************** [org.dataone.integration.ContextAwareTestCaseDataone]
20151117-10:33:20: [INFO]: 
***************** running test for   Node:: https://mn-dev-unm-2.test.dataone.org/metacat/d1/mn/v2 ***************** [org.dataone.integration.ContextAwareTestCaseDataone]
20151117-10:33:21: [INFO]: rest call info: HEAD https://mn-dev-unm-2.test.dataone.org/metacat/d1/mn/v2/object/Test201532123320782_common-unicode-ascii-safe-ABCDEFGHIJKLMNOPQRSTUVWXYZ [org.dataone.client.rest.RestClient]
20151117-10:33:21: [INFO]: rest call info: HEAD https://mn-dev-unm-2.test.dataone.org/metacat/d1/mn/v2/object/Test20153212332132_common-unicode-ascii-safe-abcdefghijklmnopqrstuvwxyz [org.dataone.client.rest.RestClient]
20151117-10:33:21: [INFO]: rest call info: HEAD https://mn-dev-unm-2.test.dataone.org/metacat/d1/mn/v2/object/Test20153212332169_common-unicode-ascii-safe-0123456789 [org.dataone.client.rest.RestClient]
20151117-10:33:21: [INFO]: rest call info: HEAD https://mn-dev-unm-2.test.dataone.org/metacat/d1/mn/v2/object/Test201532123321105_common-unicode-ascii-safe-:@$-_.!*()',~ [org.dataone.client.rest.RestClient]
20151117-10:33:21: [INFO]: rest call info: HEAD https://mn-dev-unm-2.test.dataone.org/metacat/d1/mn/v2/object/Test201532123321152_common-unicode-ascii-safe-unreserved-._~ [org.dataone.client.rest.RestClient]
20151117-10:33:21: [INFO]: rest call info: HEAD https://mn-dev-unm-2.test.dataone.org/metacat/d1/mn/v2/object/Test201532123321197_common-unicode-ascii-safe-sub-delims-$!*()', [org.dataone.client.rest.RestClient]
20151117-10:33:21: [INFO]: rest call info: HEAD https://mn-dev-unm-2.test.dataone.org/metacat/d1/mn/v2/object/Test201532123321236_common-unicode-ascii-safe-gen-delims-:@ [org.dataone.client.rest.RestClient]
20151117-10:33:21: [INFO]: rest call info: HEAD https://mn-dev-unm-2.test.dataone.org/metacat/d1/mn/v2/object/Test201532123321278_common-unicode-ascii-escaped-%22%23%3C%3E%5B%5D%5E%60%7B%7D%7C [org.dataone.client.rest.RestClient]
20151117-10:33:21: [INFO]: rest call info: HEAD https://mn-dev-unm-2.test.dataone.org/metacat/d1/mn/v2/object/Test201532123321333_common-unicode-ascii-escaped-tomcatBlocked-%5C [org.dataone.client.rest.RestClient]
20151117-10:33:21: [INFO]: rest call info: HEAD https://mn-dev-unm-2.test.dataone.org/metacat/d1/mn/v2/object/Test201532123321372_common-unicode-ascii-escaped-tomcatBlocked-%255C [org.dataone.client.rest.RestClient]
20151117-10:33:21: [INFO]: rest call info: HEAD https://mn-dev-unm-2.test.dataone.org/metacat/d1/mn/v2/object/Test201532123321408_common-unicode-ascii-semi-colon-test-%253B [org.dataone.client.rest.RestClient]
20151117-10:33:21: [INFO]: rest call info: HEAD https://mn-dev-unm-2.test.dataone.org/metacat/d1/mn/v2/object/Test201532123321458_common-unicode-ascii-escaped-%25 [org.dataone.client.rest.RestClient]
20151117-10:33:21: [INFO]: rest call info: HEAD https://mn-dev-unm-2.test.dataone.org/metacat/d1/mn/v2/object/Test201532123321499_common-unicode-ascii-escape-anyway-%2B [org.dataone.client.rest.RestClient]
20151117-10:33:21: [INFO]: rest call info: HEAD https://mn-dev-unm-2.test.dataone.org/metacat/d1/mn/v2/object/Test201532123321537_path-unicode-ascii-safe-&=&= [org.dataone.client.rest.RestClient]
20151117-10:33:21: [INFO]: rest call info: HEAD https://mn-dev-unm-2.test.dataone.org/metacat/d1/mn/v2/object/Test201532123321572_path-unicode-ascii-escaped-%3B [org.dataone.client.rest.RestClient]
20151117-10:33:21: [INFO]: rest call info: HEAD https://mn-dev-unm-2.test.dataone.org/metacat/d1/mn/v2/object/Test201532123321617_path-unicode-ascii-escaped-%3F [org.dataone.client.rest.RestClient]
20151117-10:33:21: [INFO]: rest call info: HEAD https://mn-dev-unm-2.test.dataone.org/metacat/d1/mn/v2/object/Test201532123321659_path-unicode-ascii-escaped-%2F [org.dataone.client.rest.RestClient]
20151117-10:33:21: [INFO]: rest call info: HEAD https://mn-dev-unm-2.test.dataone.org/metacat/d1/mn/v2/object/Test201532123321706_path-unicode-ascii-escaped-%253F [org.dataone.client.rest.RestClient]
20151117-10:33:21: [INFO]: rest call info: HEAD https://mn-dev-unm-2.test.dataone.org/metacat/d1/mn/v2/object/Test201532123321747_path-unicode-ascii-escaped-%252F [org.dataone.client.rest.RestClient]
20151117-10:33:21: [INFO]: rest call info: HEAD https://mn-dev-unm-2.test.dataone.org/metacat/d1/mn/v2/object/Test201532123321798_path-unicode-ascii-escaped-double-%2F%2Fcase [org.dataone.client.rest.RestClient]
20151117-10:33:21: [INFO]: rest call info: HEAD https://mn-dev-unm-2.test.dataone.org/metacat/d1/mn/v2/object/Test201532123321843_path-unicode-ascii-escaped-double-trailing%2F%2F [org.dataone.client.rest.RestClient]
20151117-10:33:21: [INFO]: rest call info: HEAD https://mn-dev-unm-2.test.dataone.org/metacat/d1/mn/v2/object/Test201532123321886_path-unicode-ascii-escaped-double-%252F%252Fcase [org.dataone.client.rest.RestClient]
20151117-10:33:21: [INFO]: rest call info: HEAD https://mn-dev-unm-2.test.dataone.org/metacat/d1/mn/v2/object/Test201532123321943_path-unicode-ascii-escaped-double-trailing%252F%252F [org.dataone.client.rest.RestClient]
20151117-10:33:22: [INFO]: rest call info: HEAD https://mn-dev-unm-2.test.dataone.org/metacat/d1/mn/v2/object/Test201532123321991_common-unicode-bmp-1byte-escaped-%C2%A1%C2%A2%C2%A3 [org.dataone.client.rest.RestClient]
20151117-10:33:22: [INFO]: rest call info: HEAD https://mn-dev-unm-2.test.dataone.org/metacat/d1/mn/v2/object/Test20153212332231_common-unicode-bmp-2byte-escaped-%E4%A6%B9%E4%A6%BA [org.dataone.client.rest.RestClient]
20151117-10:33:22: [INFO]: rest call info: HEAD https://mn-dev-unm-2.test.dataone.org/metacat/d1/mn/v2/object/Test20153212332275_common-ascii-doc-example-urn:lsid:ubio.org:namebank:11815 [org.dataone.client.rest.RestClient]
20151117-10:33:22: [INFO]: rest call info: HEAD https://mn-dev-unm-2.test.dataone.org/metacat/d1/mn/v2/object/Test201532123322131_path-ascii-doc-example-10.1000%2F182 [org.dataone.client.rest.RestClient]
20151117-10:33:22: [INFO]: rest call info: HEAD https://mn-dev-unm-2.test.dataone.org/metacat/d1/mn/v2/object/Test201532123322171_path-ascii-doc-example-http:%2F%2Fexample.com%2Fdata%2Fmydata%3Frow=24 [org.dataone.client.rest.RestClient]
20151117-10:33:22: [INFO]: rest call info: HEAD https://mn-dev-unm-2.test.dataone.org/metacat/d1/mn/v2/object/Test201532123322213_common-bmp-doc-example-%E0%B8%89%E0%B8%B1%E0%B8%99%E0%B8%81%E0%B8%B4%E0%B8%99%E0%B8%81%E0%B8%A3%E0%B8%B0%E0%B8%88%E0%B8%81%E0%B9%84%E0%B8%94%E0%B9%89 [org.dataone.client.rest.RestClient]
20151117-10:33:22: [INFO]: rest call info: HEAD https://mn-dev-unm-2.test.dataone.org/metacat/d1/mn/v2/object/Test201532123322254_common-bmp-doc-example-Is_f%C3%A9idir_liom_ithe_gloine [org.dataone.client.rest.RestClient]
20151117-10:33:22: [INFO]: **************************************************** [org.dataone.integration.ContextAwareTestCaseDataone]
20151117-10:33:22: [INFO]: ***  context label:   DEV2 [org.dataone.integration.ContextAwareTestCaseDataone]
20151117-10:33:22: [INFO]: **************************************************** [org.dataone.integration.ContextAwareTestCaseDataone]
20151117-10:33:22: [INFO]: **************************************************** [org.dataone.integration.ContextAwareTestCaseDataone]
20151117-10:33:24: [INFO]: rest call info: GET https://mn-dev-ucsb-1.test.dataone.org/metacat/d1/mn/v2/monitor/ping [org.dataone.client.rest.RestClient]
20151117-10:33:24: [INFO]: MN excluded from test: https://mn-dev-ucsb-1.test.dataone.org/metacat/d1/mn [org.dataone.integration.ContextAwareTestCaseDataone]
20151117-10:33:25: [INFO]: rest call info: GET https://mn-dev-ucsb-2.test.dataone.org/metacat/d1/mn/v2/monitor/ping [org.dataone.client.rest.RestClient]
20151117-10:33:25: [INFO]: MN included in test: https://mn-dev-ucsb-2.test.dataone.org/metacat/d1/mn [org.dataone.integration.ContextAwareTestCaseDataone]
20151117-10:33:25: [INFO]: rest call info: GET https://mn-dev-unm-1.test.dataone.org/metacat/d1/mn/v2/monitor/ping [org.dataone.client.rest.RestClient]
20151117-10:33:25: [INFO]: MN excluded from test: https://mn-dev-unm-1.test.dataone.org/metacat/d1/mn [org.dataone.integration.ContextAwareTestCaseDataone]
20151117-10:33:25: [INFO]: rest call info: GET https://mn-dev-unm-2.test.dataone.org/metacat/d1/mn/v2/monitor/ping [org.dataone.client.rest.RestClient]
20151117-10:33:25: [INFO]: MN included in test: https://mn-dev-unm-2.test.dataone.org/metacat/d1/mn [org.dataone.integration.ContextAwareTestCaseDataone]
20151117-10:33:25: [INFO]: 
***************** running test for testGetChecksum() vs. node: https://mn-dev-ucsb-2.test.dataone.org/metacat/d1/mn/v2 ***************** [org.dataone.integration.ContextAwareTestCaseDataone]
20151117-10:33:26: [INFO]: rest call info: GET https://mn-dev-ucsb-2.test.dataone.org/metacat/d1/mn/v2/meta/TierTesting:mn-dev-ucsb-2:Public_READ.14 [org.dataone.client.rest.RestClient]
20151117-10:33:26: [INFO]:  ====>>>>> pid of procured test Object: TierTesting:mn-dev-ucsb-2:Public_READ.14 [org.dataone.integration.ContextAwareTestCaseDataone]
20151117-10:33:26: [INFO]: rest call info: GET https://mn-dev-ucsb-2.test.dataone.org/metacat/d1/mn/v2/checksum/TierTesting:mn-dev-ucsb-2:Public_READ.14?checksumAlgorithm=MD5 [org.dataone.client.rest.RestClient]
20151117-10:33:26: [INFO]: 
***************** running test for testGetChecksum() vs. node: https://mn-dev-unm-2.test.dataone.org/metacat/d1/mn/v2 ***************** [org.dataone.integration.ContextAwareTestCaseDataone]
20151117-10:33:26: [INFO]: rest call info: GET https://mn-dev-unm-2.test.dataone.org/metacat/d1/mn/v2/meta/TierTesting:mn-dev-unm-2:Public_READ.14 [org.dataone.client.rest.RestClient]
20151117-10:33:26: [INFO]:  ====>>>>> pid of procured test Object: TierTesting:mn-dev-unm-2:Public_READ.14 [org.dataone.integration.ContextAwareTestCaseDataone]
20151117-10:33:26: [INFO]: rest call info: GET https://mn-dev-unm-2.test.dataone.org/metacat/d1/mn/v2/checksum/TierTesting:mn-dev-unm-2:Public_READ.14?checksumAlgorithm=MD5 [org.dataone.client.rest.RestClient]
20151117-10:33:26: [INFO]: **************************************************** [org.dataone.integration.ContextAwareTestCaseDataone]
20151117-10:33:26: [INFO]: ***  context label:   DEV2 [org.dataone.integration.ContextAwareTestCaseDataone]
20151117-10:33:26: [INFO]: **************************************************** [org.dataone.integration.ContextAwareTestCaseDataone]
20151117-10:33:26: [INFO]: **************************************************** [org.dataone.integration.ContextAwareTestCaseDataone]
20151117-10:33:29: [INFO]: rest call info: GET https://mn-dev-ucsb-1.test.dataone.org/metacat/d1/mn/v2/monitor/ping [org.dataone.client.rest.RestClient]
20151117-10:33:29: [INFO]: MN excluded from test: https://mn-dev-ucsb-1.test.dataone.org/metacat/d1/mn [org.dataone.integration.ContextAwareTestCaseDataone]
20151117-10:33:30: [INFO]: rest call info: GET https://mn-dev-ucsb-2.test.dataone.org/metacat/d1/mn/v2/monitor/ping [org.dataone.client.rest.RestClient]
20151117-10:33:30: [INFO]: MN included in test: https://mn-dev-ucsb-2.test.dataone.org/metacat/d1/mn [org.dataone.integration.ContextAwareTestCaseDataone]
20151117-10:33:30: [INFO]: rest call info: GET https://mn-dev-unm-1.test.dataone.org/metacat/d1/mn/v2/monitor/ping [org.dataone.client.rest.RestClient]
20151117-10:33:30: [INFO]: MN excluded from test: https://mn-dev-unm-1.test.dataone.org/metacat/d1/mn [org.dataone.integration.ContextAwareTestCaseDataone]
20151117-10:33:30: [INFO]: rest call info: GET https://mn-dev-unm-2.test.dataone.org/metacat/d1/mn/v2/monitor/ping [org.dataone.client.rest.RestClient]
20151117-10:33:30: [INFO]: MN included in test: https://mn-dev-unm-2.test.dataone.org/metacat/d1/mn [org.dataone.integration.ContextAwareTestCaseDataone]
20151117-10:33:30: [INFO]: 
***************** running test for testGetChecksum() vs. node: https://mn-dev-ucsb-2.test.dataone.org/metacat/d1/mn/v2 ***************** [org.dataone.integration.ContextAwareTestCaseDataone]
20151117-10:33:30: [INFO]: rest call info: GET https://mn-dev-ucsb-2.test.dataone.org/metacat/d1/mn/v2/checksum/TestingNotFound:20153212333030 [org.dataone.client.rest.RestClient]
20151117-10:33:30: [INFO]: 
***************** running test for testGetChecksum() vs. node: https://mn-dev-unm-2.test.dataone.org/metacat/d1/mn/v2 ***************** [org.dataone.integration.ContextAwareTestCaseDataone]
20151117-10:33:30: [INFO]: rest call info: GET https://mn-dev-unm-2.test.dataone.org/metacat/d1/mn/v2/checksum/TestingNotFound:201532123330291 [org.dataone.client.rest.RestClient]
20151117-10:33:30: [INFO]: **************************************************** [org.dataone.integration.ContextAwareTestCaseDataone]
20151117-10:33:30: [INFO]: ***  context label:   DEV2 [org.dataone.integration.ContextAwareTestCaseDataone]
20151117-10:33:30: [INFO]: **************************************************** [org.dataone.integration.ContextAwareTestCaseDataone]
20151117-10:33:30: [INFO]: **************************************************** [org.dataone.integration.ContextAwareTestCaseDataone]
20151117-10:33:31: [INFO]: rest call info: GET https://mn-dev-ucsb-1.test.dataone.org/metacat/d1/mn/v2/monitor/ping [org.dataone.client.rest.RestClient]
20151117-10:33:31: [INFO]: MN excluded from test: https://mn-dev-ucsb-1.test.dataone.org/metacat/d1/mn [org.dataone.integration.ContextAwareTestCaseDataone]
20151117-10:33:31: [INFO]: rest call info: GET https://mn-dev-ucsb-2.test.dataone.org/metacat/d1/mn/v2/monitor/ping [org.dataone.client.rest.RestClient]
20151117-10:33:31: [INFO]: MN included in test: https://mn-dev-ucsb-2.test.dataone.org/metacat/d1/mn [org.dataone.integration.ContextAwareTestCaseDataone]
20151117-10:33:31: [INFO]: rest call info: GET https://mn-dev-unm-1.test.dataone.org/metacat/d1/mn/v2/monitor/ping [org.dataone.client.rest.RestClient]
20151117-10:33:31: [INFO]: MN excluded from test: https://mn-dev-unm-1.test.dataone.org/metacat/d1/mn [org.dataone.integration.ContextAwareTestCaseDataone]
20151117-10:33:31: [INFO]: rest call info: GET https://mn-dev-unm-2.test.dataone.org/metacat/d1/mn/v2/monitor/ping [org.dataone.client.rest.RestClient]
20151117-10:33:31: [INFO]: MN included in test: https://mn-dev-unm-2.test.dataone.org/metacat/d1/mn [org.dataone.integration.ContextAwareTestCaseDataone]
20151117-10:33:31: [INFO]: 
***************** running test for Testing IdentifierEncoding - setting up identifiers to check ***************** [org.dataone.integration.ContextAwareTestCaseDataone]
20151117-10:33:31: [INFO]: 
***************** running test for testGetChecksum_IdentifierEncoding() vs. node: https://mn-dev-ucsb-2.test.dataone.org/metacat/d1/mn/v2 ***************** [org.dataone.integration.ContextAwareTestCaseDataone]
20151117-10:33:31: [INFO]: 
***************** running test for   Node:: https://mn-dev-ucsb-2.test.dataone.org/metacat/d1/mn/v2 ***************** [org.dataone.integration.ContextAwareTestCaseDataone]
20151117-10:33:31: [INFO]: rest call info: GET https://mn-dev-ucsb-2.test.dataone.org/metacat/d1/mn/v2/checksum/Test201532123331736_common-unicode-ascii-safe-ABCDEFGHIJKLMNOPQRSTUVWXYZ [org.dataone.client.rest.RestClient]
20151117-10:33:32: [INFO]: rest call info: GET https://mn-dev-ucsb-2.test.dataone.org/metacat/d1/mn/v2/checksum/Test201532123331999_common-unicode-ascii-safe-abcdefghijklmnopqrstuvwxyz [org.dataone.client.rest.RestClient]
20151117-10:33:32: [INFO]: rest call info: GET https://mn-dev-ucsb-2.test.dataone.org/metacat/d1/mn/v2/checksum/Test201532123332247_common-unicode-ascii-safe-0123456789 [org.dataone.client.rest.RestClient]
20151117-10:33:32: [INFO]: rest call info: GET https://mn-dev-ucsb-2.test.dataone.org/metacat/d1/mn/v2/checksum/Test201532123332497_common-unicode-ascii-safe-:@$-_.!*()',~ [org.dataone.client.rest.RestClient]
20151117-10:33:33: [INFO]: rest call info: GET https://mn-dev-ucsb-2.test.dataone.org/metacat/d1/mn/v2/checksum/Test201532123332755_common-unicode-ascii-safe-unreserved-._~ [org.dataone.client.rest.RestClient]
20151117-10:33:33: [INFO]: rest call info: GET https://mn-dev-ucsb-2.test.dataone.org/metacat/d1/mn/v2/checksum/Test20153212333334_common-unicode-ascii-safe-sub-delims-$!*()', [org.dataone.client.rest.RestClient]
20151117-10:33:33: [INFO]: rest call info: GET https://mn-dev-ucsb-2.test.dataone.org/metacat/d1/mn/v2/checksum/Test201532123333291_common-unicode-ascii-safe-gen-delims-:@ [org.dataone.client.rest.RestClient]
20151117-10:33:34: [INFO]: rest call info: GET https://mn-dev-ucsb-2.test.dataone.org/metacat/d1/mn/v2/checksum/Test201532123333542_common-unicode-ascii-escaped-%22%23%3C%3E%5B%5D%5E%60%7B%7D%7C [org.dataone.client.rest.RestClient]
20151117-10:33:34: [INFO]: rest call info: GET https://mn-dev-ucsb-2.test.dataone.org/metacat/d1/mn/v2/checksum/Test201532123334708_common-unicode-ascii-escaped-tomcatBlocked-%5C [org.dataone.client.rest.RestClient]
20151117-10:33:36: [INFO]: rest call info: GET https://mn-dev-ucsb-2.test.dataone.org/metacat/d1/mn/v2/checksum/Test201532123334961_common-unicode-ascii-escaped-tomcatBlocked-%255C [org.dataone.client.rest.RestClient]
20151117-10:33:36: [INFO]: rest call info: GET https://mn-dev-ucsb-2.test.dataone.org/metacat/d1/mn/v2/checksum/Test201532123336106_common-unicode-ascii-semi-colon-test-%253B [org.dataone.client.rest.RestClient]
20151117-10:33:36: [INFO]: rest call info: GET https://mn-dev-ucsb-2.test.dataone.org/metacat/d1/mn/v2/checksum/Test201532123336357_common-unicode-ascii-escaped-%25 [org.dataone.client.rest.RestClient]
20151117-10:33:36: [INFO]: rest call info: GET https://mn-dev-ucsb-2.test.dataone.org/metacat/d1/mn/v2/checksum/Test201532123336631_common-unicode-ascii-escape-anyway-%2B [org.dataone.client.rest.RestClient]
20151117-10:33:37: [INFO]: rest call info: GET https://mn-dev-ucsb-2.test.dataone.org/metacat/d1/mn/v2/checksum/Test201532123336890_path-unicode-ascii-safe-&=&= [org.dataone.client.rest.RestClient]
20151117-10:33:38: [INFO]: rest call info: GET https://mn-dev-ucsb-2.test.dataone.org/metacat/d1/mn/v2/checksum/Test201532123337587_path-unicode-ascii-escaped-%3B [org.dataone.client.rest.RestClient]
20151117-10:33:38: [INFO]: rest call info: GET https://mn-dev-ucsb-2.test.dataone.org/metacat/d1/mn/v2/checksum/Test201532123338726_path-unicode-ascii-escaped-%3F [org.dataone.client.rest.RestClient]
20151117-10:33:39: [INFO]: rest call info: GET https://mn-dev-ucsb-2.test.dataone.org/metacat/d1/mn/v2/checksum/Test201532123338981_path-unicode-ascii-escaped-%2F [org.dataone.client.rest.RestClient]
20151117-10:33:39: [INFO]: rest call info: GET https://mn-dev-ucsb-2.test.dataone.org/metacat/d1/mn/v2/checksum/Test201532123339673_path-unicode-ascii-escaped-%253F [org.dataone.client.rest.RestClient]
20151117-10:33:40: [INFO]: rest call info: GET https://mn-dev-ucsb-2.test.dataone.org/metacat/d1/mn/v2/checksum/Test201532123339925_path-unicode-ascii-escaped-%252F [org.dataone.client.rest.RestClient]
20151117-10:33:40: [INFO]: rest call info: GET https://mn-dev-ucsb-2.test.dataone.org/metacat/d1/mn/v2/checksum/Test201532123340633_path-unicode-ascii-escaped-double-%2F%2Fcase [org.dataone.client.rest.RestClient]
20151117-10:33:41: [INFO]: rest call info: GET https://mn-dev-ucsb-2.test.dataone.org/metacat/d1/mn/v2/checksum/Test201532123340887_path-unicode-ascii-escaped-double-trailing%2F%2F [org.dataone.client.rest.RestClient]
20151117-10:33:41: [INFO]: rest call info: GET https://mn-dev-ucsb-2.test.dataone.org/metacat/d1/mn/v2/checksum/Test201532123341137_path-unicode-ascii-escaped-double-%252F%252Fcase [org.dataone.client.rest.RestClient]
20151117-10:33:42: [INFO]: rest call info: GET https://mn-dev-ucsb-2.test.dataone.org/metacat/d1/mn/v2/checksum/Test201532123341832_path-unicode-ascii-escaped-double-trailing%252F%252F [org.dataone.client.rest.RestClient]
20151117-10:33:42: [INFO]: rest call info: GET https://mn-dev-ucsb-2.test.dataone.org/metacat/d1/mn/v2/checksum/Test20153212334291_common-unicode-bmp-1byte-escaped-%C2%A1%C2%A2%C2%A3 [org.dataone.client.rest.RestClient]
20151117-10:33:43: [INFO]: rest call info: GET https://mn-dev-ucsb-2.test.dataone.org/metacat/d1/mn/v2/checksum/Test201532123342780_common-unicode-bmp-2byte-escaped-%E4%A6%B9%E4%A6%BA [org.dataone.client.rest.RestClient]
20151117-10:33:44: [INFO]: rest call info: GET https://mn-dev-ucsb-2.test.dataone.org/metacat/d1/mn/v2/checksum/Test201532123343920_common-ascii-doc-example-urn:lsid:ubio.org:namebank:11815 [org.dataone.client.rest.RestClient]
20151117-10:33:44: [INFO]: rest call info: GET https://mn-dev-ucsb-2.test.dataone.org/metacat/d1/mn/v2/checksum/Test201532123344187_path-ascii-doc-example-10.1000%2F182 [org.dataone.client.rest.RestClient]
20151117-10:33:45: [INFO]: rest call info: GET https://mn-dev-ucsb-2.test.dataone.org/metacat/d1/mn/v2/checksum/Test201532123344437_path-ascii-doc-example-http:%2F%2Fexample.com%2Fdata%2Fmydata%3Frow=24 [org.dataone.client.rest.RestClient]
20151117-10:33:45: [INFO]: rest call info: GET https://mn-dev-ucsb-2.test.dataone.org/metacat/d1/mn/v2/checksum/Test201532123345137_common-bmp-doc-example-%E0%B8%89%E0%B8%B1%E0%B8%99%E0%B8%81%E0%B8%B4%E0%B8%99%E0%B8%81%E0%B8%A3%E0%B8%B0%E0%B8%88%E0%B8%81%E0%B9%84%E0%B8%94%E0%B9%89 [org.dataone.client.rest.RestClient]
20151117-10:33:45: [INFO]: rest call info: GET https://mn-dev-ucsb-2.test.dataone.org/metacat/d1/mn/v2/checksum/Test201532123345385_common-bmp-doc-example-Is_f%C3%A9idir_liom_ithe_gloine [org.dataone.client.rest.RestClient]
20151117-10:33:45: [INFO]: 
***************** running test for Testing IdentifierEncoding - setting up identifiers to check ***************** [org.dataone.integration.ContextAwareTestCaseDataone]
20151117-10:33:45: [INFO]: 
***************** running test for testGetChecksum_IdentifierEncoding() vs. node: https://mn-dev-unm-2.test.dataone.org/metacat/d1/mn/v2 ***************** [org.dataone.integration.ContextAwareTestCaseDataone]
20151117-10:33:45: [INFO]: 
***************** running test for   Node:: https://mn-dev-unm-2.test.dataone.org/metacat/d1/mn/v2 ***************** [org.dataone.integration.ContextAwareTestCaseDataone]
20151117-10:33:45: [INFO]: rest call info: GET https://mn-dev-unm-2.test.dataone.org/metacat/d1/mn/v2/checksum/Test201532123345638_common-unicode-ascii-safe-ABCDEFGHIJKLMNOPQRSTUVWXYZ [org.dataone.client.rest.RestClient]
20151117-10:33:45: [INFO]: rest call info: GET https://mn-dev-unm-2.test.dataone.org/metacat/d1/mn/v2/checksum/Test201532123345658_common-unicode-ascii-safe-abcdefghijklmnopqrstuvwxyz [org.dataone.client.rest.RestClient]
20151117-10:33:45: [INFO]: rest call info: GET https://mn-dev-unm-2.test.dataone.org/metacat/d1/mn/v2/checksum/Test201532123345672_common-unicode-ascii-safe-0123456789 [org.dataone.client.rest.RestClient]
20151117-10:33:45: [INFO]: rest call info: GET https://mn-dev-unm-2.test.dataone.org/metacat/d1/mn/v2/checksum/Test201532123345689_common-unicode-ascii-safe-:@$-_.!*()',~ [org.dataone.client.rest.RestClient]
20151117-10:33:45: [INFO]: rest call info: GET https://mn-dev-unm-2.test.dataone.org/metacat/d1/mn/v2/checksum/Test201532123345706_common-unicode-ascii-safe-unreserved-._~ [org.dataone.client.rest.RestClient]
20151117-10:33:45: [INFO]: rest call info: GET https://mn-dev-unm-2.test.dataone.org/metacat/d1/mn/v2/checksum/Test201532123345720_common-unicode-ascii-safe-sub-delims-$!*()', [org.dataone.client.rest.RestClient]
20151117-10:33:45: [INFO]: rest call info: GET https://mn-dev-unm-2.test.dataone.org/metacat/d1/mn/v2/checksum/Test201532123345733_common-unicode-ascii-safe-gen-delims-:@ [org.dataone.client.rest.RestClient]
20151117-10:33:45: [INFO]: rest call info: GET https://mn-dev-unm-2.test.dataone.org/metacat/d1/mn/v2/checksum/Test201532123345747_common-unicode-ascii-escaped-%22%23%3C%3E%5B%5D%5E%60%7B%7D%7C [org.dataone.client.rest.RestClient]
20151117-10:33:45: [INFO]: rest call info: GET https://mn-dev-unm-2.test.dataone.org/metacat/d1/mn/v2/checksum/Test201532123345761_common-unicode-ascii-escaped-tomcatBlocked-%5C [org.dataone.client.rest.RestClient]
20151117-10:33:45: [INFO]: rest call info: GET https://mn-dev-unm-2.test.dataone.org/metacat/d1/mn/v2/checksum/Test201532123345776_common-unicode-ascii-escaped-tomcatBlocked-%255C [org.dataone.client.rest.RestClient]
20151117-10:33:45: [INFO]: rest call info: GET https://mn-dev-unm-2.test.dataone.org/metacat/d1/mn/v2/checksum/Test201532123345789_common-unicode-ascii-semi-colon-test-%253B [org.dataone.client.rest.RestClient]
20151117-10:33:45: [INFO]: rest call info: GET https://mn-dev-unm-2.test.dataone.org/metacat/d1/mn/v2/checksum/Test201532123345812_common-unicode-ascii-escaped-%25 [org.dataone.client.rest.RestClient]
20151117-10:33:45: [INFO]: rest call info: GET https://mn-dev-unm-2.test.dataone.org/metacat/d1/mn/v2/checksum/Test201532123345827_common-unicode-ascii-escape-anyway-%2B [org.dataone.client.rest.RestClient]
20151117-10:33:45: [INFO]: rest call info: GET https://mn-dev-unm-2.test.dataone.org/metacat/d1/mn/v2/checksum/Test201532123345840_path-unicode-ascii-safe-&=&= [org.dataone.client.rest.RestClient]
20151117-10:33:45: [INFO]: rest call info: GET https://mn-dev-unm-2.test.dataone.org/metacat/d1/mn/v2/checksum/Test201532123345854_path-unicode-ascii-escaped-%3B [org.dataone.client.rest.RestClient]
20151117-10:33:45: [INFO]: rest call info: GET https://mn-dev-unm-2.test.dataone.org/metacat/d1/mn/v2/checksum/Test201532123345879_path-unicode-ascii-escaped-%3F [org.dataone.client.rest.RestClient]
20151117-10:33:45: [INFO]: rest call info: GET https://mn-dev-unm-2.test.dataone.org/metacat/d1/mn/v2/checksum/Test201532123345893_path-unicode-ascii-escaped-%2F [org.dataone.client.rest.RestClient]
20151117-10:33:45: [INFO]: rest call info: GET https://mn-dev-unm-2.test.dataone.org/metacat/d1/mn/v2/checksum/Test201532123345906_path-unicode-ascii-escaped-%253F [org.dataone.client.rest.RestClient]
20151117-10:33:45: [INFO]: rest call info: GET https://mn-dev-unm-2.test.dataone.org/metacat/d1/mn/v2/checksum/Test201532123345921_path-unicode-ascii-escaped-%252F [org.dataone.client.rest.RestClient]
20151117-10:33:45: [INFO]: rest call info: GET https://mn-dev-unm-2.test.dataone.org/metacat/d1/mn/v2/checksum/Test201532123345936_path-unicode-ascii-escaped-double-%2F%2Fcase [org.dataone.client.rest.RestClient]
20151117-10:33:45: [INFO]: rest call info: GET https://mn-dev-unm-2.test.dataone.org/metacat/d1/mn/v2/checksum/Test201532123345949_path-unicode-ascii-escaped-double-trailing%2F%2F [org.dataone.client.rest.RestClient]
20151117-10:33:45: [INFO]: rest call info: GET https://mn-dev-unm-2.test.dataone.org/metacat/d1/mn/v2/checksum/Test201532123345963_path-unicode-ascii-escaped-double-%252F%252Fcase [org.dataone.client.rest.RestClient]
20151117-10:33:45: [INFO]: rest call info: GET https://mn-dev-unm-2.test.dataone.org/metacat/d1/mn/v2/checksum/Test201532123345977_path-unicode-ascii-escaped-double-trailing%252F%252F [org.dataone.client.rest.RestClient]
20151117-10:33:46: [INFO]: rest call info: GET https://mn-dev-unm-2.test.dataone.org/metacat/d1/mn/v2/checksum/Test201532123345991_common-unicode-bmp-1byte-escaped-%C2%A1%C2%A2%C2%A3 [org.dataone.client.rest.RestClient]
20151117-10:33:46: [INFO]: rest call info: GET https://mn-dev-unm-2.test.dataone.org/metacat/d1/mn/v2/checksum/Test2015321233465_common-unicode-bmp-2byte-escaped-%E4%A6%B9%E4%A6%BA [org.dataone.client.rest.RestClient]
20151117-10:33:46: [INFO]: rest call info: GET https://mn-dev-unm-2.test.dataone.org/metacat/d1/mn/v2/checksum/Test20153212334619_common-ascii-doc-example-urn:lsid:ubio.org:namebank:11815 [org.dataone.client.rest.RestClient]
20151117-10:33:46: [INFO]: rest call info: GET https://mn-dev-unm-2.test.dataone.org/metacat/d1/mn/v2/checksum/Test20153212334633_path-ascii-doc-example-10.1000%2F182 [org.dataone.client.rest.RestClient]
20151117-10:33:46: [INFO]: rest call info: GET https://mn-dev-unm-2.test.dataone.org/metacat/d1/mn/v2/checksum/Test20153212334647_path-ascii-doc-example-http:%2F%2Fexample.com%2Fdata%2Fmydata%3Frow=24 [org.dataone.client.rest.RestClient]
20151117-10:33:46: [INFO]: rest call info: GET https://mn-dev-unm-2.test.dataone.org/metacat/d1/mn/v2/checksum/Test20153212334661_common-bmp-doc-example-%E0%B8%89%E0%B8%B1%E0%B8%99%E0%B8%81%E0%B8%B4%E0%B8%99%E0%B8%81%E0%B8%A3%E0%B8%B0%E0%B8%88%E0%B8%81%E0%B9%84%E0%B8%94%E0%B9%89 [org.dataone.client.rest.RestClient]
20151117-10:33:46: [INFO]: rest call info: GET https://mn-dev-unm-2.test.dataone.org/metacat/d1/mn/v2/checksum/Test20153212334675_common-bmp-doc-example-Is_f%C3%A9idir_liom_ithe_gloine [org.dataone.client.rest.RestClient]
20151117-10:33:46: [INFO]: **************************************************** [org.dataone.integration.ContextAwareTestCaseDataone]
20151117-10:33:46: [INFO]: ***  context label:   DEV2 [org.dataone.integration.ContextAwareTestCaseDataone]
20151117-10:33:46: [INFO]: **************************************************** [org.dataone.integration.ContextAwareTestCaseDataone]
20151117-10:33:46: [INFO]: **************************************************** [org.dataone.integration.ContextAwareTestCaseDataone]
20151117-10:33:46: [INFO]: rest call info: GET https://mn-dev-ucsb-1.test.dataone.org/metacat/d1/mn/v2/monitor/ping [org.dataone.client.rest.RestClient]
20151117-10:33:46: [INFO]: MN excluded from test: https://mn-dev-ucsb-1.test.dataone.org/metacat/d1/mn [org.dataone.integration.ContextAwareTestCaseDataone]
20151117-10:33:47: [INFO]: rest call info: GET https://mn-dev-ucsb-2.test.dataone.org/metacat/d1/mn/v2/monitor/ping [org.dataone.client.rest.RestClient]
20151117-10:33:47: [INFO]: MN included in test: https://mn-dev-ucsb-2.test.dataone.org/metacat/d1/mn [org.dataone.integration.ContextAwareTestCaseDataone]
20151117-10:33:47: [INFO]: rest call info: GET https://mn-dev-unm-1.test.dataone.org/metacat/d1/mn/v2/monitor/ping [org.dataone.client.rest.RestClient]
20151117-10:33:47: [INFO]: MN excluded from test: https://mn-dev-unm-1.test.dataone.org/metacat/d1/mn [org.dataone.integration.ContextAwareTestCaseDataone]
20151117-10:33:47: [INFO]: rest call info: GET https://mn-dev-unm-2.test.dataone.org/metacat/d1/mn/v2/monitor/ping [org.dataone.client.rest.RestClient]
20151117-10:33:47: [INFO]: MN included in test: https://mn-dev-unm-2.test.dataone.org/metacat/d1/mn [org.dataone.integration.ContextAwareTestCaseDataone]
20151117-10:33:47: [INFO]: 
***************** running test for testListObjects() vs. node: https://mn-dev-ucsb-2.test.dataone.org/metacat/d1/mn/v2 ***************** [org.dataone.integration.ContextAwareTestCaseDataone]
20151117-10:33:47: [INFO]: rest call info: GET https://mn-dev-ucsb-2.test.dataone.org/metacat/d1/mn/v2/object [org.dataone.client.rest.RestClient]
20151117-10:33:55: [INFO]: rest call info: GET https://mn-dev-ucsb-2.test.dataone.org/metacat/d1/mn/v2/object?fromDate=2015-11-17T10:23:53.689%2B00:00&toDate=2015-11-17T10:32:53.689%2B00:00&formatId=text/csv&start=0&count=10 [org.dataone.client.rest.RestClient]
20151117-10:33:55: [INFO]: 
***************** running test for testListObjects() vs. node: https://mn-dev-unm-2.test.dataone.org/metacat/d1/mn/v2 ***************** [org.dataone.integration.ContextAwareTestCaseDataone]
20151117-10:33:55: [INFO]: rest call info: GET https://mn-dev-unm-2.test.dataone.org/metacat/d1/mn/v2/object [org.dataone.client.rest.RestClient]
20151117-10:33:55: [INFO]: rest call info: GET https://mn-dev-unm-2.test.dataone.org/metacat/d1/mn/v2/object?fromDate=2015-11-17T10:23:55.871%2B00:00&toDate=2015-11-17T10:32:55.871%2B00:00&formatId=text/csv&start=0&count=10 [org.dataone.client.rest.RestClient]
20151117-10:33:55: [INFO]: **************************************************** [org.dataone.integration.ContextAwareTestCaseDataone]
20151117-10:33:55: [INFO]: ***  context label:   DEV2 [org.dataone.integration.ContextAwareTestCaseDataone]
20151117-10:33:55: [INFO]: **************************************************** [org.dataone.integration.ContextAwareTestCaseDataone]
20151117-10:33:55: [INFO]: **************************************************** [org.dataone.integration.ContextAwareTestCaseDataone]
20151117-10:33:59: [INFO]: rest call info: GET https://mn-dev-ucsb-1.test.dataone.org/metacat/d1/mn/v2/monitor/ping [org.dataone.client.rest.RestClient]
20151117-10:33:59: [INFO]: MN excluded from test: https://mn-dev-ucsb-1.test.dataone.org/metacat/d1/mn [org.dataone.integration.ContextAwareTestCaseDataone]
20151117-10:34:02: [INFO]: rest call info: GET https://mn-dev-ucsb-2.test.dataone.org/metacat/d1/mn/v2/monitor/ping [org.dataone.client.rest.RestClient]
20151117-10:34:02: [INFO]: MN included in test: https://mn-dev-ucsb-2.test.dataone.org/metacat/d1/mn [org.dataone.integration.ContextAwareTestCaseDataone]
20151117-10:34:03: [INFO]: rest call info: GET https://mn-dev-unm-1.test.dataone.org/metacat/d1/mn/v2/monitor/ping [org.dataone.client.rest.RestClient]
20151117-10:34:03: [INFO]: MN excluded from test: https://mn-dev-unm-1.test.dataone.org/metacat/d1/mn [org.dataone.integration.ContextAwareTestCaseDataone]
20151117-10:34:03: [INFO]: rest call info: GET https://mn-dev-unm-2.test.dataone.org/metacat/d1/mn/v2/monitor/ping [org.dataone.client.rest.RestClient]
20151117-10:34:03: [INFO]: MN included in test: https://mn-dev-unm-2.test.dataone.org/metacat/d1/mn [org.dataone.integration.ContextAwareTestCaseDataone]
20151117-10:34:03: [INFO]: 
***************** running test for testListObjects_Slicing(...) vs. node: https://mn-dev-ucsb-2.test.dataone.org/metacat/d1/mn/v2 ***************** [org.dataone.integration.ContextAwareTestCaseDataone]
20151117-10:34:04: [INFO]: rest call info: GET https://mn-dev-ucsb-2.test.dataone.org/metacat/d1/mn/v2/object [org.dataone.client.rest.RestClient]
20151117-10:34:13: [INFO]: rest call info: GET https://mn-dev-ucsb-2.test.dataone.org/metacat/d1/mn/v2/object?start=0&count=500 [org.dataone.client.rest.RestClient]
20151117-10:34:17: [INFO]: 
***************** running test for testListObjects_Slicing(...) vs. node: https://mn-dev-unm-2.test.dataone.org/metacat/d1/mn/v2 ***************** [org.dataone.integration.ContextAwareTestCaseDataone]
20151117-10:34:17: [INFO]: rest call info: GET https://mn-dev-unm-2.test.dataone.org/metacat/d1/mn/v2/object [org.dataone.client.rest.RestClient]
20151117-10:34:18: [INFO]: rest call info: GET https://mn-dev-unm-2.test.dataone.org/metacat/d1/mn/v2/object?start=0&count=500 [org.dataone.client.rest.RestClient]
20151117-10:34:18: [INFO]: **************************************************** [org.dataone.integration.ContextAwareTestCaseDataone]
20151117-10:34:18: [INFO]: ***  context label:   DEV2 [org.dataone.integration.ContextAwareTestCaseDataone]
20151117-10:34:18: [INFO]: **************************************************** [org.dataone.integration.ContextAwareTestCaseDataone]
20151117-10:34:18: [INFO]: **************************************************** [org.dataone.integration.ContextAwareTestCaseDataone]
20151117-10:34:19: [INFO]: rest call info: GET https://mn-dev-ucsb-1.test.dataone.org/metacat/d1/mn/v2/monitor/ping [org.dataone.client.rest.RestClient]
20151117-10:34:19: [INFO]: MN excluded from test: https://mn-dev-ucsb-1.test.dataone.org/metacat/d1/mn [org.dataone.integration.ContextAwareTestCaseDataone]
20151117-10:34:21: [INFO]: rest call info: GET https://mn-dev-ucsb-2.test.dataone.org/metacat/d1/mn/v2/monitor/ping [org.dataone.client.rest.RestClient]
20151117-10:34:21: [INFO]: MN included in test: https://mn-dev-ucsb-2.test.dataone.org/metacat/d1/mn [org.dataone.integration.ContextAwareTestCaseDataone]
20151117-10:34:21: [INFO]: rest call info: GET https://mn-dev-unm-1.test.dataone.org/metacat/d1/mn/v2/monitor/ping [org.dataone.client.rest.RestClient]
20151117-10:34:21: [INFO]: MN excluded from test: https://mn-dev-unm-1.test.dataone.org/metacat/d1/mn [org.dataone.integration.ContextAwareTestCaseDataone]
20151117-10:34:21: [INFO]: rest call info: GET https://mn-dev-unm-2.test.dataone.org/metacat/d1/mn/v2/monitor/ping [org.dataone.client.rest.RestClient]
20151117-10:34:21: [INFO]: MN included in test: https://mn-dev-unm-2.test.dataone.org/metacat/d1/mn [org.dataone.integration.ContextAwareTestCaseDataone]
20151117-10:34:21: [INFO]: 
***************** running test for testListObjects_FromDateTest() vs. node: https://mn-dev-ucsb-2.test.dataone.org/metacat/d1/mn/v2 ***************** [org.dataone.integration.ContextAwareTestCaseDataone]
20151117-10:34:21: [INFO]: rest call info: GET https://mn-dev-ucsb-2.test.dataone.org/metacat/d1/mn/v2/object [org.dataone.client.rest.RestClient]
20151117-10:34:29: [INFO]: rest call info: GET https://mn-dev-ucsb-2.test.dataone.org/metacat/d1/mn/v2/object?fromDate=2015-08-25T14:55:11.340%2B00:00 [org.dataone.client.rest.RestClient]
20151117-10:34:31: [INFO]: 
***************** running test for testListObjects_FromDateTest() vs. node: https://mn-dev-unm-2.test.dataone.org/metacat/d1/mn/v2 ***************** [org.dataone.integration.ContextAwareTestCaseDataone]
20151117-10:34:31: [INFO]: rest call info: GET https://mn-dev-unm-2.test.dataone.org/metacat/d1/mn/v2/object [org.dataone.client.rest.RestClient]
20151117-10:34:31: [INFO]: rest call info: GET https://mn-dev-unm-2.test.dataone.org/metacat/d1/mn/v2/object?fromDate=2015-08-25T14:54:59.671%2B00:00 [org.dataone.client.rest.RestClient]
20151117-10:34:31: [INFO]: **************************************************** [org.dataone.integration.ContextAwareTestCaseDataone]
20151117-10:34:31: [INFO]: ***  context label:   DEV2 [org.dataone.integration.ContextAwareTestCaseDataone]
20151117-10:34:31: [INFO]: **************************************************** [org.dataone.integration.ContextAwareTestCaseDataone]
20151117-10:34:31: [INFO]: **************************************************** [org.dataone.integration.ContextAwareTestCaseDataone]
20151117-10:34:33: [INFO]: rest call info: GET https://mn-dev-ucsb-1.test.dataone.org/metacat/d1/mn/v2/monitor/ping [org.dataone.client.rest.RestClient]
20151117-10:34:33: [INFO]: MN excluded from test: https://mn-dev-ucsb-1.test.dataone.org/metacat/d1/mn [org.dataone.integration.ContextAwareTestCaseDataone]
20151117-10:34:34: [INFO]: rest call info: GET https://mn-dev-ucsb-2.test.dataone.org/metacat/d1/mn/v2/monitor/ping [org.dataone.client.rest.RestClient]
20151117-10:34:34: [INFO]: MN included in test: https://mn-dev-ucsb-2.test.dataone.org/metacat/d1/mn [org.dataone.integration.ContextAwareTestCaseDataone]
20151117-10:34:35: [INFO]: rest call info: GET https://mn-dev-unm-1.test.dataone.org/metacat/d1/mn/v2/monitor/ping [org.dataone.client.rest.RestClient]
20151117-10:34:35: [INFO]: MN excluded from test: https://mn-dev-unm-1.test.dataone.org/metacat/d1/mn [org.dataone.integration.ContextAwareTestCaseDataone]
20151117-10:34:35: [INFO]: rest call info: GET https://mn-dev-unm-2.test.dataone.org/metacat/d1/mn/v2/monitor/ping [org.dataone.client.rest.RestClient]
20151117-10:34:35: [INFO]: MN included in test: https://mn-dev-unm-2.test.dataone.org/metacat/d1/mn [org.dataone.integration.ContextAwareTestCaseDataone]
20151117-10:34:35: [INFO]: 
***************** running test for testListObjects() vs. node: https://mn-dev-ucsb-2.test.dataone.org/metacat/d1/mn/v2 ***************** [org.dataone.integration.ContextAwareTestCaseDataone]
20151117-10:34:36: [INFO]: rest call info: GET https://mn-dev-ucsb-2.test.dataone.org/metacat/d1/mn/v2/object [org.dataone.client.rest.RestClient]
20151117-10:34:43: [INFO]: rest call info: GET https://mn-dev-ucsb-2.test.dataone.org/metacat/d1/mn/v2/object?fromDate=2015-11-17T10:24:42.738%2B00:00&toDate=2015-11-17T10:33:42.738%2B00:00&formatId=text/csv&start=0&count=10 [org.dataone.client.rest.RestClient]
20151117-10:34:43: [INFO]: 
***************** running test for testListObjects() vs. node: https://mn-dev-unm-2.test.dataone.org/metacat/d1/mn/v2 ***************** [org.dataone.integration.ContextAwareTestCaseDataone]
20151117-10:34:43: [INFO]: rest call info: GET https://mn-dev-unm-2.test.dataone.org/metacat/d1/mn/v2/object [org.dataone.client.rest.RestClient]
20151117-10:34:43: [INFO]: rest call info: GET https://mn-dev-unm-2.test.dataone.org/metacat/d1/mn/v2/object?fromDate=2015-11-17T10:24:43.528%2B00:00&toDate=2015-11-17T10:33:43.528%2B00:00&formatId=text/csv&start=0&count=10 [org.dataone.client.rest.RestClient]
20151117-10:34:43: [INFO]: **************************************************** [org.dataone.integration.ContextAwareTestCaseDataone]
20151117-10:34:43: [INFO]: ***  context label:   DEV2 [org.dataone.integration.ContextAwareTestCaseDataone]
20151117-10:34:43: [INFO]: **************************************************** [org.dataone.integration.ContextAwareTestCaseDataone]
20151117-10:34:43: [INFO]: **************************************************** [org.dataone.integration.ContextAwareTestCaseDataone]
20151117-10:34:45: [INFO]: rest call info: GET https://mn-dev-ucsb-1.test.dataone.org/metacat/d1/mn/v2/monitor/ping [org.dataone.client.rest.RestClient]
20151117-10:34:46: [INFO]: MN excluded from test: https://mn-dev-ucsb-1.test.dataone.org/metacat/d1/mn [org.dataone.integration.ContextAwareTestCaseDataone]
20151117-10:34:46: [INFO]: rest call info: GET https://mn-dev-ucsb-2.test.dataone.org/metacat/d1/mn/v2/monitor/ping [org.dataone.client.rest.RestClient]
20151117-10:34:46: [INFO]: MN included in test: https://mn-dev-ucsb-2.test.dataone.org/metacat/d1/mn [org.dataone.integration.ContextAwareTestCaseDataone]
20151117-10:34:46: [INFO]: rest call info: GET https://mn-dev-unm-1.test.dataone.org/metacat/d1/mn/v2/monitor/ping [org.dataone.client.rest.RestClient]
20151117-10:34:46: [INFO]: MN excluded from test: https://mn-dev-unm-1.test.dataone.org/metacat/d1/mn [org.dataone.integration.ContextAwareTestCaseDataone]
20151117-10:34:46: [INFO]: rest call info: GET https://mn-dev-unm-2.test.dataone.org/metacat/d1/mn/v2/monitor/ping [org.dataone.client.rest.RestClient]
20151117-10:34:46: [INFO]: MN included in test: https://mn-dev-unm-2.test.dataone.org/metacat/d1/mn [org.dataone.integration.ContextAwareTestCaseDataone]
20151117-10:34:46: [INFO]: 
***************** running test for testListObjects_FormatIdFilteringFakeFormat() vs. node: https://mn-dev-ucsb-2.test.dataone.org/metacat/d1/mn/v2 ***************** [org.dataone.integration.ContextAwareTestCaseDataone]
20151117-10:34:47: [INFO]: rest call info: GET https://mn-dev-ucsb-2.test.dataone.org/metacat/d1/mn/v2/object?formatId=fake_format [org.dataone.client.rest.RestClient]
20151117-10:34:47: [INFO]: 
***************** running test for testListObjects_FormatIdFilteringFakeFormat() vs. node: https://mn-dev-unm-2.test.dataone.org/metacat/d1/mn/v2 ***************** [org.dataone.integration.ContextAwareTestCaseDataone]
20151117-10:34:47: [INFO]: rest call info: GET https://mn-dev-unm-2.test.dataone.org/metacat/d1/mn/v2/object?formatId=fake_format [org.dataone.client.rest.RestClient]
20151117-10:34:47: [INFO]: **************************************************** [org.dataone.integration.ContextAwareTestCaseDataone]
20151117-10:34:47: [INFO]: ***  context label:   DEV2 [org.dataone.integration.ContextAwareTestCaseDataone]
20151117-10:34:47: [INFO]: **************************************************** [org.dataone.integration.ContextAwareTestCaseDataone]
20151117-10:34:47: [INFO]: **************************************************** [org.dataone.integration.ContextAwareTestCaseDataone]
20151117-10:34:48: [INFO]: rest call info: GET https://mn-dev-ucsb-1.test.dataone.org/metacat/d1/mn/v2/monitor/ping [org.dataone.client.rest.RestClient]
20151117-10:34:48: [INFO]: MN excluded from test: https://mn-dev-ucsb-1.test.dataone.org/metacat/d1/mn [org.dataone.integration.ContextAwareTestCaseDataone]
20151117-10:34:50: [INFO]: rest call info: GET https://mn-dev-ucsb-2.test.dataone.org/metacat/d1/mn/v2/monitor/ping [org.dataone.client.rest.RestClient]
20151117-10:34:50: [INFO]: MN included in test: https://mn-dev-ucsb-2.test.dataone.org/metacat/d1/mn [org.dataone.integration.ContextAwareTestCaseDataone]
20151117-10:34:50: [INFO]: rest call info: GET https://mn-dev-unm-1.test.dataone.org/metacat/d1/mn/v2/monitor/ping [org.dataone.client.rest.RestClient]
20151117-10:34:50: [INFO]: MN excluded from test: https://mn-dev-unm-1.test.dataone.org/metacat/d1/mn [org.dataone.integration.ContextAwareTestCaseDataone]
20151117-10:34:50: [INFO]: rest call info: GET https://mn-dev-unm-2.test.dataone.org/metacat/d1/mn/v2/monitor/ping [org.dataone.client.rest.RestClient]
20151117-10:34:50: [INFO]: MN included in test: https://mn-dev-unm-2.test.dataone.org/metacat/d1/mn [org.dataone.integration.ContextAwareTestCaseDataone]
20151117-10:34:50: [INFO]: 
***************** running test for testSynchronizationFailed() vs. node: https://mn-dev-ucsb-2.test.dataone.org/metacat/d1/mn/v2 ***************** [org.dataone.integration.ContextAwareTestCaseDataone]
20151117-10:34:50: [INFO]: rest call info: GET https://mn-dev-ucsb-2.test.dataone.org/metacat/d1/mn/v2/meta/TierTesting:mn-dev-ucsb-2:Public_READnull [org.dataone.client.rest.RestClient]
20151117-10:34:50: [INFO]: certificate directory: /etc/dataone/client/testClientCerts/ [org.dataone.integration.ContextAwareTestCaseDataone]
20151117-10:34:50: [INFO]: certificate filename: cnDevUNM2 [org.dataone.integration.ContextAwareTestCaseDataone]
20151117-10:34:50: [INFO]: client setup as Subject: CN=urn:node:cnDevUNM2,DC=dataone,DC=org [org.dataone.integration.ContextAwareTestCaseDataone]
20151117-10:34:50: [INFO]: creating a test object.  pid = TierTesting:mn-dev-ucsb-2:Public_READnull on https://mn-dev-ucsb-2.test.dataone.org/metacat/d1/mn/v2 [org.dataone.integration.ContextAwareTestCaseDataone]
20151117-10:34:50: [INFO]: SystemMetadata for pid: TierTesting:mn-dev-ucsb-2:Public_READnull
<?xml version="1.0" encoding="UTF-8"?><d1_v2.0:systemMetadata xmlns:d1_v2.0="http://ns.dataone.org/service/types/v2.0" xmlns:d1="http://ns.dataone.org/service/types/v1"><serialVersion>1</serialVersion><identifier>TierTesting:mn-dev-ucsb-2:Public_READnull</identifier><formatId>eml://ecoinformatics.org/eml-2.0.1</formatId><size>17181</size><checksum algorithm="MD5">03ce09c6b4c3efc1681f3023402998a2</checksum><submitter>CN=urn:node:cnDevUNM2,DC=dataone,DC=org</submitter><rightsHolder>CN=testRightsHolder,DC=dataone,DC=org</rightsHolder><accessPolicy><allow><subject>public</subject><permission>read</permission></allow></accessPolicy><dateUploaded>2015-11-17T10:34:50.399+00:00</dateUploaded><dateSysMetadataModified>2015-11-17T10:34:50.399+00:00</dateSysMetadataModified><originMemberNode>urn:node:mnDevUCSB2</originMemberNode><authoritativeMemberNode>urn:node:mnDevUCSB2</authoritativeMemberNode></d1_v2.0:systemMetadata> [org.dataone.integration.ContextAwareTestCaseDataone]
20151117-10:34:50: [INFO]: rest call info: POST https://mn-dev-ucsb-2.test.dataone.org/metacat/d1/mn/v2/object; MMP message has: ParamPart:pid = TierTesting:mn-dev-ucsb-2:Public_READnull; FilePart:object = /tmp/mmp.output.8087744960419770516.tmp (17181 bytes); FilePart:sysmeta = /tmp/mmp.output.5885542854909838205.tmp (924 bytes);  [org.dataone.client.rest.RestClient]
20151117-10:34:51: [INFO]: rest call info: GET https://mn-dev-ucsb-2.test.dataone.org/metacat/d1/mn/v2/object [org.dataone.client.rest.RestClient]
20151117-10:35:01: [INFO]: rest call info: GET https://mn-dev-ucsb-2.test.dataone.org/metacat/d1/mn/v2/meta/0007f892-0d8f-4451-94e9-94d02ba5dd0d_0 [org.dataone.client.rest.RestClient]
<?xml version="1.0" encoding="UTF-8"?>
<error detailCode="0" errorCode="0" name="SynchronizationFailed" pid="0007f892-0d8f-4451-94e9-94d02ba5dd0d_0">
    <description>a message</description>
</error>

20151117-10:35:01: [INFO]: rest call info: POST https://mn-dev-ucsb-2.test.dataone.org/metacat/d1/mn/v2/error; MMP message has: FilePart:message = /tmp/mmp.output.8519354410442070243.tmp (200 bytes);  [org.dataone.client.rest.RestClient]
20151117-10:35:01: [INFO]: 
***************** running test for testSynchronizationFailed() vs. node: https://mn-dev-unm-2.test.dataone.org/metacat/d1/mn/v2 ***************** [org.dataone.integration.ContextAwareTestCaseDataone]
20151117-10:35:01: [INFO]: rest call info: GET https://mn-dev-unm-2.test.dataone.org/metacat/d1/mn/v2/meta/TierTesting:mn-dev-unm-2:Public_READnull [org.dataone.client.rest.RestClient]
20151117-10:35:01: [INFO]: certificate directory: /etc/dataone/client/testClientCerts/ [org.dataone.integration.ContextAwareTestCaseDataone]
20151117-10:35:01: [INFO]: certificate filename: cnDevUNM2 [org.dataone.integration.ContextAwareTestCaseDataone]
20151117-10:35:01: [INFO]: client setup as Subject: CN=urn:node:cnDevUNM2,DC=dataone,DC=org [org.dataone.integration.ContextAwareTestCaseDataone]
20151117-10:35:01: [INFO]: creating a test object.  pid = TierTesting:mn-dev-unm-2:Public_READnull on https://mn-dev-unm-2.test.dataone.org/metacat/d1/mn/v2 [org.dataone.integration.ContextAwareTestCaseDataone]
20151117-10:35:01: [INFO]: SystemMetadata for pid: TierTesting:mn-dev-unm-2:Public_READnull
<?xml version="1.0" encoding="UTF-8"?><d1_v2.0:systemMetadata xmlns:d1_v2.0="http://ns.dataone.org/service/types/v2.0" xmlns:d1="http://ns.dataone.org/service/types/v1"><serialVersion>1</serialVersion><identifier>TierTesting:mn-dev-unm-2:Public_READnull</identifier><formatId>eml://ecoinformatics.org/eml-2.0.1</formatId><size>17181</size><checksum algorithm="MD5">03ce09c6b4c3efc1681f3023402998a2</checksum><submitter>CN=urn:node:cnDevUNM2,DC=dataone,DC=org</submitter><rightsHolder>CN=testRightsHolder,DC=dataone,DC=org</rightsHolder><accessPolicy><allow><subject>public</subject><permission>read</permission></allow></accessPolicy><dateUploaded>2015-11-17T10:35:01.778+00:00</dateUploaded><dateSysMetadataModified>2015-11-17T10:35:01.778+00:00</dateSysMetadataModified><originMemberNode>urn:node:mnDevUNM2</originMemberNode><authoritativeMemberNode>urn:node:mnDevUNM2</authoritativeMemberNode></d1_v2.0:systemMetadata> [org.dataone.integration.ContextAwareTestCaseDataone]
20151117-10:35:01: [INFO]: rest call info: POST https://mn-dev-unm-2.test.dataone.org/metacat/d1/mn/v2/object; MMP message has: ParamPart:pid = TierTesting:mn-dev-unm-2:Public_READnull; FilePart:object = /tmp/mmp.output.2635887218774401277.tmp (17181 bytes); FilePart:sysmeta = /tmp/mmp.output.3295322587532467180.tmp (921 bytes);  [org.dataone.client.rest.RestClient]
20151117-10:35:01: [INFO]: rest call info: GET https://mn-dev-unm-2.test.dataone.org/metacat/d1/mn/v2/object [org.dataone.client.rest.RestClient]
20151117-10:35:01: [INFO]: rest call info: GET https://mn-dev-unm-2.test.dataone.org/metacat/d1/mn/v2/meta/0007f892-0d8f-4451-94e9-94d02ba5dd0d_0 [org.dataone.client.rest.RestClient]
<?xml version="1.0" encoding="UTF-8"?>
<error detailCode="0" errorCode="0" name="SynchronizationFailed" pid="0007f892-0d8f-4451-94e9-94d02ba5dd0d_0">
    <description>a message</description>
</error>

20151117-10:35:01: [INFO]: rest call info: POST https://mn-dev-unm-2.test.dataone.org/metacat/d1/mn/v2/error; MMP message has: FilePart:message = /tmp/mmp.output.1466057706206634552.tmp (200 bytes);  [org.dataone.client.rest.RestClient]
20151117-10:35:01: [INFO]: **************************************************** [org.dataone.integration.ContextAwareTestCaseDataone]
20151117-10:35:01: [INFO]: ***  context label:   DEV2 [org.dataone.integration.ContextAwareTestCaseDataone]
20151117-10:35:01: [INFO]: **************************************************** [org.dataone.integration.ContextAwareTestCaseDataone]
20151117-10:35:01: [INFO]: **************************************************** [org.dataone.integration.ContextAwareTestCaseDataone]
20151117-10:35:03: [INFO]: rest call info: GET https://mn-dev-ucsb-1.test.dataone.org/metacat/d1/mn/v2/monitor/ping [org.dataone.client.rest.RestClient]
20151117-10:35:03: [INFO]: MN excluded from test: https://mn-dev-ucsb-1.test.dataone.org/metacat/d1/mn [org.dataone.integration.ContextAwareTestCaseDataone]
20151117-10:35:07: [INFO]: rest call info: GET https://mn-dev-ucsb-2.test.dataone.org/metacat/d1/mn/v2/monitor/ping [org.dataone.client.rest.RestClient]
20151117-10:35:07: [INFO]: MN included in test: https://mn-dev-ucsb-2.test.dataone.org/metacat/d1/mn [org.dataone.integration.ContextAwareTestCaseDataone]
20151117-10:35:07: [INFO]: rest call info: GET https://mn-dev-unm-1.test.dataone.org/metacat/d1/mn/v2/monitor/ping [org.dataone.client.rest.RestClient]
20151117-10:35:07: [INFO]: MN excluded from test: https://mn-dev-unm-1.test.dataone.org/metacat/d1/mn [org.dataone.integration.ContextAwareTestCaseDataone]
20151117-10:35:07: [INFO]: rest call info: GET https://mn-dev-unm-2.test.dataone.org/metacat/d1/mn/v2/monitor/ping [org.dataone.client.rest.RestClient]
20151117-10:35:07: [INFO]: MN included in test: https://mn-dev-unm-2.test.dataone.org/metacat/d1/mn [org.dataone.integration.ContextAwareTestCaseDataone]
20151117-10:35:07: [INFO]: 
***************** running test for testGetReplica() vs. node: https://mn-dev-ucsb-2.test.dataone.org/metacat/d1/mn/v2 ***************** [org.dataone.integration.ContextAwareTestCaseDataone]
20151117-10:35:38: [INFO]: rest call info: GET https://mn-dev-ucsb-2.test.dataone.org/metacat/d1/mn/v2/meta/TierTesting:mn-dev-ucsb-2:Public_READ.14 [org.dataone.client.rest.RestClient]
20151117-10:35:40: [INFO]: rest call info: GET https://mn-dev-ucsb-2.test.dataone.org/metacat/d1/mn/v2/object [org.dataone.client.rest.RestClient]
20151117-10:36:06: [INFO]: rest call info: GET https://mn-dev-ucsb-2.test.dataone.org/metacat/d1/mn/v2/meta/0007f892-0d8f-4451-94e9-94d02ba5dd0d_0 [org.dataone.client.rest.RestClient]
20151117-10:36:36: [INFO]: rest call info: GET https://mn-dev-ucsb-2.test.dataone.org/metacat/d1/mn/v2/replica/0007f892-0d8f-4451-94e9-94d02ba5dd0d_0 [org.dataone.client.rest.RestClient]
20151117-10:36:36: [INFO]: 
***************** running test for testGetReplica() vs. node: https://mn-dev-unm-2.test.dataone.org/metacat/d1/mn/v2 ***************** [org.dataone.integration.ContextAwareTestCaseDataone]
20151117-10:36:36: [INFO]: rest call info: GET https://mn-dev-unm-2.test.dataone.org/metacat/d1/mn/v2/meta/TierTesting:mn-dev-unm-2:Public_READ.14 [org.dataone.client.rest.RestClient]
20151117-10:36:36: [INFO]:  ====>>>>> pid of procured test Object: TierTesting:mn-dev-unm-2:Public_READ.14 [org.dataone.integration.ContextAwareTestCaseDataone]
20151117-10:36:37: [INFO]: rest call info: GET https://mn-dev-unm-2.test.dataone.org/metacat/d1/mn/v2/replica/TierTesting:mn-dev-unm-2:Public_READ.14 [org.dataone.client.rest.RestClient]
20151117-10:36:37: [INFO]: **************************************************** [org.dataone.integration.ContextAwareTestCaseDataone]
20151117-10:36:37: [INFO]: ***  context label:   DEV2 [org.dataone.integration.ContextAwareTestCaseDataone]
20151117-10:36:37: [INFO]: **************************************************** [org.dataone.integration.ContextAwareTestCaseDataone]
20151117-10:36:37: [INFO]: **************************************************** [org.dataone.integration.ContextAwareTestCaseDataone]
20151117-10:36:38: [INFO]: rest call info: GET https://mn-dev-ucsb-1.test.dataone.org/metacat/d1/mn/v2/monitor/ping [org.dataone.client.rest.RestClient]
20151117-10:36:38: [INFO]: MN excluded from test: https://mn-dev-ucsb-1.test.dataone.org/metacat/d1/mn [org.dataone.integration.ContextAwareTestCaseDataone]
20151117-10:36:38: [INFO]: rest call info: GET https://mn-dev-ucsb-2.test.dataone.org/metacat/d1/mn/v2/monitor/ping [org.dataone.client.rest.RestClient]
20151117-10:36:38: [INFO]: MN included in test: https://mn-dev-ucsb-2.test.dataone.org/metacat/d1/mn [org.dataone.integration.ContextAwareTestCaseDataone]
20151117-10:36:38: [INFO]: rest call info: GET https://mn-dev-unm-1.test.dataone.org/metacat/d1/mn/v2/monitor/ping [org.dataone.client.rest.RestClient]
20151117-10:36:38: [INFO]: MN excluded from test: https://mn-dev-unm-1.test.dataone.org/metacat/d1/mn [org.dataone.integration.ContextAwareTestCaseDataone]
20151117-10:36:38: [INFO]: rest call info: GET https://mn-dev-unm-2.test.dataone.org/metacat/d1/mn/v2/monitor/ping [org.dataone.client.rest.RestClient]
20151117-10:36:38: [INFO]: MN included in test: https://mn-dev-unm-2.test.dataone.org/metacat/d1/mn [org.dataone.integration.ContextAwareTestCaseDataone]
20151117-10:36:38: [INFO]: 
***************** running test for testGetReplica_AuthenticateITKUser() vs. node: https://mn-dev-ucsb-2.test.dataone.org/metacat/d1/mn/v2 ***************** [org.dataone.integration.ContextAwareTestCaseDataone]
20151117-10:37:10: [INFO]: rest call info: GET https://mn-dev-ucsb-2.test.dataone.org/metacat/d1/mn/v2/meta/TierTesting:mn-dev-ucsb-2:Public_READ.14 [org.dataone.client.rest.RestClient]
20151117-10:37:11: [INFO]: rest call info: GET https://mn-dev-ucsb-2.test.dataone.org/metacat/d1/mn/v2/object [org.dataone.client.rest.RestClient]
20151117-10:37:46: [INFO]: rest call info: GET https://mn-dev-ucsb-2.test.dataone.org/metacat/d1/mn/v2/meta/0007f892-0d8f-4451-94e9-94d02ba5dd0d_0 [org.dataone.client.rest.RestClient]
org.dataone.integration.TestIterationEndingException: could not create a test object and attempts to find an object with a public accessRule gave the following exception: ServiceFailure:: class org.dataone.client.exception.ClientSideException: /Read timed out
	at org.dataone.integration.ContextAwareTestCaseDataone.procurePublicReadableTestObject(ContextAwareTestCaseDataone.java:820)
	at org.dataone.integration.it.testImplementations.MNReadTestImplementations.testGetReplica_ValidCertificate_NotMN(MNReadTestImplementations.java:144)
	at org.dataone.integration.it.testImplementations.MNReadTestImplementations.testGetReplica_ValidCertificate_NotMN(MNReadTestImplementations.java:130)
	at org.dataone.integration.it.apiTests.MNReadV2IT.testGetReplica_ValidCertificate_NotMN(MNReadV2IT.java:178)
	at sun.reflect.NativeMethodAccessorImpl.invoke0(Native Method)
	at sun.reflect.NativeMethodAccessorImpl.invoke(NativeMethodAccessorImpl.java:57)
	at sun.reflect.DelegatingMethodAccessorImpl.invoke(DelegatingMethodAccessorImpl.java:43)
	at java.lang.reflect.Method.invoke(Method.java:606)
	at org.junit.runners.model.FrameworkMethod$1.runReflectiveCall(FrameworkMethod.java:44)
	at org.junit.internal.runners.model.ReflectiveCallable.run(ReflectiveCallable.java:15)
	at org.junit.runners.model.FrameworkMethod.invokeExplosively(FrameworkMethod.java:41)
	at org.junit.internal.runners.statements.InvokeMethod.evaluate(InvokeMethod.java:20)
	at org.junit.rules.Verifier$1.evaluate(Verifier.java:34)
	at org.junit.internal.runners.statements.RunBefores.evaluate(RunBefores.java:28)
	at org.junit.internal.runners.statements.RunAfters.evaluate(RunAfters.java:31)
	at org.junit.runners.BlockJUnit4ClassRunner.runChild(BlockJUnit4ClassRunner.java:76)
	at org.junit.runners.BlockJUnit4ClassRunner.runChild(BlockJUnit4ClassRunner.java:50)
	at org.junit.runners.ParentRunner$3.run(ParentRunner.java:193)
	at org.junit.runners.ParentRunner$1.schedule(ParentRunner.java:52)
	at org.junit.runners.ParentRunner.runChildren(ParentRunner.java:191)
	at org.junit.runners.ParentRunner.access$000(ParentRunner.java:42)
	at org.junit.runners.ParentRunner$2.evaluate(ParentRunner.java:184)
	at org.junit.runners.ParentRunner.run(ParentRunner.java:236)
	at org.apache.maven.surefire.junit4.JUnit4TestSet.execute(JUnit4TestSet.java:53)
	at org.apache.maven.surefire.junit4.JUnit4Provider.executeTestSet(JUnit4Provider.java:119)
	at org.apache.maven.surefire.junit4.JUnit4Provider.invoke(JUnit4Provider.java:101)
	at sun.reflect.NativeMethodAccessorImpl.invoke0(Native Method)
	at sun.reflect.NativeMethodAccessorImpl.invoke(NativeMethodAccessorImpl.java:57)
	at sun.reflect.DelegatingMethodAccessorImpl.invoke(DelegatingMethodAccessorImpl.java:43)
	at java.lang.reflect.Method.invoke(Method.java:606)
	at org.apache.maven.surefire.booter.ProviderFactory$ClassLoaderProxy.invoke(ProviderFactory.java:103)
	at com.sun.proxy.$Proxy0.invoke(Unknown Source)
	at org.apache.maven.surefire.booter.SurefireStarter.invokeProvider(SurefireStarter.java:150)
	at org.apache.maven.surefire.booter.SurefireStarter.runSuitesInProcess(SurefireStarter.java:91)
	at org.apache.maven.surefire.booter.ForkedBooter.main(ForkedBooter.java:69)
Caused by: org.dataone.service.exceptions.ServiceFailure: class org.dataone.client.exception.ClientSideException: /Read timed out
	at org.dataone.client.rest.HttpMultipartRestClient.doGetRequest(HttpMultipartRestClient.java:339)
	at org.dataone.client.rest.HttpMultipartRestClient.doGetRequest(HttpMultipartRestClient.java:318)
	at org.dataone.client.v2.impl.MultipartD1Node.getSystemMetadata(MultipartD1Node.java:94)
	at org.dataone.client.v2.impl.MultipartMNode.getSystemMetadata(MultipartMNode.java:337)
	at org.dataone.integration.adapters.CommonCallAdapter.getSystemMetadata(CommonCallAdapter.java:246)
	at org.dataone.integration.ContextAwareTestCaseDataone.procurePublicReadableTestObject(ContextAwareTestCaseDataone.java:765)
	... 34 more
Caused by: org.dataone.client.exception.ClientSideException: /Read timed out
	... 40 more
Caused by: java.net.SocketTimeoutException: Read timed out
	at java.net.SocketInputStream.socketRead0(Native Method)
	at java.net.SocketInputStream.read(SocketInputStream.java:152)
	at java.net.SocketInputStream.read(SocketInputStream.java:122)
	at sun.security.ssl.InputRecord.readFully(InputRecord.java:442)
	at sun.security.ssl.InputRecord.read(InputRecord.java:480)
	at sun.security.ssl.SSLSocketImpl.readRecord(SSLSocketImpl.java:946)
	at sun.security.ssl.SSLSocketImpl.readDataRecord(SSLSocketImpl.java:903)
	at sun.security.ssl.AppInputStream.read(AppInputStream.java:102)
	at org.apache.http.impl.io.SessionInputBufferImpl.streamRead(SessionInputBufferImpl.java:136)
	at org.apache.http.impl.io.SessionInputBufferImpl.fillBuffer(SessionInputBufferImpl.java:152)
	at org.apache.http.impl.io.SessionInputBufferImpl.readLine(SessionInputBufferImpl.java:270)
	at org.apache.http.impl.conn.DefaultHttpResponseParser.parseHead(DefaultHttpResponseParser.java:140)
	at org.apache.http.impl.conn.DefaultHttpResponseParser.parseHead(DefaultHttpResponseParser.java:57)
	at org.apache.http.impl.io.AbstractMessageParser.parse(AbstractMessageParser.java:260)
	at org.apache.http.impl.DefaultBHttpClientConnection.receiveResponseHeader(DefaultBHttpClientConnection.java:161)
	at sun.reflect.GeneratedMethodAccessor9.invoke(Unknown Source)
	at sun.reflect.DelegatingMethodAccessorImpl.invoke(DelegatingMethodAccessorImpl.java:43)
	at java.lang.reflect.Method.invoke(Method.java:606)
	at org.apache.http.impl.conn.CPoolProxy.invoke(CPoolProxy.java:138)
	at com.sun.proxy.$Proxy9.receiveResponseHeader(Unknown Source)
	at org.apache.http.protocol.HttpRequestExecutor.doReceiveResponse(HttpRequestExecutor.java:271)
20151117-10:37:46: [INFO]: 
***************** running test for testGetReplica_AuthenticateITKUser() vs. node: https://mn-dev-unm-2.test.dataone.org/metacat/d1/mn/v2 ***************** [org.dataone.integration.ContextAwareTestCaseDataone]
	at org.apache.http.protocol.HttpRequestExecutor.execute(HttpRequestExecutor.java:123)
	at org.apache.http.impl.execchain.MainClientExec.execute(MainClientExec.java:254)
	at org.apache.http.impl.execchain.ProtocolExec.execute(ProtocolExec.java:195)
	at org.apache.http.impl.execchain.RetryExec.execute(RetryExec.java:86)
	at org.apache.http.impl.execchain.RedirectExec.execute(RedirectExec.java:108)
	at org.apache.http.impl.client.InternalHttpClient.doExecute(InternalHttpClient.java:186)
	at org.apache.http.impl.client.CloseableHttpClient.execute(CloseableHttpClient.java:82)
	at org.apache.http.impl.client.CloseableHttpClient.execute(CloseableHttpClient.java:106)
	at org.apache.http.impl.client.CloseableHttpClient.execute(CloseableHttpClient.java:57)
	at org.dataone.client.rest.RestClient.doRequest(RestClient.java:294)
	at org.dataone.client.rest.RestClient.doRequestNoBody(RestClient.java:230)
	at org.dataone.client.rest.RestClient.doGetRequest(RestClient.java:148)
	at org.dataone.client.rest.HttpMultipartRestClient.doGetRequest(HttpMultipartRestClient.java:329)
	... 39 more
20151117-10:37:47: [INFO]: rest call info: GET https://mn-dev-unm-2.test.dataone.org/metacat/d1/mn/v2/meta/TierTesting:mn-dev-unm-2:Public_READ.14 [org.dataone.client.rest.RestClient]
20151117-10:37:47: [INFO]:  ====>>>>> pid of procured test Object: TierTesting:mn-dev-unm-2:Public_READ.14 [org.dataone.integration.ContextAwareTestCaseDataone]
20151117-10:37:47: [INFO]: rest call info: GET https://mn-dev-unm-2.test.dataone.org/metacat/d1/mn/v2/replica/TierTesting:mn-dev-unm-2:Public_READ.14 [org.dataone.client.rest.RestClient]
20151117-10:37:47: [INFO]: **************************************************** [org.dataone.integration.ContextAwareTestCaseDataone]
20151117-10:37:47: [INFO]: ***  context label:   DEV2 [org.dataone.integration.ContextAwareTestCaseDataone]
20151117-10:37:47: [INFO]: **************************************************** [org.dataone.integration.ContextAwareTestCaseDataone]
20151117-10:37:47: [INFO]: **************************************************** [org.dataone.integration.ContextAwareTestCaseDataone]
20151117-10:37:48: [INFO]: rest call info: GET https://mn-dev-ucsb-1.test.dataone.org/metacat/d1/mn/v2/monitor/ping [org.dataone.client.rest.RestClient]
20151117-10:37:48: [INFO]: MN excluded from test: https://mn-dev-ucsb-1.test.dataone.org/metacat/d1/mn [org.dataone.integration.ContextAwareTestCaseDataone]
20151117-10:37:50: [INFO]: rest call info: GET https://mn-dev-ucsb-2.test.dataone.org/metacat/d1/mn/v2/monitor/ping [org.dataone.client.rest.RestClient]
20151117-10:37:50: [INFO]: MN included in test: https://mn-dev-ucsb-2.test.dataone.org/metacat/d1/mn [org.dataone.integration.ContextAwareTestCaseDataone]
20151117-10:37:50: [INFO]: rest call info: GET https://mn-dev-unm-1.test.dataone.org/metacat/d1/mn/v2/monitor/ping [org.dataone.client.rest.RestClient]
20151117-10:37:50: [INFO]: MN excluded from test: https://mn-dev-unm-1.test.dataone.org/metacat/d1/mn [org.dataone.integration.ContextAwareTestCaseDataone]
20151117-10:37:50: [INFO]: rest call info: GET https://mn-dev-unm-2.test.dataone.org/metacat/d1/mn/v2/monitor/ping [org.dataone.client.rest.RestClient]
20151117-10:37:50: [INFO]: MN included in test: https://mn-dev-unm-2.test.dataone.org/metacat/d1/mn [org.dataone.integration.ContextAwareTestCaseDataone]
20151117-10:37:50: [INFO]: 
***************** running test for testGetReplica_NoCert() vs. node: https://mn-dev-ucsb-2.test.dataone.org/metacat/d1/mn/v2 ***************** [org.dataone.integration.ContextAwareTestCaseDataone]
20151117-10:37:51: [INFO]: rest call info: GET https://mn-dev-ucsb-2.test.dataone.org/metacat/d1/mn/v2/meta/TierTesting:mn-dev-ucsb-2:Public_READ.14 [org.dataone.client.rest.RestClient]
20151117-10:37:51: [INFO]:  ====>>>>> pid of procured test Object: TierTesting:mn-dev-ucsb-2:Public_READ.14 [org.dataone.integration.ContextAwareTestCaseDataone]
20151117-10:37:51: [INFO]: rest call info: GET https://mn-dev-ucsb-2.test.dataone.org/metacat/d1/mn/v2/replica/TierTesting:mn-dev-ucsb-2:Public_READ.14 [org.dataone.client.rest.RestClient]
20151117-10:37:51: [INFO]: 
***************** running test for testGetReplica_NoCert() vs. node: https://mn-dev-unm-2.test.dataone.org/metacat/d1/mn/v2 ***************** [org.dataone.integration.ContextAwareTestCaseDataone]
20151117-10:37:51: [INFO]: rest call info: GET https://mn-dev-unm-2.test.dataone.org/metacat/d1/mn/v2/meta/TierTesting:mn-dev-unm-2:Public_READ.14 [org.dataone.client.rest.RestClient]
20151117-10:37:51: [INFO]:  ====>>>>> pid of procured test Object: TierTesting:mn-dev-unm-2:Public_READ.14 [org.dataone.integration.ContextAwareTestCaseDataone]
20151117-10:37:51: [INFO]: rest call info: GET https://mn-dev-unm-2.test.dataone.org/metacat/d1/mn/v2/replica/TierTesting:mn-dev-unm-2:Public_READ.14 [org.dataone.client.rest.RestClient]
20151117-10:37:51: [INFO]: **************************************************** [org.dataone.integration.ContextAwareTestCaseDataone]
20151117-10:37:51: [INFO]: ***  context label:   DEV2 [org.dataone.integration.ContextAwareTestCaseDataone]
20151117-10:37:51: [INFO]: **************************************************** [org.dataone.integration.ContextAwareTestCaseDataone]
20151117-10:37:51: [INFO]: **************************************************** [org.dataone.integration.ContextAwareTestCaseDataone]
20151117-10:37:52: [INFO]: rest call info: GET https://mn-dev-ucsb-1.test.dataone.org/metacat/d1/mn/v2/monitor/ping [org.dataone.client.rest.RestClient]
20151117-10:37:52: [INFO]: MN excluded from test: https://mn-dev-ucsb-1.test.dataone.org/metacat/d1/mn [org.dataone.integration.ContextAwareTestCaseDataone]
20151117-10:37:53: [INFO]: rest call info: GET https://mn-dev-ucsb-2.test.dataone.org/metacat/d1/mn/v2/monitor/ping [org.dataone.client.rest.RestClient]
20151117-10:37:53: [INFO]: MN included in test: https://mn-dev-ucsb-2.test.dataone.org/metacat/d1/mn [org.dataone.integration.ContextAwareTestCaseDataone]
20151117-10:37:53: [INFO]: rest call info: GET https://mn-dev-unm-1.test.dataone.org/metacat/d1/mn/v2/monitor/ping [org.dataone.client.rest.RestClient]
20151117-10:37:53: [INFO]: MN excluded from test: https://mn-dev-unm-1.test.dataone.org/metacat/d1/mn [org.dataone.integration.ContextAwareTestCaseDataone]
20151117-10:37:53: [INFO]: rest call info: GET https://mn-dev-unm-2.test.dataone.org/metacat/d1/mn/v2/monitor/ping [org.dataone.client.rest.RestClient]
20151117-10:37:53: [INFO]: MN included in test: https://mn-dev-unm-2.test.dataone.org/metacat/d1/mn [org.dataone.integration.ContextAwareTestCaseDataone]
20151117-10:37:53: [INFO]: 
***************** running test for testGetReplica() vs. node: https://mn-dev-ucsb-2.test.dataone.org/metacat/d1/mn/v2 ***************** [org.dataone.integration.ContextAwareTestCaseDataone]
20151117-10:37:53: [INFO]: rest call info: GET https://mn-dev-ucsb-2.test.dataone.org/metacat/d1/mn/v2/object/TestingNotFound:201532123753392 [org.dataone.client.rest.RestClient]
20151117-10:37:53: [INFO]: 
***************** running test for testGetReplica() vs. node: https://mn-dev-unm-2.test.dataone.org/metacat/d1/mn/v2 ***************** [org.dataone.integration.ContextAwareTestCaseDataone]
20151117-10:37:53: [INFO]: rest call info: GET https://mn-dev-unm-2.test.dataone.org/metacat/d1/mn/v2/object/TestingNotFound:201532123753664 [org.dataone.client.rest.RestClient]
20151117-10:37:53: [INFO]: **************************************************** [org.dataone.integration.ContextAwareTestCaseDataone]
20151117-10:37:53: [INFO]: ***  context label:   DEV2 [org.dataone.integration.ContextAwareTestCaseDataone]
20151117-10:37:53: [INFO]: **************************************************** [org.dataone.integration.ContextAwareTestCaseDataone]
20151117-10:37:53: [INFO]: **************************************************** [org.dataone.integration.ContextAwareTestCaseDataone]
20151117-10:37:54: [INFO]: rest call info: GET https://mn-dev-ucsb-1.test.dataone.org/metacat/d1/mn/v2/monitor/ping [org.dataone.client.rest.RestClient]
20151117-10:37:54: [INFO]: MN excluded from test: https://mn-dev-ucsb-1.test.dataone.org/metacat/d1/mn [org.dataone.integration.ContextAwareTestCaseDataone]
20151117-10:37:55: [INFO]: rest call info: GET https://mn-dev-ucsb-2.test.dataone.org/metacat/d1/mn/v2/monitor/ping [org.dataone.client.rest.RestClient]
20151117-10:37:55: [INFO]: MN included in test: https://mn-dev-ucsb-2.test.dataone.org/metacat/d1/mn [org.dataone.integration.ContextAwareTestCaseDataone]
20151117-10:37:55: [INFO]: rest call info: GET https://mn-dev-unm-1.test.dataone.org/metacat/d1/mn/v2/monitor/ping [org.dataone.client.rest.RestClient]
20151117-10:37:55: [INFO]: MN excluded from test: https://mn-dev-unm-1.test.dataone.org/metacat/d1/mn [org.dataone.integration.ContextAwareTestCaseDataone]
20151117-10:37:55: [INFO]: rest call info: GET https://mn-dev-unm-2.test.dataone.org/metacat/d1/mn/v2/monitor/ping [org.dataone.client.rest.RestClient]
20151117-10:37:55: [INFO]: MN included in test: https://mn-dev-unm-2.test.dataone.org/metacat/d1/mn [org.dataone.integration.ContextAwareTestCaseDataone]
20151117-10:37:55: [INFO]: 
***************** running test for testGetReplica_IdentifierEncoding() vs. node: https://mn-dev-ucsb-2.test.dataone.org/metacat/d1/mn/v2 ***************** [org.dataone.integration.ContextAwareTestCaseDataone]
20151117-10:37:55: [INFO]: 
***************** running test for   Node:: https://mn-dev-ucsb-2.test.dataone.org/metacat/d1/mn/v2 ***************** [org.dataone.integration.ContextAwareTestCaseDataone]
20151117-10:37:55: [INFO]: rest call info: GET https://mn-dev-ucsb-2.test.dataone.org/metacat/d1/mn/v2/replica/Test201532123755160_common-unicode-ascii-safe-ABCDEFGHIJKLMNOPQRSTUVWXYZ [org.dataone.client.rest.RestClient]
20151117-10:37:58: [INFO]: rest call info: GET https://mn-dev-ucsb-2.test.dataone.org/metacat/d1/mn/v2/replica/Test201532123755870_common-unicode-ascii-safe-abcdefghijklmnopqrstuvwxyz [org.dataone.client.rest.RestClient]
20151117-10:38:00: [INFO]: rest call info: GET https://mn-dev-ucsb-2.test.dataone.org/metacat/d1/mn/v2/replica/Test201532123758777_common-unicode-ascii-safe-0123456789 [org.dataone.client.rest.RestClient]
20151117-10:38:00: [INFO]: rest call info: GET https://mn-dev-ucsb-2.test.dataone.org/metacat/d1/mn/v2/replica/Test2015321238027_common-unicode-ascii-safe-:@$-_.!*()',~ [org.dataone.client.rest.RestClient]
20151117-10:38:02: [INFO]: rest call info: GET https://mn-dev-ucsb-2.test.dataone.org/metacat/d1/mn/v2/replica/Test20153212380740_common-unicode-ascii-safe-unreserved-._~ [org.dataone.client.rest.RestClient]
20151117-10:38:03: [INFO]: rest call info: GET https://mn-dev-ucsb-2.test.dataone.org/metacat/d1/mn/v2/replica/Test20153212382449_common-unicode-ascii-safe-sub-delims-$!*()', [org.dataone.client.rest.RestClient]
20151117-10:38:06: [INFO]: rest call info: GET https://mn-dev-ucsb-2.test.dataone.org/metacat/d1/mn/v2/replica/Test20153212383159_common-unicode-ascii-safe-gen-delims-:@ [org.dataone.client.rest.RestClient]
20151117-10:38:07: [INFO]: rest call info: GET https://mn-dev-ucsb-2.test.dataone.org/metacat/d1/mn/v2/replica/Test20153212386822_common-unicode-ascii-escaped-%22%23%3C%3E%5B%5D%5E%60%7B%7D%7C [org.dataone.client.rest.RestClient]
20151117-10:38:11: [INFO]: rest call info: GET https://mn-dev-ucsb-2.test.dataone.org/metacat/d1/mn/v2/replica/Test20153212387526_common-unicode-ascii-escaped-tomcatBlocked-%5C [org.dataone.client.rest.RestClient]
20151117-10:38:11: [INFO]: rest call info: GET https://mn-dev-ucsb-2.test.dataone.org/metacat/d1/mn/v2/replica/Test2015321238118_common-unicode-ascii-escaped-tomcatBlocked-%255C [org.dataone.client.rest.RestClient]
20151117-10:38:12: [INFO]: rest call info: GET https://mn-dev-ucsb-2.test.dataone.org/metacat/d1/mn/v2/replica/Test201532123811724_common-unicode-ascii-semi-colon-test-%253B [org.dataone.client.rest.RestClient]
20151117-10:38:13: [INFO]: rest call info: GET https://mn-dev-ucsb-2.test.dataone.org/metacat/d1/mn/v2/replica/Test201532123812451_common-unicode-ascii-escaped-%25 [org.dataone.client.rest.RestClient]
20151117-10:38:14: [INFO]: rest call info: GET https://mn-dev-ucsb-2.test.dataone.org/metacat/d1/mn/v2/replica/Test201532123813166_common-unicode-ascii-escape-anyway-%2B [org.dataone.client.rest.RestClient]
20151117-10:38:15: [INFO]: rest call info: GET https://mn-dev-ucsb-2.test.dataone.org/metacat/d1/mn/v2/replica/Test201532123814426_path-unicode-ascii-safe-&=&= [org.dataone.client.rest.RestClient]
20151117-10:38:17: [INFO]: rest call info: GET https://mn-dev-ucsb-2.test.dataone.org/metacat/d1/mn/v2/replica/Test201532123815682_path-unicode-ascii-escaped-%3B [org.dataone.client.rest.RestClient]
20151117-10:38:18: [INFO]: rest call info: GET https://mn-dev-ucsb-2.test.dataone.org/metacat/d1/mn/v2/replica/Test201532123817397_path-unicode-ascii-escaped-%3F [org.dataone.client.rest.RestClient]
20151117-10:38:18: [INFO]: rest call info: GET https://mn-dev-ucsb-2.test.dataone.org/metacat/d1/mn/v2/replica/Test201532123818111_path-unicode-ascii-escaped-%2F [org.dataone.client.rest.RestClient]
20151117-10:38:20: [INFO]: rest call info: GET https://mn-dev-ucsb-2.test.dataone.org/metacat/d1/mn/v2/replica/Test201532123818820_path-unicode-ascii-escaped-%253F [org.dataone.client.rest.RestClient]
20151117-10:38:20: [INFO]: rest call info: GET https://mn-dev-ucsb-2.test.dataone.org/metacat/d1/mn/v2/replica/Test201532123820102_path-unicode-ascii-escaped-%252F [org.dataone.client.rest.RestClient]
20151117-10:38:21: [INFO]: rest call info: GET https://mn-dev-ucsb-2.test.dataone.org/metacat/d1/mn/v2/replica/Test201532123820820_path-unicode-ascii-escaped-double-%2F%2Fcase [org.dataone.client.rest.RestClient]
20151117-10:38:22: [INFO]: rest call info: GET https://mn-dev-ucsb-2.test.dataone.org/metacat/d1/mn/v2/replica/Test201532123821540_path-unicode-ascii-escaped-double-trailing%2F%2F [org.dataone.client.rest.RestClient]
20151117-10:38:22: [INFO]: rest call info: GET https://mn-dev-ucsb-2.test.dataone.org/metacat/d1/mn/v2/replica/Test201532123822247_path-unicode-ascii-escaped-double-%252F%252Fcase [org.dataone.client.rest.RestClient]
20151117-10:38:24: [INFO]: rest call info: GET https://mn-dev-ucsb-2.test.dataone.org/metacat/d1/mn/v2/replica/Test201532123822963_path-unicode-ascii-escaped-double-trailing%252F%252F [org.dataone.client.rest.RestClient]
20151117-10:38:24: [INFO]: rest call info: GET https://mn-dev-ucsb-2.test.dataone.org/metacat/d1/mn/v2/replica/Test201532123824216_common-unicode-bmp-1byte-escaped-%C2%A1%C2%A2%C2%A3 [org.dataone.client.rest.RestClient]
20151117-10:38:25: [INFO]: rest call info: GET https://mn-dev-ucsb-2.test.dataone.org/metacat/d1/mn/v2/replica/Test201532123824928_common-unicode-bmp-2byte-escaped-%E4%A6%B9%E4%A6%BA [org.dataone.client.rest.RestClient]
20151117-10:38:26: [INFO]: rest call info: GET https://mn-dev-ucsb-2.test.dataone.org/metacat/d1/mn/v2/replica/Test201532123825633_common-ascii-doc-example-urn:lsid:ubio.org:namebank:11815 [org.dataone.client.rest.RestClient]
20151117-10:38:27: [INFO]: rest call info: GET https://mn-dev-ucsb-2.test.dataone.org/metacat/d1/mn/v2/replica/Test201532123826348_path-ascii-doc-example-10.1000%2F182 [org.dataone.client.rest.RestClient]
20151117-10:38:27: [INFO]: rest call info: GET https://mn-dev-ucsb-2.test.dataone.org/metacat/d1/mn/v2/replica/Test20153212382762_path-ascii-doc-example-http:%2F%2Fexample.com%2Fdata%2Fmydata%3Frow=24 [org.dataone.client.rest.RestClient]
20151117-10:38:31: [INFO]: rest call info: GET https://mn-dev-ucsb-2.test.dataone.org/metacat/d1/mn/v2/replica/Test201532123827767_common-bmp-doc-example-%E0%B8%89%E0%B8%B1%E0%B8%99%E0%B8%81%E0%B8%B4%E0%B8%99%E0%B8%81%E0%B8%A3%E0%B8%B0%E0%B8%88%E0%B8%81%E0%B9%84%E0%B8%94%E0%B9%89 [org.dataone.client.rest.RestClient]
20151117-10:38:32: [INFO]: rest call info: GET https://mn-dev-ucsb-2.test.dataone.org/metacat/d1/mn/v2/replica/Test201532123831707_common-bmp-doc-example-Is_f%C3%A9idir_liom_ithe_gloine [org.dataone.client.rest.RestClient]
20151117-10:38:32: [INFO]: 
***************** running test for testGetReplica_IdentifierEncoding() vs. node: https://mn-dev-unm-2.test.dataone.org/metacat/d1/mn/v2 ***************** [org.dataone.integration.ContextAwareTestCaseDataone]
20151117-10:38:32: [INFO]: 
***************** running test for   Node:: https://mn-dev-unm-2.test.dataone.org/metacat/d1/mn/v2 ***************** [org.dataone.integration.ContextAwareTestCaseDataone]
20151117-10:38:32: [INFO]: rest call info: GET https://mn-dev-unm-2.test.dataone.org/metacat/d1/mn/v2/replica/Test201532123832429_common-unicode-ascii-safe-ABCDEFGHIJKLMNOPQRSTUVWXYZ [org.dataone.client.rest.RestClient]
20151117-10:38:32: [INFO]: rest call info: GET https://mn-dev-unm-2.test.dataone.org/metacat/d1/mn/v2/replica/Test201532123832585_common-unicode-ascii-safe-abcdefghijklmnopqrstuvwxyz [org.dataone.client.rest.RestClient]
20151117-10:38:32: [INFO]: rest call info: GET https://mn-dev-unm-2.test.dataone.org/metacat/d1/mn/v2/replica/Test201532123832603_common-unicode-ascii-safe-0123456789 [org.dataone.client.rest.RestClient]
20151117-10:38:32: [INFO]: rest call info: GET https://mn-dev-unm-2.test.dataone.org/metacat/d1/mn/v2/replica/Test201532123832619_common-unicode-ascii-safe-:@$-_.!*()',~ [org.dataone.client.rest.RestClient]
20151117-10:38:32: [INFO]: rest call info: GET https://mn-dev-unm-2.test.dataone.org/metacat/d1/mn/v2/replica/Test201532123832635_common-unicode-ascii-safe-unreserved-._~ [org.dataone.client.rest.RestClient]
20151117-10:38:32: [INFO]: rest call info: GET https://mn-dev-unm-2.test.dataone.org/metacat/d1/mn/v2/replica/Test201532123832650_common-unicode-ascii-safe-sub-delims-$!*()', [org.dataone.client.rest.RestClient]
20151117-10:38:32: [INFO]: rest call info: GET https://mn-dev-unm-2.test.dataone.org/metacat/d1/mn/v2/replica/Test201532123832670_common-unicode-ascii-safe-gen-delims-:@ [org.dataone.client.rest.RestClient]
20151117-10:38:32: [INFO]: rest call info: GET https://mn-dev-unm-2.test.dataone.org/metacat/d1/mn/v2/replica/Test201532123832687_common-unicode-ascii-escaped-%22%23%3C%3E%5B%5D%5E%60%7B%7D%7C [org.dataone.client.rest.RestClient]
20151117-10:38:32: [INFO]: rest call info: GET https://mn-dev-unm-2.test.dataone.org/metacat/d1/mn/v2/replica/Test201532123832715_common-unicode-ascii-escaped-tomcatBlocked-%5C [org.dataone.client.rest.RestClient]
20151117-10:38:32: [INFO]: rest call info: GET https://mn-dev-unm-2.test.dataone.org/metacat/d1/mn/v2/replica/Test201532123832733_common-unicode-ascii-escaped-tomcatBlocked-%255C [org.dataone.client.rest.RestClient]
20151117-10:38:32: [INFO]: rest call info: GET https://mn-dev-unm-2.test.dataone.org/metacat/d1/mn/v2/replica/Test201532123832747_common-unicode-ascii-semi-colon-test-%253B [org.dataone.client.rest.RestClient]
20151117-10:38:32: [INFO]: rest call info: GET https://mn-dev-unm-2.test.dataone.org/metacat/d1/mn/v2/replica/Test201532123832763_common-unicode-ascii-escaped-%25 [org.dataone.client.rest.RestClient]
20151117-10:38:32: [INFO]: rest call info: GET https://mn-dev-unm-2.test.dataone.org/metacat/d1/mn/v2/replica/Test201532123832778_common-unicode-ascii-escape-anyway-%2B [org.dataone.client.rest.RestClient]
20151117-10:38:32: [INFO]: rest call info: GET https://mn-dev-unm-2.test.dataone.org/metacat/d1/mn/v2/replica/Test201532123832794_path-unicode-ascii-safe-&=&= [org.dataone.client.rest.RestClient]
20151117-10:38:32: [INFO]: rest call info: GET https://mn-dev-unm-2.test.dataone.org/metacat/d1/mn/v2/replica/Test201532123832809_path-unicode-ascii-escaped-%3B [org.dataone.client.rest.RestClient]
20151117-10:38:32: [INFO]: rest call info: GET https://mn-dev-unm-2.test.dataone.org/metacat/d1/mn/v2/replica/Test201532123832823_path-unicode-ascii-escaped-%3F [org.dataone.client.rest.RestClient]
20151117-10:38:32: [INFO]: rest call info: GET https://mn-dev-unm-2.test.dataone.org/metacat/d1/mn/v2/replica/Test201532123832838_path-unicode-ascii-escaped-%2F [org.dataone.client.rest.RestClient]
20151117-10:38:32: [INFO]: rest call info: GET https://mn-dev-unm-2.test.dataone.org/metacat/d1/mn/v2/replica/Test201532123832852_path-unicode-ascii-escaped-%253F [org.dataone.client.rest.RestClient]
20151117-10:38:32: [INFO]: rest call info: GET https://mn-dev-unm-2.test.dataone.org/metacat/d1/mn/v2/replica/Test201532123832870_path-unicode-ascii-escaped-%252F [org.dataone.client.rest.RestClient]
20151117-10:38:32: [INFO]: rest call info: GET https://mn-dev-unm-2.test.dataone.org/metacat/d1/mn/v2/replica/Test201532123832885_path-unicode-ascii-escaped-double-%2F%2Fcase [org.dataone.client.rest.RestClient]
20151117-10:38:32: [INFO]: rest call info: GET https://mn-dev-unm-2.test.dataone.org/metacat/d1/mn/v2/replica/Test201532123832899_path-unicode-ascii-escaped-double-trailing%2F%2F [org.dataone.client.rest.RestClient]
20151117-10:38:32: [INFO]: rest call info: GET https://mn-dev-unm-2.test.dataone.org/metacat/d1/mn/v2/replica/Test201532123832915_path-unicode-ascii-escaped-double-%252F%252Fcase [org.dataone.client.rest.RestClient]
20151117-10:38:32: [INFO]: rest call info: GET https://mn-dev-unm-2.test.dataone.org/metacat/d1/mn/v2/replica/Test201532123832930_path-unicode-ascii-escaped-double-trailing%252F%252F [org.dataone.client.rest.RestClient]
20151117-10:38:32: [INFO]: rest call info: GET https://mn-dev-unm-2.test.dataone.org/metacat/d1/mn/v2/replica/Test201532123832944_common-unicode-bmp-1byte-escaped-%C2%A1%C2%A2%C2%A3 [org.dataone.client.rest.RestClient]
20151117-10:38:32: [INFO]: rest call info: GET https://mn-dev-unm-2.test.dataone.org/metacat/d1/mn/v2/replica/Test201532123832959_common-unicode-bmp-2byte-escaped-%E4%A6%B9%E4%A6%BA [org.dataone.client.rest.RestClient]
20151117-10:38:32: [INFO]: rest call info: GET https://mn-dev-unm-2.test.dataone.org/metacat/d1/mn/v2/replica/Test201532123832973_common-ascii-doc-example-urn:lsid:ubio.org:namebank:11815 [org.dataone.client.rest.RestClient]
20151117-10:38:33: [INFO]: rest call info: GET https://mn-dev-unm-2.test.dataone.org/metacat/d1/mn/v2/replica/Test201532123832988_path-ascii-doc-example-10.1000%2F182 [org.dataone.client.rest.RestClient]
20151117-10:38:33: [INFO]: rest call info: GET https://mn-dev-unm-2.test.dataone.org/metacat/d1/mn/v2/replica/Test20153212383310_path-ascii-doc-example-http:%2F%2Fexample.com%2Fdata%2Fmydata%3Frow=24 [org.dataone.client.rest.RestClient]
20151117-10:38:33: [INFO]: rest call info: GET https://mn-dev-unm-2.test.dataone.org/metacat/d1/mn/v2/replica/Test20153212383324_common-bmp-doc-example-%E0%B8%89%E0%B8%B1%E0%B8%99%E0%B8%81%E0%B8%B4%E0%B8%99%E0%B8%81%E0%B8%A3%E0%B8%B0%E0%B8%88%E0%B8%81%E0%B9%84%E0%B8%94%E0%B9%89 [org.dataone.client.rest.RestClient]
20151117-10:38:33: [INFO]: rest call info: GET https://mn-dev-unm-2.test.dataone.org/metacat/d1/mn/v2/replica/Test20153212383339_common-bmp-doc-example-Is_f%C3%A9idir_liom_ithe_gloine [org.dataone.client.rest.RestClient]
20151117-10:38:33: [INFO]: **************************************************** [org.dataone.integration.ContextAwareTestCaseDataone]
20151117-10:38:33: [INFO]: ***  context label:   DEV2 [org.dataone.integration.ContextAwareTestCaseDataone]
20151117-10:38:33: [INFO]: **************************************************** [org.dataone.integration.ContextAwareTestCaseDataone]
20151117-10:38:33: [INFO]: **************************************************** [org.dataone.integration.ContextAwareTestCaseDataone]
20151117-10:38:33: [INFO]: Testing get() method ...  [org.dataone.integration.ContextAwareTestCaseDataone]
20151117-10:38:33: [INFO]: Testing get(), Case1 [org.dataone.integration.ContextAwareTestCaseDataone]
20151117-10:38:33: [INFO]: **************************************************** [org.dataone.integration.ContextAwareTestCaseDataone]
20151117-10:38:33: [INFO]: ***  context label:   DEV2 [org.dataone.integration.ContextAwareTestCaseDataone]
20151117-10:38:33: [INFO]: **************************************************** [org.dataone.integration.ContextAwareTestCaseDataone]
20151117-10:38:33: [INFO]: **************************************************** [org.dataone.integration.ContextAwareTestCaseDataone]
20151117-10:38:33: [INFO]: Testing getSystemMetadata() method ...  [org.dataone.integration.ContextAwareTestCaseDataone]
20151117-10:38:33: [INFO]: Testing getSystemMetadata(), Case1 [org.dataone.integration.ContextAwareTestCaseDataone]
20151117-10:38:33: [INFO]: **************************************************** [org.dataone.integration.ContextAwareTestCaseDataone]
20151117-10:38:33: [INFO]: ***  context label:   DEV2 [org.dataone.integration.ContextAwareTestCaseDataone]
20151117-10:38:33: [INFO]: **************************************************** [org.dataone.integration.ContextAwareTestCaseDataone]
20151117-10:38:33: [INFO]: **************************************************** [org.dataone.integration.ContextAwareTestCaseDataone]
20151117-10:38:33: [INFO]: Testing describe() method ...  [org.dataone.integration.ContextAwareTestCaseDataone]
20151117-10:38:33: [INFO]: Testing describe(), Case1 [org.dataone.integration.ContextAwareTestCaseDataone]
20151117-10:38:33: [INFO]: **************************************************** [org.dataone.integration.ContextAwareTestCaseDataone]
20151117-10:38:33: [INFO]: ***  context label:   DEV2 [org.dataone.integration.ContextAwareTestCaseDataone]
20151117-10:38:33: [INFO]: **************************************************** [org.dataone.integration.ContextAwareTestCaseDataone]
20151117-10:38:33: [INFO]: **************************************************** [org.dataone.integration.ContextAwareTestCaseDataone]
20151117-10:38:33: [INFO]: Testing listObjects() method ...  [org.dataone.integration.ContextAwareTestCaseDataone]
20151117-10:38:33: [INFO]: Testing listObjects(), Case1 [org.dataone.integration.ContextAwareTestCaseDataone]
20151117-10:38:33: [INFO]: **************************************************** [org.dataone.integration.ContextAwareTestCaseDataone]
20151117-10:38:33: [INFO]: ***  context label:   DEV2 [org.dataone.integration.ContextAwareTestCaseDataone]
20151117-10:38:33: [INFO]: **************************************************** [org.dataone.integration.ContextAwareTestCaseDataone]
20151117-10:38:33: [INFO]: **************************************************** [org.dataone.integration.ContextAwareTestCaseDataone]
20151117-10:38:34: [INFO]: rest call info: GET https://mn-dev-ucsb-1.test.dataone.org/metacat/d1/mn/v2/monitor/ping [org.dataone.client.rest.RestClient]
20151117-10:38:34: [INFO]: MN excluded from test: https://mn-dev-ucsb-1.test.dataone.org/metacat/d1/mn [org.dataone.integration.ContextAwareTestCaseDataone]
20151117-10:38:35: [INFO]: rest call info: GET https://mn-dev-ucsb-2.test.dataone.org/metacat/d1/mn/v2/monitor/ping [org.dataone.client.rest.RestClient]
20151117-10:38:35: [INFO]: MN included in test: https://mn-dev-ucsb-2.test.dataone.org/metacat/d1/mn [org.dataone.integration.ContextAwareTestCaseDataone]
20151117-10:38:35: [INFO]: rest call info: GET https://mn-dev-unm-1.test.dataone.org/metacat/d1/mn/v2/monitor/ping [org.dataone.client.rest.RestClient]
20151117-10:38:35: [INFO]: MN excluded from test: https://mn-dev-unm-1.test.dataone.org/metacat/d1/mn [org.dataone.integration.ContextAwareTestCaseDataone]
20151117-10:38:35: [INFO]: rest call info: GET https://mn-dev-unm-2.test.dataone.org/metacat/d1/mn/v2/monitor/ping [org.dataone.client.rest.RestClient]
20151117-10:38:35: [INFO]: MN included in test: https://mn-dev-unm-2.test.dataone.org/metacat/d1/mn [org.dataone.integration.ContextAwareTestCaseDataone]
20151117-10:38:35: [INFO]: certificate directory: /etc/dataone/client/testClientCerts/ [org.dataone.integration.ContextAwareTestCaseDataone]
20151117-10:38:35: [INFO]: certificate filename: cnDevUNM1 [org.dataone.integration.ContextAwareTestCaseDataone]
20151117-10:38:35: [INFO]: client setup as Subject: CN=urn:node:cnDevUNM1,DC=dataone,DC=org [org.dataone.integration.ContextAwareTestCaseDataone]
20151117-10:38:35: [INFO]: certificate directory: /etc/dataone/client/testClientCerts/ [org.dataone.integration.ContextAwareTestCaseDataone]
20151117-10:38:35: [INFO]: certificate filename: cnSandboxUNM1 [org.dataone.integration.ContextAwareTestCaseDataone]
20151117-10:38:35: [INFO]: client setup as Subject: CN=urn:node:cnSandboxUNM1,DC=dataone,DC=org [org.dataone.integration.ContextAwareTestCaseDataone]
20151117-10:38:35: [INFO]: certificate directory: /etc/dataone/client/testClientCerts/ [org.dataone.integration.ContextAwareTestCaseDataone]
20151117-10:38:35: [INFO]: certificate filename: cnStageUNM1 [org.dataone.integration.ContextAwareTestCaseDataone]
20151117-10:38:35: [INFO]: client setup as Subject: CN=urn:node:cnStageUNM1,DC=dataone,DC=org [org.dataone.integration.ContextAwareTestCaseDataone]
20151117-10:38:35: [INFO]: 
***************** running test for testSystemMetadataChanged() vs. node: https://mn-dev-ucsb-2.test.dataone.org/metacat/d1/mn/v2 ***************** [org.dataone.integration.ContextAwareTestCaseDataone]
20151117-10:39:05: [INFO]: rest call info: GET https://mn-dev-ucsb-2.test.dataone.org/metacat/d1/mn/v2/meta/TierTesting:mn-dev-ucsb-2:Public_READ.14 [org.dataone.client.rest.RestClient]
20151117-10:39:07: [INFO]: rest call info: GET https://mn-dev-ucsb-2.test.dataone.org/metacat/d1/mn/v2/object [org.dataone.client.rest.RestClient]
20151117-10:39:38: [INFO]: rest call info: GET https://mn-dev-ucsb-2.test.dataone.org/metacat/d1/mn/v2/meta/0007f892-0d8f-4451-94e9-94d02ba5dd0d_0 [org.dataone.client.rest.RestClient]
org.dataone.integration.TestIterationEndingException: could not create a test object and attempts to find an object with a public accessRule gave the following exception: ServiceFailure:: class org.dataone.client.exception.ClientSideException: /Read timed out
	at org.dataone.integration.ContextAwareTestCaseDataone.procurePublicReadableTestObject(ContextAwareTestCaseDataone.java:820)
	at org.dataone.integration.it.testImplementations.MNSystemMetadataChangedMethodTestImplementations.testSystemMetadataChanged(MNSystemMetadataChangedMethodTestImplementations.java:71)
	at org.dataone.integration.it.testImplementations.MNSystemMetadataChangedMethodTestImplementations.testSystemMetadataChanged(MNSystemMetadataChangedMethodTestImplementations.java:51)
	at org.dataone.integration.it.apiTests.MNReadV2IT.testSystemMetadataChanged(MNReadV2IT.java:226)
	at sun.reflect.NativeMethodAccessorImpl.invoke0(Native Method)
	at sun.reflect.NativeMethodAccessorImpl.invoke(NativeMethodAccessorImpl.java:57)
	at sun.reflect.DelegatingMethodAccessorImpl.invoke(DelegatingMethodAccessorImpl.java:43)
	at java.lang.reflect.Method.invoke(Method.java:606)
	at org.junit.runners.model.FrameworkMethod$1.runReflectiveCall(FrameworkMethod.java:44)
	at org.junit.internal.runners.model.ReflectiveCallable.run(ReflectiveCallable.java:15)
	at org.junit.runners.model.FrameworkMethod.invokeExplosively(FrameworkMethod.java:41)
	at org.junit.internal.runners.statements.InvokeMethod.evaluate(InvokeMethod.java:20)
20151117-10:39:38: [INFO]: 
***************** running test for testSystemMetadataChanged() vs. node: https://mn-dev-unm-2.test.dataone.org/metacat/d1/mn/v2 ***************** [org.dataone.integration.ContextAwareTestCaseDataone]
	at org.junit.rules.Verifier$1.evaluate(Verifier.java:34)
	at org.junit.internal.runners.statements.RunBefores.evaluate(RunBefores.java:28)
	at org.junit.internal.runners.statements.RunAfters.evaluate(RunAfters.java:31)
	at org.junit.runners.BlockJUnit4ClassRunner.runChild(BlockJUnit4ClassRunner.java:76)
	at org.junit.runners.BlockJUnit4ClassRunner.runChild(BlockJUnit4ClassRunner.java:50)
	at org.junit.runners.ParentRunner$3.run(ParentRunner.java:193)
	at org.junit.runners.ParentRunner$1.schedule(ParentRunner.java:52)
	at org.junit.runners.ParentRunner.runChildren(ParentRunner.java:191)
	at org.junit.runners.ParentRunner.access$000(ParentRunner.java:42)
	at org.junit.runners.ParentRunner$2.evaluate(ParentRunner.java:184)
	at org.junit.runners.ParentRunner.run(ParentRunner.java:236)
	at org.apache.maven.surefire.junit4.JUnit4TestSet.execute(JUnit4TestSet.java:53)
	at org.apache.maven.surefire.junit4.JUnit4Provider.executeTestSet(JUnit4Provider.java:119)
	at org.apache.maven.surefire.junit4.JUnit4Provider.invoke(JUnit4Provider.java:101)
	at sun.reflect.NativeMethodAccessorImpl.invoke0(Native Method)
	at sun.reflect.NativeMethodAccessorImpl.invoke(NativeMethodAccessorImpl.java:57)
	at sun.reflect.DelegatingMethodAccessorImpl.invoke(DelegatingMethodAccessorImpl.java:43)
	at java.lang.reflect.Method.invoke(Method.java:606)
	at org.apache.maven.surefire.booter.ProviderFactory$ClassLoaderProxy.invoke(ProviderFactory.java:103)
	at com.sun.proxy.$Proxy0.invoke(Unknown Source)
	at org.apache.maven.surefire.booter.SurefireStarter.invokeProvider(SurefireStarter.java:150)
	at org.apache.maven.surefire.booter.SurefireStarter.runSuitesInProcess(SurefireStarter.java:91)
	at org.apache.maven.surefire.booter.ForkedBooter.main(ForkedBooter.java:69)
Caused by: org.dataone.service.exceptions.ServiceFailure: class org.dataone.client.exception.ClientSideException: /Read timed out
	at org.dataone.client.rest.HttpMultipartRestClient.doGetRequest(HttpMultipartRestClient.java:339)
	at org.dataone.client.rest.HttpMultipartRestClient.doGetRequest(HttpMultipartRestClient.java:318)
	at org.dataone.client.v2.impl.MultipartD1Node.getSystemMetadata(MultipartD1Node.java:94)
	at org.dataone.client.v2.impl.MultipartMNode.getSystemMetadata(MultipartMNode.java:337)
	at org.dataone.integration.adapters.CommonCallAdapter.getSystemMetadata(CommonCallAdapter.java:246)
	at org.dataone.integration.ContextAwareTestCaseDataone.procurePublicReadableTestObject(ContextAwareTestCaseDataone.java:765)
	... 34 more
Caused by: org.dataone.client.exception.ClientSideException: /Read timed out
	... 40 more
Caused by: java.net.SocketTimeoutException: Read timed out
	at java.net.SocketInputStream.socketRead0(Native Method)
	at java.net.SocketInputStream.read(SocketInputStream.java:152)
	at java.net.SocketInputStream.read(SocketInputStream.java:122)
	at sun.security.ssl.InputRecord.readFully(InputRecord.java:442)
	at sun.security.ssl.InputRecord.read(InputRecord.java:480)
	at sun.security.ssl.SSLSocketImpl.readRecord(SSLSocketImpl.java:946)
	at sun.security.ssl.SSLSocketImpl.readDataRecord(SSLSocketImpl.java:903)
	at sun.security.ssl.AppInputStream.read(AppInputStream.java:102)
	at org.apache.http.impl.io.SessionInputBufferImpl.streamRead(SessionInputBufferImpl.java:136)
	at org.apache.http.impl.io.SessionInputBufferImpl.fillBuffer(SessionInputBufferImpl.java:152)
	at org.apache.http.impl.io.SessionInputBufferImpl.readLine(SessionInputBufferImpl.java:270)
	at org.apache.http.impl.conn.DefaultHttpResponseParser.parseHead(DefaultHttpResponseParser.java:140)
	at org.apache.http.impl.conn.DefaultHttpResponseParser.parseHead(DefaultHttpResponseParser.java:57)
	at org.apache.http.impl.io.AbstractMessageParser.parse(AbstractMessageParser.java:260)
	at org.apache.http.impl.DefaultBHttpClientConnection.receiveResponseHeader(DefaultBHttpClientConnection.java:161)
	at sun.reflect.GeneratedMethodAccessor9.invoke(Unknown Source)
	at sun.reflect.DelegatingMethodAccessorImpl.invoke(DelegatingMethodAccessorImpl.java:43)
	at java.lang.reflect.Method.invoke(Method.java:606)
	at org.apache.http.impl.conn.CPoolProxy.invoke(CPoolProxy.java:138)
	at com.sun.proxy.$Proxy9.receiveResponseHeader(Unknown Source)
	at org.apache.http.protocol.HttpRequestExecutor.doReceiveResponse(HttpRequestExecutor.java:271)
	at org.apache.http.protocol.HttpRequestExecutor.execute(HttpRequestExecutor.java:123)
	at org.apache.http.impl.execchain.MainClientExec.execute(MainClientExec.java:254)
	at org.apache.http.impl.execchain.ProtocolExec.execute(ProtocolExec.java:195)
	at org.apache.http.impl.execchain.RetryExec.execute(RetryExec.java:86)
	at org.apache.http.impl.execchain.RedirectExec.execute(RedirectExec.java:108)
	at org.apache.http.impl.client.InternalHttpClient.doExecute(InternalHttpClient.java:186)
	at org.apache.http.impl.client.CloseableHttpClient.execute(CloseableHttpClient.java:82)
	at org.apache.http.impl.client.CloseableHttpClient.execute(CloseableHttpClient.java:106)
	at org.apache.http.impl.client.CloseableHttpClient.execute(CloseableHttpClient.java:57)
	at org.dataone.client.rest.RestClient.doRequest(RestClient.java:294)
	at org.dataone.client.rest.RestClient.doRequestNoBody(RestClient.java:230)
	at org.dataone.client.rest.RestClient.doGetRequest(RestClient.java:148)
	at org.dataone.client.rest.HttpMultipartRestClient.doGetRequest(HttpMultipartRestClient.java:329)
	... 39 more
20151117-10:39:39: [INFO]: rest call info: GET https://mn-dev-unm-2.test.dataone.org/metacat/d1/mn/v2/meta/TierTesting:mn-dev-unm-2:Public_READ.14 [org.dataone.client.rest.RestClient]
20151117-10:39:39: [INFO]:  ====>>>>> pid of procured test Object: TierTesting:mn-dev-unm-2:Public_READ.14 [org.dataone.integration.ContextAwareTestCaseDataone]
20151117-10:39:39: [INFO]: rest call info: GET https://mn-dev-unm-2.test.dataone.org/metacat/d1/mn/v2/meta/TierTesting:mn-dev-unm-2:Public_READ.14 [org.dataone.client.rest.RestClient]
20151117-10:39:39: [INFO]: rest call info: POST https://mn-dev-unm-2.test.dataone.org/metacat/d1/mn/v2/dirtySystemMetadata; MMP message has: ParamPart:pid = TierTesting:mn-dev-unm-2:Public_READ.14; ParamPart:dateSysMetaLastModified = 2015-11-17T10:39:39.347+00:00; ParamPart:serialVersion = 10;  [org.dataone.client.rest.RestClient]
20151117-10:39:39: [INFO]: rest call info: POST https://mn-dev-unm-2.test.dataone.org/metacat/d1/mn/v2/dirtySystemMetadata; MMP message has: ParamPart:pid = TierTesting:mn-dev-unm-2:Public_READ.14; ParamPart:dateSysMetaLastModified = 2015-11-17T10:39:39.347+00:00; ParamPart:serialVersion = 10;  [org.dataone.client.rest.RestClient]
20151117-10:39:40: [INFO]: rest call info: POST https://mn-dev-unm-2.test.dataone.org/metacat/d1/mn/v2/dirtySystemMetadata; MMP message has: ParamPart:pid = TierTesting:mn-dev-unm-2:Public_READ.14; ParamPart:dateSysMetaLastModified = 2015-11-17T10:39:39.347+00:00; ParamPart:serialVersion = 10;  [org.dataone.client.rest.RestClient]
20151117-10:39:40: [INFO]: rest call info: POST https://mn-dev-unm-2.test.dataone.org/metacat/d1/mn/v2/dirtySystemMetadata; MMP message has: ParamPart:pid = TierTesting:mn-dev-unm-2:Public_READ.14; ParamPart:dateSysMetaLastModified = 2015-11-17T10:39:39.347+00:00; ParamPart:serialVersion = 10;  [org.dataone.client.rest.RestClient]
20151117-10:39:40: [INFO]: **************************************************** [org.dataone.integration.ContextAwareTestCaseDataone]
20151117-10:39:40: [INFO]: ***  context label:   DEV2 [org.dataone.integration.ContextAwareTestCaseDataone]
20151117-10:39:40: [INFO]: **************************************************** [org.dataone.integration.ContextAwareTestCaseDataone]
20151117-10:39:40: [INFO]: **************************************************** [org.dataone.integration.ContextAwareTestCaseDataone]
20151117-10:39:42: [INFO]: rest call info: GET https://mn-dev-ucsb-1.test.dataone.org/metacat/d1/mn/v2/monitor/ping [org.dataone.client.rest.RestClient]
20151117-10:39:42: [INFO]: MN excluded from test: https://mn-dev-ucsb-1.test.dataone.org/metacat/d1/mn [org.dataone.integration.ContextAwareTestCaseDataone]
20151117-10:39:46: [INFO]: rest call info: GET https://mn-dev-ucsb-2.test.dataone.org/metacat/d1/mn/v2/monitor/ping [org.dataone.client.rest.RestClient]
20151117-10:39:46: [INFO]: MN included in test: https://mn-dev-ucsb-2.test.dataone.org/metacat/d1/mn [org.dataone.integration.ContextAwareTestCaseDataone]
20151117-10:39:46: [INFO]: rest call info: GET https://mn-dev-unm-1.test.dataone.org/metacat/d1/mn/v2/monitor/ping [org.dataone.client.rest.RestClient]
20151117-10:39:46: [INFO]: MN excluded from test: https://mn-dev-unm-1.test.dataone.org/metacat/d1/mn [org.dataone.integration.ContextAwareTestCaseDataone]
20151117-10:39:46: [INFO]: rest call info: GET https://mn-dev-unm-2.test.dataone.org/metacat/d1/mn/v2/monitor/ping [org.dataone.client.rest.RestClient]
20151117-10:39:46: [INFO]: MN included in test: https://mn-dev-unm-2.test.dataone.org/metacat/d1/mn [org.dataone.integration.ContextAwareTestCaseDataone]
20151117-10:39:46: [INFO]: 
***************** running test for testSystemMetadataChanged() vs. node: https://mn-dev-ucsb-2.test.dataone.org/metacat/d1/mn/v2 ***************** [org.dataone.integration.ContextAwareTestCaseDataone]
20151117-10:40:16: [INFO]: rest call info: GET https://mn-dev-ucsb-2.test.dataone.org/metacat/d1/mn/v2/meta/TierTesting:mn-dev-ucsb-2:Public_READ.14 [org.dataone.client.rest.RestClient]
20151117-10:40:17: [INFO]: rest call info: GET https://mn-dev-ucsb-2.test.dataone.org/metacat/d1/mn/v2/object [org.dataone.client.rest.RestClient]
20151117-10:40:35: [INFO]: rest call info: GET https://mn-dev-ucsb-2.test.dataone.org/metacat/d1/mn/v2/meta/0007f892-0d8f-4451-94e9-94d02ba5dd0d_0 [org.dataone.client.rest.RestClient]
20151117-10:41:00: [INFO]: rest call info: GET https://mn-dev-ucsb-2.test.dataone.org/metacat/d1/mn/v2/meta/0007f892-0d8f-4451-94e9-94d02ba5dd0d_0 [org.dataone.client.rest.RestClient]
20151117-10:41:16: [INFO]: rest call info: POST https://mn-dev-ucsb-2.test.dataone.org/metacat/d1/mn/v2/dirtySystemMetadata; MMP message has: ParamPart:pid = 0007f892-0d8f-4451-94e9-94d02ba5dd0d_0; ParamPart:dateSysMetaLastModified = 2015-08-25T14:54:34.593+00:00; ParamPart:serialVersion = 10;  [org.dataone.client.rest.RestClient]
20151117-10:41:16: [INFO]: 
***************** running test for testSystemMetadataChanged() vs. node: https://mn-dev-unm-2.test.dataone.org/metacat/d1/mn/v2 ***************** [org.dataone.integration.ContextAwareTestCaseDataone]
20151117-10:41:16: [INFO]: rest call info: GET https://mn-dev-unm-2.test.dataone.org/metacat/d1/mn/v2/meta/TierTesting:mn-dev-unm-2:Public_READ.14 [org.dataone.client.rest.RestClient]
20151117-10:41:16: [INFO]:  ====>>>>> pid of procured test Object: TierTesting:mn-dev-unm-2:Public_READ.14 [org.dataone.integration.ContextAwareTestCaseDataone]
20151117-10:41:16: [INFO]: rest call info: GET https://mn-dev-unm-2.test.dataone.org/metacat/d1/mn/v2/meta/TierTesting:mn-dev-unm-2:Public_READ.14 [org.dataone.client.rest.RestClient]
20151117-10:41:16: [INFO]: rest call info: POST https://mn-dev-unm-2.test.dataone.org/metacat/d1/mn/v2/dirtySystemMetadata; MMP message has: ParamPart:pid = TierTesting:mn-dev-unm-2:Public_READ.14; ParamPart:dateSysMetaLastModified = 2015-09-28T14:51:03.429+00:00; ParamPart:serialVersion = 10;  [org.dataone.client.rest.RestClient]
20151117-10:41:16: [INFO]: **************************************************** [org.dataone.integration.ContextAwareTestCaseDataone]
20151117-10:41:16: [INFO]: ***  context label:   DEV2 [org.dataone.integration.ContextAwareTestCaseDataone]
20151117-10:41:16: [INFO]: **************************************************** [org.dataone.integration.ContextAwareTestCaseDataone]
20151117-10:41:16: [INFO]: **************************************************** [org.dataone.integration.ContextAwareTestCaseDataone]
20151117-10:41:17: [INFO]: rest call info: GET https://mn-dev-ucsb-1.test.dataone.org/metacat/d1/mn/v2/monitor/ping [org.dataone.client.rest.RestClient]
20151117-10:41:17: [INFO]: MN excluded from test: https://mn-dev-ucsb-1.test.dataone.org/metacat/d1/mn [org.dataone.integration.ContextAwareTestCaseDataone]
20151117-10:41:18: [INFO]: rest call info: GET https://mn-dev-ucsb-2.test.dataone.org/metacat/d1/mn/v2/monitor/ping [org.dataone.client.rest.RestClient]
20151117-10:41:18: [INFO]: MN included in test: https://mn-dev-ucsb-2.test.dataone.org/metacat/d1/mn [org.dataone.integration.ContextAwareTestCaseDataone]
20151117-10:41:18: [INFO]: rest call info: GET https://mn-dev-unm-1.test.dataone.org/metacat/d1/mn/v2/monitor/ping [org.dataone.client.rest.RestClient]
20151117-10:41:18: [INFO]: MN excluded from test: https://mn-dev-unm-1.test.dataone.org/metacat/d1/mn [org.dataone.integration.ContextAwareTestCaseDataone]
20151117-10:41:18: [INFO]: rest call info: GET https://mn-dev-unm-2.test.dataone.org/metacat/d1/mn/v2/monitor/ping [org.dataone.client.rest.RestClient]
20151117-10:41:18: [INFO]: MN included in test: https://mn-dev-unm-2.test.dataone.org/metacat/d1/mn [org.dataone.integration.ContextAwareTestCaseDataone]
20151117-10:41:18: [INFO]: 
***************** running test for testSystemMetadataChanged_authITKuser() vs. node: https://mn-dev-ucsb-2.test.dataone.org/metacat/d1/mn/v2 ***************** [org.dataone.integration.ContextAwareTestCaseDataone]
20151117-10:41:55: [INFO]: rest call info: POST https://mn-dev-ucsb-2.test.dataone.org/metacat/d1/mn/v2/object; MMP message has: ParamPart:pid = mNodeTier3201532124118540; FilePart:object = /tmp/mmp.output.1276849485687097614.tmp (684336 bytes); FilePart:sysmeta = /tmp/mmp.output.3806418734174414046.tmp (805 bytes);  [org.dataone.client.rest.RestClient]
20151117-10:42:13: [INFO]: rest call info: POST https://mn-dev-ucsb-2.test.dataone.org/metacat/d1/mn/v2/dirtySystemMetadata; MMP message has: ParamPart:pid = mNodeTier3201532124118540; ParamPart:dateSysMetaLastModified = 2015-11-17T10:41:55.871+00:00; ParamPart:serialVersion = 10;  [org.dataone.client.rest.RestClient]
20151117-10:42:13: [INFO]: 
***************** running test for testSystemMetadataChanged_authITKuser() vs. node: https://mn-dev-unm-2.test.dataone.org/metacat/d1/mn/v2 ***************** [org.dataone.integration.ContextAwareTestCaseDataone]
20151117-10:42:13: [INFO]: rest call info: POST https://mn-dev-unm-2.test.dataone.org/metacat/d1/mn/v2/object; MMP message has: ParamPart:pid = mNodeTier320153212421372; FilePart:object = /tmp/mmp.output.454093572409878588.tmp (684336 bytes); FilePart:sysmeta = /tmp/mmp.output.3973724526574967253.tmp (804 bytes);  [org.dataone.client.rest.RestClient]
20151117-10:42:13: [INFO]: rest call info: POST https://mn-dev-unm-2.test.dataone.org/metacat/d1/mn/v2/dirtySystemMetadata; MMP message has: ParamPart:pid = mNodeTier320153212421372; ParamPart:dateSysMetaLastModified = 2015-11-17T10:42:13.635+00:00; ParamPart:serialVersion = 10;  [org.dataone.client.rest.RestClient]
20151117-10:42:13: [INFO]: **************************************************** [org.dataone.integration.ContextAwareTestCaseDataone]
20151117-10:42:13: [INFO]: ***  context label:   DEV2 [org.dataone.integration.ContextAwareTestCaseDataone]
20151117-10:42:13: [INFO]: **************************************************** [org.dataone.integration.ContextAwareTestCaseDataone]
20151117-10:42:13: [INFO]: **************************************************** [org.dataone.integration.ContextAwareTestCaseDataone]
20151117-10:42:14: [INFO]: rest call info: GET https://mn-dev-ucsb-1.test.dataone.org/metacat/d1/mn/v2/monitor/ping [org.dataone.client.rest.RestClient]
20151117-10:42:14: [INFO]: MN excluded from test: https://mn-dev-ucsb-1.test.dataone.org/metacat/d1/mn [org.dataone.integration.ContextAwareTestCaseDataone]
20151117-10:42:15: [INFO]: rest call info: GET https://mn-dev-ucsb-2.test.dataone.org/metacat/d1/mn/v2/monitor/ping [org.dataone.client.rest.RestClient]
20151117-10:42:15: [INFO]: MN included in test: https://mn-dev-ucsb-2.test.dataone.org/metacat/d1/mn [org.dataone.integration.ContextAwareTestCaseDataone]
20151117-10:42:15: [INFO]: rest call info: GET https://mn-dev-unm-1.test.dataone.org/metacat/d1/mn/v2/monitor/ping [org.dataone.client.rest.RestClient]
20151117-10:42:15: [INFO]: MN excluded from test: https://mn-dev-unm-1.test.dataone.org/metacat/d1/mn [org.dataone.integration.ContextAwareTestCaseDataone]
20151117-10:42:15: [INFO]: rest call info: GET https://mn-dev-unm-2.test.dataone.org/metacat/d1/mn/v2/monitor/ping [org.dataone.client.rest.RestClient]
20151117-10:42:15: [INFO]: MN included in test: https://mn-dev-unm-2.test.dataone.org/metacat/d1/mn [org.dataone.integration.ContextAwareTestCaseDataone]
20151117-10:42:15: [INFO]: 
***************** running test for testSystemMetadataChanged_NotAuthPuplic() vs. node: https://mn-dev-ucsb-2.test.dataone.org/metacat/d1/mn/v2 ***************** [org.dataone.integration.ContextAwareTestCaseDataone]
20151117-10:44:12: [INFO]: rest call info: POST https://mn-dev-ucsb-2.test.dataone.org/metacat/d1/mn/v2/dirtySystemMetadata; MMP message has: ParamPart:pid = bogusPid; ParamPart:dateSysMetaLastModified = 2015-11-17T10:42:15.429+00:00; ParamPart:serialVersion = 10;  [org.dataone.client.rest.RestClient]
20151117-10:44:12: [INFO]: 
***************** running test for testSystemMetadataChanged_NotAuthPuplic() vs. node: https://mn-dev-unm-2.test.dataone.org/metacat/d1/mn/v2 ***************** [org.dataone.integration.ContextAwareTestCaseDataone]
20151117-10:44:13: [INFO]: rest call info: POST https://mn-dev-unm-2.test.dataone.org/metacat/d1/mn/v2/dirtySystemMetadata; MMP message has: ParamPart:pid = bogusPid; ParamPart:dateSysMetaLastModified = 2015-11-17T10:44:12.858+00:00; ParamPart:serialVersion = 10;  [org.dataone.client.rest.RestClient]
20151117-10:44:13: [INFO]: **************************************************** [org.dataone.integration.ContextAwareTestCaseDataone]
20151117-10:44:13: [INFO]: ***  context label:   DEV2 [org.dataone.integration.ContextAwareTestCaseDataone]
20151117-10:44:13: [INFO]: **************************************************** [org.dataone.integration.ContextAwareTestCaseDataone]
20151117-10:44:13: [INFO]: **************************************************** [org.dataone.integration.ContextAwareTestCaseDataone]
20151117-10:44:20: [INFO]: rest call info: GET https://mn-dev-ucsb-1.test.dataone.org/metacat/d1/mn/v2/monitor/ping [org.dataone.client.rest.RestClient]
20151117-10:44:20: [INFO]: MN excluded from test: https://mn-dev-ucsb-1.test.dataone.org/metacat/d1/mn [org.dataone.integration.ContextAwareTestCaseDataone]
20151117-10:44:33: [INFO]: rest call info: GET https://mn-dev-ucsb-2.test.dataone.org/metacat/d1/mn/v2/monitor/ping [org.dataone.client.rest.RestClient]
20151117-10:44:33: [INFO]: MN included in test: https://mn-dev-ucsb-2.test.dataone.org/metacat/d1/mn [org.dataone.integration.ContextAwareTestCaseDataone]
20151117-10:44:33: [INFO]: rest call info: GET https://mn-dev-unm-1.test.dataone.org/metacat/d1/mn/v2/monitor/ping [org.dataone.client.rest.RestClient]
20151117-10:44:33: [INFO]: MN excluded from test: https://mn-dev-unm-1.test.dataone.org/metacat/d1/mn [org.dataone.integration.ContextAwareTestCaseDataone]
20151117-10:44:33: [INFO]: rest call info: GET https://mn-dev-unm-2.test.dataone.org/metacat/d1/mn/v2/monitor/ping [org.dataone.client.rest.RestClient]
20151117-10:44:33: [INFO]: MN included in test: https://mn-dev-unm-2.test.dataone.org/metacat/d1/mn [org.dataone.integration.ContextAwareTestCaseDataone]
20151117-10:44:33: [INFO]: 
***************** running test for testSystemMetadataChanged_NotAuthRightsHolder() vs. node: https://mn-dev-ucsb-2.test.dataone.org/metacat/d1/mn/v2 ***************** [org.dataone.integration.ContextAwareTestCaseDataone]
20151117-10:45:05: [INFO]: rest call info: POST https://mn-dev-ucsb-2.test.dataone.org/metacat/d1/mn/v2/dirtySystemMetadata; MMP message has: ParamPart:pid = bogusPid; ParamPart:dateSysMetaLastModified = 2015-11-17T10:44:33.236+00:00; ParamPart:serialVersion = 10;  [org.dataone.client.rest.RestClient]
20151117-10:45:05: [INFO]: 
***************** running test for testSystemMetadataChanged_NotAuthRightsHolder() vs. node: https://mn-dev-unm-2.test.dataone.org/metacat/d1/mn/v2 ***************** [org.dataone.integration.ContextAwareTestCaseDataone]
20151117-10:45:06: [INFO]: rest call info: POST https://mn-dev-unm-2.test.dataone.org/metacat/d1/mn/v2/dirtySystemMetadata; MMP message has: ParamPart:pid = bogusPid; ParamPart:dateSysMetaLastModified = 2015-11-17T10:45:05.663+00:00; ParamPart:serialVersion = 10;  [org.dataone.client.rest.RestClient]
Tests run: 33, Failures: 5, Errors: 0, Skipped: 0, Time elapsed: 839.587 sec <<< FAILURE!

Results :

Failed tests: 
  testCreate(org.dataone.integration.it.apiTests.MNStorageV2IT): ServiceFailure: 0 Client_Error: class org.dataone.client.exception.ClientSideException: /Read timed out  [for host GET https://mn-dev-ucsb-2.test.dataone.org/metacat/d1/mn/v2/object/mNodeTier3TestCreate201532023157912 ]
  testCreateData_IdentifierEncoding(org.dataone.integration.it.apiTests.MNStorageV2IT): ServiceFailure: 0 Client_Error: class org.dataone.client.exception.ClientSideException: /Read timed out  [for host GET https://mn-dev-ucsb-2.test.dataone.org/metacat/d1/mn/v2/object/testMNodeTier3:2015320231551799_common-unicode-ascii-safe-ABCDEFGHIJKLMNOPQRSTUVWXYZ ]
  testCreateData_IdentifierEncoding(org.dataone.integration.it.apiTests.MNStorageV2IT): ServiceFailure: 0 Client_Error: class org.dataone.client.exception.ClientSideException: /Read timed out  [for host GET https://mn-dev-ucsb-2.test.dataone.org/metacat/d1/mn/v2/object/testMNodeTier3:201532023163371_common-unicode-ascii-safe-abcdefghijklmnopqrstuvwxyz ]
  testCreateData_IdentifierEncoding(org.dataone.integration.it.apiTests.MNStorageV2IT): ServiceFailure: 0 Client_Error: class org.dataone.client.exception.ClientSideException: /Read timed out  [for host GET https://mn-dev-ucsb-2.test.dataone.org/metacat/d1/mn/v2/object/testMNodeTier3:2015320231719688_common-unicode-ascii-safe-0123456789 ]
  testCreateData_IdentifierEncoding(org.dataone.integration.it.apiTests.MNStorageV2IT): ServiceFailure: 0 Client_Error: class org.dataone.client.exception.ClientSideException: /Read timed out  [for host GET https://mn-dev-ucsb-2.test.dataone.org/metacat/d1/mn/v2/object/testMNodeTier3:201532023183396_common-unicode-ascii-safe-:@$-_.!*()',~ ]
  testCreateData_IdentifierEncoding(org.dataone.integration.it.apiTests.MNStorageV2IT): ServiceFailure: 0 Client_Error: class org.dataone.client.exception.ClientSideException: /Read timed out  [for host GET https://mn-dev-ucsb-2.test.dataone.org/metacat/d1/mn/v2/object/testMNodeTier3:2015320231847191_common-unicode-ascii-safe-unreserved-._~ ]
  testCreateData_IdentifierEncoding(org.dataone.integration.it.apiTests.MNStorageV2IT): ServiceFailure: 0 Client_Error: class org.dataone.client.exception.ClientSideException: /Read timed out  [for host GET https://mn-dev-ucsb-2.test.dataone.org/metacat/d1/mn/v2/object/testMNodeTier3:2015320231930917_common-unicode-ascii-safe-sub-delims-$!*()', ]
  testCreateData_IdentifierEncoding(org.dataone.integration.it.apiTests.MNStorageV2IT): ServiceFailure: 0 Client_Error: class org.dataone.client.exception.ClientSideException: /Read timed out  [for host GET https://mn-dev-ucsb-2.test.dataone.org/metacat/d1/mn/v2/object/testMNodeTier3:2015320232014644_common-unicode-ascii-safe-gen-delims-:@ ]
  testCreateData_IdentifierEncoding(org.dataone.integration.it.apiTests.MNStorageV2IT): ServiceFailure: 0 Client_Error: class org.dataone.client.exception.ClientSideException: /Read timed out  [for host GET https://mn-dev-ucsb-2.test.dataone.org/metacat/d1/mn/v2/object/testMNodeTier3:2015320232058451_common-unicode-ascii-escaped-%2522%2523%253C%253E%255B%255D%255E%2560%257B%257D%257C ]
  testCreateData_IdentifierEncoding(org.dataone.integration.it.apiTests.MNStorageV2IT): ServiceFailure: 0 Client_Error: class org.dataone.client.exception.ClientSideException: /Read timed out  [for host GET https://mn-dev-ucsb-2.test.dataone.org/metacat/d1/mn/v2/object/testMNodeTier3:2015320232142179_common-unicode-ascii-escaped-tomcatBlocked-%255C ]
  testCreateData_IdentifierEncoding(org.dataone.integration.it.apiTests.MNStorageV2IT): ServiceFailure: 0 Client_Error: class org.dataone.client.exception.ClientSideException: /Read timed out  [for host GET https://mn-dev-ucsb-2.test.dataone.org/metacat/d1/mn/v2/object/testMNodeTier3:2015320232226123_common-unicode-ascii-escaped-tomcatBlocked-%25255C ]
  testCreateData_IdentifierEncoding(org.dataone.integration.it.apiTests.MNStorageV2IT): ServiceFailure: 0 Client_Error: class org.dataone.client.exception.ClientSideException: /Read timed out  [for host GET https://mn-dev-ucsb-2.test.dataone.org/metacat/d1/mn/v2/object/testMNodeTier3:201532023239923_common-unicode-ascii-semi-colon-test-%25253B ]
  testCreateData_IdentifierEncoding(org.dataone.integration.it.apiTests.MNStorageV2IT): ServiceFailure: 0 Client_Error: class org.dataone.client.exception.ClientSideException: /Read timed out  [for host GET https://mn-dev-ucsb-2.test.dataone.org/metacat/d1/mn/v2/object/testMNodeTier3:2015320232353650_common-unicode-ascii-escaped-%2525 ]
  testCreateData_IdentifierEncoding(org.dataone.integration.it.apiTests.MNStorageV2IT): ServiceFailure: 0 Client_Error: class org.dataone.client.exception.ClientSideException: /Read timed out  [for host GET https://mn-dev-ucsb-2.test.dataone.org/metacat/d1/mn/v2/object/testMNodeTier3:2015320232437398_common-unicode-ascii-escaped-space%2520x%2520x ]
  testCreateData_IdentifierEncoding(org.dataone.integration.it.apiTests.MNStorageV2IT): ServiceFailure: 0 Client_Error: class org.dataone.client.exception.ClientSideException: /Read timed out  [for host GET https://mn-dev-ucsb-2.test.dataone.org/metacat/d1/mn/v2/object/testMNodeTier3:2015320232521460_common-unicode-ascii-escape-anyway-%252B ]
  testCreateData_IdentifierEncoding(org.dataone.integration.it.apiTests.MNStorageV2IT): ServiceFailure: 0 Client_Error: class org.dataone.client.exception.ClientSideException: /Read timed out  [for host GET https://mn-dev-ucsb-2.test.dataone.org/metacat/d1/mn/v2/object/testMNodeTier3:201532023265241_common-unicode-ascii-escape-space-v-plus-%252B%2520%252B%252520%2520%252520%252B ]
  testCreateData_IdentifierEncoding(org.dataone.integration.it.apiTests.MNStorageV2IT): ServiceFailure: 0 Client_Error: class org.dataone.client.exception.ClientSideException: /Read timed out  [for host GET https://mn-dev-ucsb-2.test.dataone.org/metacat/d1/mn/v2/object/testMNodeTier3:2015320232648988_path-unicode-ascii-safe-&=&= ]
  testCreateData_IdentifierEncoding(org.dataone.integration.it.apiTests.MNStorageV2IT): ServiceFailure: 0 Client_Error: class org.dataone.client.exception.ClientSideException: /Read timed out  [for host GET https://mn-dev-ucsb-2.test.dataone.org/metacat/d1/mn/v2/object/testMNodeTier3:2015320232732783_path-unicode-ascii-escaped-%253B ]
  testCreateData_IdentifierEncoding(org.dataone.integration.it.apiTests.MNStorageV2IT): ServiceFailure: 0 Client_Error: class org.dataone.client.exception.ClientSideException: /Read timed out  [for host GET https://mn-dev-ucsb-2.test.dataone.org/metacat/d1/mn/v2/object/testMNodeTier3:2015320232816903_path-unicode-ascii-escaped-%253F ]
  testCreateData_IdentifierEncoding(org.dataone.integration.it.apiTests.MNStorageV2IT): ServiceFailure: 0 Client_Error: class org.dataone.client.exception.ClientSideException: /Read timed out  [for host GET https://mn-dev-ucsb-2.test.dataone.org/metacat/d1/mn/v2/object/testMNodeTier3:2015320232858965_path-unicode-ascii-escaped-%252F ]
  testCreateData_IdentifierEncoding(org.dataone.integration.it.apiTests.MNStorageV2IT): ServiceFailure: 0 Client_Error: class org.dataone.client.exception.ClientSideException: /Read timed out  [for host POST https://mn-dev-ucsb-2.test.dataone.org/metacat/d1/mn/v2/object; MMP message has: ParamPart:pid = testMNodeTier3:2015320232940560_path-unicode-ascii-escaped-%253F; FilePart:object = /tmp/mmp.output.7141150910280499441.tmp (684336 bytes); FilePart:sysmeta = /tmp/mmp.output.2090817583646825737.tmp (900 bytes);  ]
  testCreateData_IdentifierEncoding(org.dataone.integration.it.apiTests.MNStorageV2IT): ServiceFailure: 0 Client_Error: class org.dataone.client.exception.ClientSideException: /Read timed out  [for host POST https://mn-dev-ucsb-2.test.dataone.org/metacat/d1/mn/v2/object; MMP message has: ParamPart:pid = testMNodeTier3:2015320233011177_path-unicode-ascii-escaped-%252F; FilePart:object = /tmp/mmp.output.1558533306275619187.tmp (684336 bytes); FilePart:sysmeta = /tmp/mmp.output.4351526726383843074.tmp (900 bytes);  ]
  testCreateData_IdentifierEncoding(org.dataone.integration.it.apiTests.MNStorageV2IT): ServiceFailure: 0 Client_Error: class org.dataone.client.exception.ClientSideException: /Read timed out  [for host POST https://mn-dev-ucsb-2.test.dataone.org/metacat/d1/mn/v2/object; MMP message has: ParamPart:pid = testMNodeTier3:2015320233041798_path-unicode-ascii-escaped-double-%2F%2Fcase; FilePart:object = /tmp/mmp.output.8017361661481462509.tmp (684336 bytes); FilePart:sysmeta = /tmp/mmp.output.1222336117411782808.tmp (912 bytes);  ]
  testCreateData_IdentifierEncoding(org.dataone.integration.it.apiTests.MNStorageV2IT): ServiceFailure: 0 Client_Error: class org.dataone.client.exception.ClientSideException: /Read timed out  [for host GET https://mn-dev-ucsb-2.test.dataone.org/metacat/d1/mn/v2/object/testMNodeTier3:2015320233112595_path-unicode-ascii-escaped-double-trailing%252F%252F ]
  testCreateData_IdentifierEncoding(org.dataone.integration.it.apiTests.MNStorageV2IT): ServiceFailure: 0 Client_Error: class org.dataone.client.exception.ClientSideException: /Read timed out  [for host GET https://mn-dev-ucsb-2.test.dataone.org/metacat/d1/mn/v2/object/testMNodeTier3:2015320233154877_path-unicode-ascii-escaped-double-%25252F%25252Fcase ]
  testCreateData_IdentifierEncoding(org.dataone.integration.it.apiTests.MNStorageV2IT): ServiceFailure: 0 Client_Error: class org.dataone.client.exception.ClientSideException: /Read timed out  [for host GET https://mn-dev-ucsb-2.test.dataone.org/metacat/d1/mn/v2/object/testMNodeTier3:2015320233236751_path-unicode-ascii-escaped-double-trailing%25252F%25252F ]
  testCreateData_IdentifierEncoding(org.dataone.integration.it.apiTests.MNStorageV2IT): ServiceFailure: 0 Client_Error: class org.dataone.client.exception.ClientSideException: /Read timed out  [for host GET https://mn-dev-ucsb-2.test.dataone.org/metacat/d1/mn/v2/object/testMNodeTier3:2015320233318905_common-unicode-bmp-1byte-escaped-%25C2%25A1%25C2%25A2%25C2%25A3 ]
  testCreateData_IdentifierEncoding(org.dataone.integration.it.apiTests.MNStorageV2IT): ServiceFailure: 0 Client_Error: class org.dataone.client.exception.ClientSideException: /Read timed out  [for host GET https://mn-dev-ucsb-2.test.dataone.org/metacat/d1/mn/v2/object/testMNodeTier3:201532023341105_common-unicode-bmp-2byte-escaped-%25E4%25A6%25B9%25E4%25A6%25BA ]
  testCreateData_IdentifierEncoding(org.dataone.integration.it.apiTests.MNStorageV2IT): ServiceFailure: 0 Client_Error: class org.dataone.client.exception.ClientSideException: /Read timed out  [for host GET https://mn-dev-ucsb-2.test.dataone.org/metacat/d1/mn/v2/object/testMNodeTier3:2015320233443231_common-ascii-doc-example-urn:lsid:ubio.org:namebank:11815 ]
  testCreateData_IdentifierEncoding(org.dataone.integration.it.apiTests.MNStorageV2IT): ServiceFailure: 0 Client_Error: class org.dataone.client.exception.ClientSideException: /Read timed out  [for host GET https://mn-dev-ucsb-2.test.dataone.org/metacat/d1/mn/v2/object/testMNodeTier3:2015320233525892_path-ascii-doc-example-10.1000%252F182 ]
  testCreateData_IdentifierEncoding(org.dataone.integration.it.apiTests.MNStorageV2IT): ServiceFailure: 0 Client_Error: class org.dataone.client.exception.ClientSideException: /Read timed out  [for host GET https://mn-dev-ucsb-2.test.dataone.org/metacat/d1/mn/v2/object/testMNodeTier3:201532023367311_path-ascii-doc-example-http:%252F%252Fexample.com%252Fdata%252Fmydata%253Frow=24 ]
  testCreateData_IdentifierEncoding(org.dataone.integration.it.apiTests.MNStorageV2IT): ServiceFailure: 0 Client_Error: class org.dataone.client.exception.ClientSideException: /Read timed out  [for host GET https://mn-dev-ucsb-2.test.dataone.org/metacat/d1/mn/v2/object/testMNodeTier3:201532023375345_path-ascii-doc-example-ldap:%252F%252Fldap1.example.net:6666%252Fo=University%252520of%252520Michigan,%2520c=US%253F%253Fsub%253F(cn=Babs%252520Jensen) ]
  testCreateData_IdentifierEncoding(org.dataone.integration.it.apiTests.MNStorageV2IT): ServiceFailure: 0 Client_Error: class org.dataone.client.exception.ClientSideException: /Read timed out  [for host GET https://mn-dev-ucsb-2.test.dataone.org/metacat/d1/mn/v2/object/testMNodeTier3:2015320233755893_common-bmp-doc-example-%25E0%25B8%2589%25E0%25B8%25B1%25E0%25B8%2599%25E0%25B8%2581%25E0%25B8%25B4%25E0%25B8%2599%25E0%25B8%2581%25E0%25B8%25A3%25E0%25B8%25B0%25E0%25B8%2588%25E0%25B8%2581%25E0%25B9%2584%25E0%25B8%2594%25E0%25B9%2589 ]
  testCreateData_IdentifierEncoding(org.dataone.integration.it.apiTests.MNStorageV2IT): ServiceFailure: 0 Client_Error: class org.dataone.client.exception.ClientSideException: /Read timed out  [for host GET https://mn-dev-ucsb-2.test.dataone.org/metacat/d1/mn/v2/object/testMNodeTier3:2015320233839693_common-bmp-doc-example-Is_f%25C3%25A9idir_liom_ithe_gloine ]
  testUpdate(org.dataone.integration.it.apiTests.MNStorageV2IT): ServiceFailure: 0 Client_Error: class org.dataone.client.exception.ClientSideException: /Read timed out  [for host GET https://mn-dev-ucsb-2.test.dataone.org/metacat/d1/mn/v2/meta/testUpdate_2015320234056913 ]
  testUpdate_badObsoletedByInfo(org.dataone.integration.it.apiTests.MNStorageV2IT): ServiceFailure: 0 Client_Error: class org.dataone.client.exception.ClientSideException: /Read timed out  [for host GET https://mn-dev-ucsb-2.test.dataone.org/metacat/d1/mn/v2/meta/testUpdate_2015320234139486 ]
  testUpdate_NoRightsOnObsoleted(org.dataone.integration.it.apiTests.MNStorageV2IT): ServiceFailure: 0 Client_Error: class org.dataone.client.exception.ClientSideException: /Read timed out  [for host GET https://mn-dev-ucsb-2.test.dataone.org/metacat/d1/mn/v2/meta/mNodeTier3TestUpdate2015320234347956 ]
  testArchive(org.dataone.integration.it.apiTests.MNStorageV2IT): ServiceFailure: 0 Client_Error: class org.dataone.client.exception.ClientSideException: /Read timed out  [for host PUT https://mn-dev-ucsb-2.test.dataone.org/metacat/d1/mn/v2/archive/mNodeTier3TestDelete2015320234451658; MMP entity is null ]
  testArchive_NoCert(org.dataone.integration.it.apiTests.MNStorageV2IT): Got InvalidToken, but couldn't perform subsequent get(). Instead: ServiceFailure: 0 Client_Error: class org.dataone.client.exception.ClientSideException: /Read timed out  [for host GET https://mn-dev-ucsb-2.test.dataone.org/metacat/d1/mn/v2/object/mNodeTier3TestArchive2015320234542654 ]
  testDelete_NoCert(org.dataone.integration.it.apiTests.MNStorageV2IT): Got NotAuthorized, but couldn't perform subsequent get(). Instead: ServiceFailure: 0 Client_Error: class org.dataone.client.exception.ClientSideException: /Read timed out  [for host GET https://mn-dev-ucsb-2.test.dataone.org/metacat/d1/mn/v2/object/mNodeTier3TestDelete2015320234631587 ]
  testUpdateSystemMetadata_NotFound(org.dataone.integration.it.apiTests.MNStorageV2IT): Expected a NotAuthorized exception. Got: org.dataone.integration.TestIterationEndingException: unexpected client-side exception encountered when trying to create test object : Unable to create test object!/class org.dataone.client.exception.ClientSideException: /Read timed out  [for host https://mn-dev-ucsb-2.test.dataone.org/metacat/d1/mn/v2 ]
  testUpdateSystemMetadata_InvalidRequest_NoPid(org.dataone.integration.it.apiTests.MNStorageV2IT): Expected an InvalidRequest exception. Got: ServiceFailure: 0 Client_Error: class org.dataone.client.exception.ClientSideException: /Read timed out  [for host GET https://mn-dev-ucsb-2.test.dataone.org/metacat/d1/mn/v2/meta/testUpdateSystemMetadata_InvalidRequest_NoPid_2015320234925277 ]
  testUpdateSystemMetadata_NoSerialVersion(org.dataone.integration.it.apiTests.MNStorageV2IT): Expected no exception. Got: ServiceFailure: 0 Client_Error: class org.dataone.client.exception.ClientSideException: /Read timed out  [for host GET https://mn-dev-ucsb-2.test.dataone.org/metacat/d1/mn/v2/meta/testUpdateSystemMetadata_NoSerialVersion_2015320235040276 ]
  testUpdateSystemMetadata_InvalidRequest_PidMismatch(org.dataone.integration.it.apiTests.MNStorageV2IT): Expected an InvalidRequest. Got: ServiceFailure: 0 Client_Error: class org.dataone.client.exception.ClientSideException: /Read timed out  [for host GET https://mn-dev-ucsb-2.test.dataone.org/metacat/d1/mn/v2/meta/testUpdateSystemMetadata_InvalidRequest_PidMismatch20153202352191 ]
  testUpdateSystemMetadata_InvalidRequest_SysmetaUnmodified(org.dataone.integration.it.apiTests.MNStorageV2IT): updateSystemMetadata call shouldn't fail if metadata was not modified. Got: ServiceFailure: 0 Client_Error: class org.dataone.client.exception.ClientSideException: /Read timed out  [for host GET https://mn-dev-ucsb-2.test.dataone.org/metacat/d1/mn/v2/meta/testUpdateSystemMetadata_InvalidSystemMetadata_SysmetaUnmodified201532023530971 ]
  testIsAuthorized_AccessPolicy_is_legacyAccount_can_Write(org.dataone.integration.it.apiTests.MNAuthorizationV2IT): https://mn-dev-ucsb-2.test.dataone.org/metacat/d1/mn Failed 1 or more tests:
  testIsAuthorized_AccessPolicy_is_legacyAccount_can_Write(org.dataone.integration.it.apiTests.MNAuthorizationV2IT): ServiceFailure: 0 Client_Error: class org.dataone.client.exception.ClientSideException: /mn-dev-unm-2.test.dataone.org: Temporary failure in name resolution  [for host GET https://mn-dev-unm-2.test.dataone.org/metacat/d1/mn/v2/meta/TierTesting:mn-dev-unm-2:legacyAcct_WRITE.14 ]
  testIsAuthorized_ComplicatedAccessPolicy(org.dataone.integration.it.apiTests.MNAuthorizationV2IT): ServiceFailure: 0 Client_Error: class org.dataone.client.exception.ClientSideException: /Read timed out  [for host GET https://mn-dev-ucsb-2.test.dataone.org/metacat/d1/mn/v2/meta/TierTesting:mn-dev-ucsb-2:ComplicatedPolicy.14 ]
  testGetPackage_NotAuthorized(org.dataone.integration.it.apiTests.MNPackageV2IT): org.dataone.client.exception.ClientSideException: Unable to create object for MNPackage testing./Unable to create test object!/class org.dataone.client.exception.ClientSideException: /Read timed out  [for host https://mn-dev-ucsb-2.test.dataone.org/metacat/d1/mn ]
  testGetPackage_NotFound(org.dataone.integration.it.apiTests.MNPackageV2IT): ServiceFailure: 0 Client_Error:: class org.dataone.client.exception.ClientSideException: /Read timed out  [for host GET https://mn-dev-unm-2.test.dataone.org/metacat/d1/mn/v2/monitor/ping ]
  testGetPackage(org.dataone.integration.it.apiTests.MNPackageV2IT): org.dataone.client.exception.ClientSideException: Unable to create object for MNPackage testing./Unable to create test object!/class org.dataone.client.exception.ClientSideException: /Read timed out  [for host https://mn-dev-ucsb-2.test.dataone.org/metacat/d1/mn ]
  testView_NotAuthorized(org.dataone.integration.it.apiTests.MNViewV2IT): Expected a NotAuthorized exception. Got: ServiceFailure: 0 Client_Error: class org.dataone.client.exception.ClientSideException: /Read timed out  [for host GET https://mn-dev-ucsb-2.test.dataone.org/metacat/d1/mn/v2/meta/testView_NotAuthorized_201532122817675 ]
  testView_InvalidTheme(org.dataone.integration.it.apiTests.MNViewV2IT): Expected an InvalidRequest exception. Got: ServiceFailure: 0 Client_Error: class org.dataone.client.exception.ClientSideException: /Read timed out  [for host GET https://mn-dev-ucsb-2.test.dataone.org/metacat/d1/mn/v2/meta/testView_InvalidTheme_201532122856932 ]
  testView_NotFound(org.dataone.integration.it.apiTests.MNViewV2IT): Expected a NotAuthorized exception. Got: ServiceFailure: 0 Client_Error: class org.dataone.client.exception.ClientSideException: /Read timed out  [for host GET https://mn-dev-ucsb-2.test.dataone.org/metacat/d1/mn/v2/meta/testView_NotAuthorized_201532122931601 ]
  testReplicate_ValidCertificate_NotCN(org.dataone.integration.it.apiTests.MNReplicationV2IT): Expected NotAuthorized, got: ServiceFailure: 0 Client_Error: class org.dataone.client.exception.ClientSideException: /Read timed out  [for host POST https://mn-dev-ucsb-2.test.dataone.org/metacat/d1/mn/v2/replicate; MMP message has: ParamPart:sourceNode = bad; FilePart:sysmeta = /tmp/mmp.output.3350901859779567510.tmp (849 bytes);  ]
  testSystemMetadataChanged_NotFoundAuthCN(org.dataone.integration.it.apiTests.MNReadV2IT): This call to systemMetadataChanged should throw a InvalidRequest exception if called with a bogus pid. Got: ServiceFailure: 0 Client_Error: class org.dataone.client.exception.ClientSideException: /Read timed out  [for host POST https://mn-dev-ucsb-2.test.dataone.org/metacat/d1/mn/v2/dirtySystemMetadata; MMP message has: ParamPart:pid = bogusPid; ParamPart:dateSysMetaLastModified = 2015-11-17T10:31:17.569+00:00; ParamPart:serialVersion = 10;  ]
  testGetReplica_PublicObject(org.dataone.integration.it.apiTests.MNReadV2IT): Should be able to retrieve a public object (as subject cnDevUNM2).  If the node is checking the client subject against the CN for all getReplica requests, and the node is not registered to an environment, this failure can be ignored.  Got:ServiceFailure: 0 Client_Error:: class org.dataone.client.exception.ClientSideException: /Read timed out  [for host GET https://mn-dev-ucsb-2.test.dataone.org/metacat/d1/mn/v2/replica/0007f892-0d8f-4451-94e9-94d02ba5dd0d_0 ]
  testGetReplica_ValidCertificate_NotMN(org.dataone.integration.it.apiTests.MNReadV2IT): org.dataone.integration.TestIterationEndingException: could not create a test object and attempts to find an object with a public accessRule gave the following exception: ServiceFailure:: class org.dataone.client.exception.ClientSideException: /Read timed out  [for host https://mn-dev-ucsb-2.test.dataone.org/metacat/d1/mn/v2 ]
  testSystemMetadataChanged(org.dataone.integration.it.apiTests.MNReadV2IT): org.dataone.integration.TestIterationEndingException: could not create a test object and attempts to find an object with a public accessRule gave the following exception: ServiceFailure:: class org.dataone.client.exception.ClientSideException: /Read timed out  [for host https://mn-dev-ucsb-2.test.dataone.org/metacat/d1/mn/v2 ]
  testSystemMetadataChanged_NotAuthRightsHolder(org.dataone.integration.it.apiTests.MNReadV2IT): This call to systemMetadataChanged should throw a NotAuthorized exception if called with the rightsHolder certificate. Got: ServiceFailure: 0 Client_Error: class org.dataone.client.exception.ClientSideException: /Read timed out  [for host POST https://mn-dev-ucsb-2.test.dataone.org/metacat/d1/mn/v2/dirtySystemMetadata; MMP message has: ParamPart:pid = bogusPid; ParamPart:dateSysMetaLastModified = 2015-11-17T10:44:33.236+00:00; ParamPart:serialVersion = 10;  ]

Tests run: 141, Failures: 60, Errors: 0, Skipped: 4

[WARNING] File encoding has not been set, using platform encoding UTF-8, i.e. build is platform dependent!
[JENKINS] Recording test results
[INFO] 
[INFO] --- maven-failsafe-plugin:2.8.1:verify (verify) @ d1_integration ---
[INFO] Failsafe report directory: /var/lib/jenkins/jobs/d1_integration_DEV2_mn_v2/workspace/target/failsafe-reports
[WARNING] File encoding has not been set, using platform encoding UTF-8, i.e. build is platform dependent!
[ERROR] There are test failures.

Please refer to /var/lib/jenkins/jobs/d1_integration_DEV2_mn_v2/workspace/target/failsafe-reports for the individual test results.
[JENKINS] Recording test results
Notifying upstream projects of job completion
Join notifier requires a CauseAction
[INFO] ------------------------------------------------------------------------
[INFO] BUILD SUCCESS
[INFO] ------------------------------------------------------------------------
[INFO] Total time: 3:30:49.147s
[INFO] Finished at: Tue Nov 17 10:45:08 UTC 2015
[INFO] Final Memory: 48M/741M
[INFO] ------------------------------------------------------------------------
Waiting for Jenkins to finish collecting data
[JENKINS] Archiving /var/lib/jenkins/jobs/d1_integration_DEV2_mn_v2/workspace/pom.xml to org.dataone/d1_integration/2.0-SNAPSHOT/d1_integration-2.0-SNAPSHOT.pom
channel stopped
[WARNING] Couldn't clean up oid=3 from null
hudson.remoting.ChannelClosedException: channel is already closed
	at hudson.remoting.Channel.send(Channel.java:575)
	at hudson.remoting.RemoteInvocationHandler$PhantomReferenceImpl.cleanup(RemoteInvocationHandler.java:360)
	at hudson.remoting.RemoteInvocationHandler$PhantomReferenceImpl.access$700(RemoteInvocationHandler.java:319)
	at hudson.remoting.RemoteInvocationHandler$Unexporter.run(RemoteInvocationHandler.java:420)
	at java.util.concurrent.Executors$RunnableAdapter.call(Executors.java:471)
	at java.util.concurrent.FutureTask.run(FutureTask.java:262)
	at hudson.remoting.AtmostOneThreadExecutor$Worker.run(AtmostOneThreadExecutor.java:110)
	at java.lang.Thread.run(Thread.java:745)
Caused by: java.io.IOException
	at hudson.remoting.Channel.close(Channel.java:1160)
	at hudson.remoting.Channel.close(Channel.java:1135)
	at hudson.remoting.Channel$CloseCommand.execute(Channel.java:1076)
	at hudson.remoting.Channel$1.handle(Channel.java:498)
	at hudson.remoting.SynchronousCommandTransport$ReaderThread.run(SynchronousCommandTransport.java:60)
Notifying upstream projects of job completion
Warning: you have no plugins providing access control for builds, so falling back to legacy behavior of permitting any downstream builds to be triggered
Finished: UNSTABLE