UnstableConsole Output

Skipping 186 KB.. Full Log
BlockJUnit4ClassRunner.java:76)
	at org.junit.runners.BlockJUnit4ClassRunner.runChild(BlockJUnit4ClassRunner.java:50)
	at org.junit.runners.ParentRunner$3.run(ParentRunner.java:193)
	at org.junit.runners.ParentRunner$1.schedule(ParentRunner.java:52)
	at org.junit.runners.ParentRunner.runChildren(ParentRunner.java:191)
	at org.junit.runners.ParentRunner.access$000(ParentRunner.java:42)
	at org.junit.runners.ParentRunner$2.evaluate(ParentRunner.java:184)
	at org.junit.runners.ParentRunner.run(ParentRunner.java:236)
	at org.apache.maven.surefire.junit4.JUnit4TestSet.execute(JUnit4TestSet.java:53)
	at org.apache.maven.surefire.junit4.JUnit4Provider.executeTestSet(JUnit4Provider.java:123)
	at org.apache.maven.surefire.junit4.JUnit4Provider.invoke(JUnit4Provider.java:104)
	at sun.reflect.NativeMethodAccessorImpl.invoke0(Native Method)
	at sun.reflect.NativeMethodAccessorImpl.invoke(NativeMethodAccessorImpl.java:57)
	at sun.reflect.DelegatingMethodAccessorImpl.invoke(DelegatingMethodAccessorImpl.java:43)
	at java.lang.reflect.Method.invoke(Method.java:606)
	at org.apache.maven.surefire.util.ReflectionUtils.invokeMethodWithArray(ReflectionUtils.java:164)
	at org.apache.maven.surefire.booter.ProviderFactory$ProviderProxy.invoke(ProviderFactory.java:110)
	at org.apache.maven.surefire.booter.SurefireStarter.invokeProvider(SurefireStarter.java:175)
	at org.apache.maven.surefire.booter.SurefireStarter.runSuitesInProcessWhenForked(SurefireStarter.java:107)
	at org.apache.maven.surefire.booter.ForkedBooter.main(ForkedBooter.java:68)
Caused by: org.apache.commons.configuration.ConfigurationException: Cannot locate configuration source null
	at org.apache.commons.configuration.AbstractFileConfiguration.load(AbstractFileConfiguration.java:217)
	at org.apache.commons.configuration.AbstractFileConfiguration.load(AbstractFileConfiguration.java:197)
	at org.apache.commons.configuration.AbstractFileConfiguration.<init>(AbstractFileConfiguration.java:181)
	at org.apache.commons.configuration.PropertiesConfiguration.<init>(PropertiesConfiguration.java:269)
	at org.dataone.configuration.TestSettings.loadConfigurationFile(TestSettings.java:199)
	at org.dataone.configuration.TestSettings.getConfiguration(TestSettings.java:69)
	... 38 more
20151115-05:09:27: [ERROR]: Problem loading testing configuration at: 'null':: Cannot locate configuration source null [org.dataone.configuration.TestSettings]
20151115-05:09:27: [ERROR]: General Problem loading TestSettings. InvocationTargetException: null [org.dataone.configuration.Settings]
java.lang.reflect.InvocationTargetException
	at sun.reflect.NativeMethodAccessorImpl.invoke0(Native Method)
	at sun.reflect.NativeMethodAccessorImpl.invoke(NativeMethodAccessorImpl.java:57)
	at sun.reflect.DelegatingMethodAccessorImpl.invoke(DelegatingMethodAccessorImpl.java:43)
	at java.lang.reflect.Method.invoke(Method.java:606)
	at org.dataone.configuration.Settings.loadTestConfigurations(Settings.java:151)
	at org.dataone.configuration.Settings.getConfiguration(Settings.java:87)
	at org.dataone.configuration.Settings.getResetConfiguration(Settings.java:123)
	at org.dataone.configuration.TestSettingsTest.testContextSafetyOnError(TestSettingsTest.java:209)
	at sun.reflect.NativeMethodAccessorImpl.invoke0(Native Method)
	at sun.reflect.NativeMethodAccessorImpl.invoke(NativeMethodAccessorImpl.java:57)
	at sun.reflect.DelegatingMethodAccessorImpl.invoke(DelegatingMethodAccessorImpl.java:43)
	at java.lang.reflect.Method.invoke(Method.java:606)
	at org.junit.runners.model.FrameworkMethod$1.runReflectiveCall(FrameworkMethod.java:44)
	at org.junit.internal.runners.model.ReflectiveCallable.run(ReflectiveCallable.java:15)
	at org.junit.runners.model.FrameworkMethod.invokeExplosively(FrameworkMethod.java:41)
	at org.junit.internal.runners.statements.InvokeMethod.evaluate(InvokeMethod.java:20)
	at org.junit.internal.runners.statements.RunBefores.evaluate(RunBefores.java:28)
	at org.junit.internal.runners.statements.RunAfters.evaluate(RunAfters.java:31)
	at org.junit.runners.BlockJUnit4ClassRunner.runChild(BlockJUnit4ClassRunner.java:76)
	at org.junit.runners.BlockJUnit4ClassRunner.runChild(BlockJUnit4ClassRunner.java:50)
	at org.junit.runners.ParentRunner$3.run(ParentRunner.java:193)
	at org.junit.runners.ParentRunner$1.schedule(ParentRunner.java:52)
	at org.junit.runners.ParentRunner.runChildren(ParentRunner.java:191)
	at org.junit.runners.ParentRunner.access$000(ParentRunner.java:42)
	at org.junit.runners.ParentRunner$2.evaluate(ParentRunner.java:184)
	at org.junit.runners.ParentRunner.run(ParentRunner.java:236)
	at org.apache.maven.surefire.junit4.JUnit4TestSet.execute(JUnit4TestSet.java:53)
	at org.apache.maven.surefire.junit4.JUnit4Provider.executeTestSet(JUnit4Provider.java:123)
	at org.apache.maven.surefire.junit4.JUnit4Provider.invoke(JUnit4Provider.java:104)
	at sun.reflect.NativeMethodAccessorImpl.invoke0(Native Method)
	at sun.reflect.NativeMethodAccessorImpl.invoke(NativeMethodAccessorImpl.java:57)
	at sun.reflect.DelegatingMethodAccessorImpl.invoke(DelegatingMethodAccessorImpl.java:43)
	at java.lang.reflect.Method.invoke(Method.java:606)
	at org.apache.maven.surefire.util.ReflectionUtils.invokeMethodWithArray(ReflectionUtils.java:164)
	at org.apache.maven.surefire.booter.ProviderFactory$ProviderProxy.invoke(ProviderFactory.java:110)
	at org.apache.maven.surefire.booter.SurefireStarter.invokeProvider(SurefireStarter.java:175)
	at org.apache.maven.surefire.booter.SurefireStarter.runSuitesInProcessWhenForked(SurefireStarter.java:107)
	at org.apache.maven.surefire.booter.ForkedBooter.main(ForkedBooter.java:68)
Caused by: org.apache.commons.configuration.ConfigurationException: Cannot locate configuration source null
	at org.apache.commons.configuration.AbstractFileConfiguration.load(AbstractFileConfiguration.java:217)
	at org.apache.commons.configuration.AbstractFileConfiguration.load(AbstractFileConfiguration.java:197)
	at org.apache.commons.configuration.AbstractFileConfiguration.<init>(AbstractFileConfiguration.java:181)
	at org.apache.commons.configuration.PropertiesConfiguration.<init>(PropertiesConfiguration.java:269)
	at org.dataone.configuration.TestSettings.loadConfigurationFile(TestSettings.java:199)
	at org.dataone.configuration.TestSettings.getConfiguration(TestSettings.java:69)
	... 38 more
20151115-05:09:27: [ERROR]: Problem loading testing configuration at: 'null':: Cannot locate configuration source null [org.dataone.configuration.TestSettings]
20151115-05:09:27: [ERROR]: General Problem loading TestSettings. InvocationTargetException: null [org.dataone.configuration.Settings]
java.lang.reflect.InvocationTargetException
	at sun.reflect.NativeMethodAccessorImpl.invoke0(Native Method)
	at sun.reflect.NativeMethodAccessorImpl.invoke(NativeMethodAccessorImpl.java:57)
	at sun.reflect.DelegatingMethodAccessorImpl.invoke(DelegatingMethodAccessorImpl.java:43)
	at java.lang.reflect.Method.invoke(Method.java:606)
	at org.dataone.configuration.Settings.loadTestConfigurations(Settings.java:151)
	at org.dataone.configuration.Settings.getConfiguration(Settings.java:87)
	at org.dataone.configuration.Settings.getResetConfiguration(Settings.java:123)
	at org.dataone.configuration.TestSettingsTest.testContextSafetyOnError(TestSettingsTest.java:211)
	at sun.reflect.NativeMethodAccessorImpl.invoke0(Native Method)
	at sun.reflect.NativeMethodAccessorImpl.invoke(NativeMethodAccessorImpl.java:57)
	at sun.reflect.DelegatingMethodAccessorImpl.invoke(DelegatingMethodAccessorImpl.java:43)
	at java.lang.reflect.Method.invoke(Method.java:606)
	at org.junit.runners.model.FrameworkMethod$1.runReflectiveCall(FrameworkMethod.java:44)
	at org.junit.internal.runners.model.ReflectiveCallable.run(ReflectiveCallable.java:15)
	at org.junit.runners.model.FrameworkMethod.invokeExplosively(FrameworkMethod.java:41)
	at org.junit.internal.runners.statements.InvokeMethod.evaluate(InvokeMethod.java:20)
	at org.junit.internal.runners.statements.RunBefores.evaluate(RunBefores.java:28)
	at org.junit.internal.runners.statements.RunAfters.evaluate(RunAfters.java:31)
	at org.junit.runners.BlockJUnit4ClassRunner.runChild(BlockJUnit4ClassRunner.java:76)
	at org.junit.runners.BlockJUnit4ClassRunner.runChild(BlockJUnit4ClassRunner.java:50)
	at org.junit.runners.ParentRunner$3.run(ParentRunner.java:193)
	at org.junit.runners.ParentRunner$1.schedule(ParentRunner.java:52)
	at org.junit.runners.ParentRunner.runChildren(ParentRunner.java:191)
	at org.junit.runners.ParentRunner.access$000(ParentRunner.java:42)
	at org.junit.runners.ParentRunner$2.evaluate(ParentRunner.java:184)
	at org.junit.runners.ParentRunner.run(ParentRunner.java:236)
	at org.apache.maven.surefire.junit4.JUnit4TestSet.execute(JUnit4TestSet.java:53)
	at org.apache.maven.surefire.junit4.JUnit4Provider.executeTestSet(JUnit4Provider.java:123)
	at org.apache.maven.surefire.junit4.JUnit4Provider.invoke(JUnit4Provider.java:104)
	at sun.reflect.NativeMethodAccessorImpl.invoke0(Native Method)
	at sun.reflect.NativeMethodAccessorImpl.invoke(NativeMethodAccessorImpl.java:57)
	at sun.reflect.DelegatingMethodAccessorImpl.invoke(DelegatingMethodAccessorImpl.java:43)
	at java.lang.reflect.Method.invoke(Method.java:606)
	at org.apache.maven.surefire.util.ReflectionUtils.invokeMethodWithArray(ReflectionUtils.java:164)
	at org.apache.maven.surefire.booter.ProviderFactory$ProviderProxy.invoke(ProviderFactory.java:110)
	at org.apache.maven.surefire.booter.SurefireStarter.invokeProvider(SurefireStarter.java:175)
	at org.apache.maven.surefire.booter.SurefireStarter.runSuitesInProcessWhenForked(SurefireStarter.java:107)
	at org.apache.maven.surefire.booter.ForkedBooter.main(ForkedBooter.java:68)
Caused by: org.apache.commons.configuration.ConfigurationException: Cannot locate configuration source null
	at org.apache.commons.configuration.AbstractFileConfiguration.load(AbstractFileConfiguration.java:217)
	at org.apache.commons.configuration.AbstractFileConfiguration.load(AbstractFileConfiguration.java:197)
	at org.apache.commons.configuration.AbstractFileConfiguration.<init>(AbstractFileConfiguration.java:181)
	at org.apache.commons.configuration.PropertiesConfiguration.<init>(PropertiesConfiguration.java:269)
	at org.dataone.configuration.TestSettings.loadConfigurationFile(TestSettings.java:199)
	at org.dataone.configuration.TestSettings.getConfiguration(TestSettings.java:69)
	... 38 more
Tests run: 11, Failures: 0, Errors: 0, Skipped: 1, Time elapsed: 0.101 sec
Running org.dataone.client.PoolingHttpClientConnectionManagerTest
Tests run: 2, Failures: 0, Errors: 0, Skipped: 1, Time elapsed: 0 sec
Running org.dataone.client.CNRestURLTest
Tests run: 9, Failures: 0, Errors: 0, Skipped: 8, Time elapsed: 0.013 sec

Results :

Tests run: 35, Failures: 0, Errors: 0, Skipped: 12

[JENKINS] Recording test results
[INFO] 
[INFO] --- maven-antrun-plugin:1.3:run (execution1) @ d1_integration ---
[INFO] Executing tasks
     [copy] Copying 236 files to /var/lib/jenkins/jobs/d1_integration_DEV2_mn_sysmeta_mutability/workspace/target/classes
     [copy] Copying 3 files to /var/lib/jenkins/jobs/d1_integration_DEV2_mn_sysmeta_mutability/workspace/target/d1_integration-2.0-SNAPSHOT/org/dataone/integration/webTest
[INFO] Executed tasks
[INFO] 
[INFO] --- maven-dependency-plugin:2.3:unpack-dependencies (jetty-classpath) @ d1_integration ---
[INFO] Unpacking /var/lib/jenkins/.m2/repository/org/eclipse/jetty/orbit/org.apache.jasper.glassfish/2.2.2.v201112011158/org.apache.jasper.glassfish-2.2.2.v201112011158.jar to /var/lib/jenkins/jobs/d1_integration_DEV2_mn_sysmeta_mutability/workspace/target/d1_integration-2.0-SNAPSHOT with includes "" and excludes ""
[INFO] Unpacking /var/lib/jenkins/.m2/repository/org/slf4j/slf4j-simple/1.6.4/slf4j-simple-1.6.4.jar to /var/lib/jenkins/jobs/d1_integration_DEV2_mn_sysmeta_mutability/workspace/target/d1_integration-2.0-SNAPSHOT with includes "" and excludes ""
[INFO] Unpacking /var/lib/jenkins/.m2/repository/org/eclipse/jetty/jetty-websocket/8.1.15.v20140411/jetty-websocket-8.1.15.v20140411.jar to /var/lib/jenkins/jobs/d1_integration_DEV2_mn_sysmeta_mutability/workspace/target/d1_integration-2.0-SNAPSHOT with includes "" and excludes ""
[INFO] Unpacking /var/lib/jenkins/.m2/repository/org/eclipse/jetty/orbit/javax.security.auth.message/1.0.0.v201108011116/javax.security.auth.message-1.0.0.v201108011116.jar to /var/lib/jenkins/jobs/d1_integration_DEV2_mn_sysmeta_mutability/workspace/target/d1_integration-2.0-SNAPSHOT with includes "" and excludes ""
[INFO] Unpacking /var/lib/jenkins/.m2/repository/org/eclipse/jetty/orbit/javax.servlet.jsp.jstl/1.2.0.v201105211821/javax.servlet.jsp.jstl-1.2.0.v201105211821.jar to /var/lib/jenkins/jobs/d1_integration_DEV2_mn_sysmeta_mutability/workspace/target/d1_integration-2.0-SNAPSHOT with includes "" and excludes ""
[INFO] Unpacking /var/lib/jenkins/.m2/repository/org/eclipse/jetty/orbit/com.sun.el/2.2.0.v201108011116/com.sun.el-2.2.0.v201108011116.jar to /var/lib/jenkins/jobs/d1_integration_DEV2_mn_sysmeta_mutability/workspace/target/d1_integration-2.0-SNAPSHOT with includes "" and excludes ""
[INFO] Unpacking /var/lib/jenkins/.m2/repository/org/eclipse/jetty/orbit/javax.mail.glassfish/1.4.1.v201005082020/javax.mail.glassfish-1.4.1.v201005082020.jar to /var/lib/jenkins/jobs/d1_integration_DEV2_mn_sysmeta_mutability/workspace/target/d1_integration-2.0-SNAPSHOT with includes "" and excludes ""
[INFO] Unpacking /var/lib/jenkins/.m2/repository/org/slf4j/slf4j-api/1.6.4/slf4j-api-1.6.4.jar to /var/lib/jenkins/jobs/d1_integration_DEV2_mn_sysmeta_mutability/workspace/target/d1_integration-2.0-SNAPSHOT with includes "" and excludes ""
[INFO] Unpacking /var/lib/jenkins/.m2/repository/org/eclipse/jetty/jetty-io/8.1.15.v20140411/jetty-io-8.1.15.v20140411.jar to /var/lib/jenkins/jobs/d1_integration_DEV2_mn_sysmeta_mutability/workspace/target/d1_integration-2.0-SNAPSHOT with includes "" and excludes ""
[INFO] Unpacking /var/lib/jenkins/.m2/repository/org/eclipse/jetty/orbit/javax.servlet.jsp/2.2.0.v201112011158/javax.servlet.jsp-2.2.0.v201112011158.jar to /var/lib/jenkins/jobs/d1_integration_DEV2_mn_sysmeta_mutability/workspace/target/d1_integration-2.0-SNAPSHOT with includes "" and excludes ""
[INFO] Unpacking /var/lib/jenkins/.m2/repository/org/eclipse/jetty/aggregate/jetty-all-server/8.1.15.v20140411/jetty-all-server-8.1.15.v20140411.jar to /var/lib/jenkins/jobs/d1_integration_DEV2_mn_sysmeta_mutability/workspace/target/d1_integration-2.0-SNAPSHOT with includes "" and excludes ""
[INFO] Unpacking /var/lib/jenkins/.m2/repository/org/eclipse/jetty/jetty-jsp/8.1.15.v20140411/jetty-jsp-8.1.15.v20140411.jar to /var/lib/jenkins/jobs/d1_integration_DEV2_mn_sysmeta_mutability/workspace/target/d1_integration-2.0-SNAPSHOT with includes "" and excludes ""
[INFO] Unpacking /var/lib/jenkins/.m2/repository/org/eclipse/jetty/orbit/org.apache.taglibs.standard.glassfish/1.2.0.v201112081803/org.apache.taglibs.standard.glassfish-1.2.0.v201112081803.jar to /var/lib/jenkins/jobs/d1_integration_DEV2_mn_sysmeta_mutability/workspace/target/d1_integration-2.0-SNAPSHOT with includes "" and excludes ""
[INFO] Unpacking /var/lib/jenkins/.m2/repository/javax/servlet/servlet-api/2.5/servlet-api-2.5.jar to /var/lib/jenkins/jobs/d1_integration_DEV2_mn_sysmeta_mutability/workspace/target/d1_integration-2.0-SNAPSHOT with includes "" and excludes ""
[INFO] Unpacking /var/lib/jenkins/.m2/repository/org/eclipse/jetty/orbit/javax.activation/1.1.0.v201105071233/javax.activation-1.1.0.v201105071233.jar to /var/lib/jenkins/jobs/d1_integration_DEV2_mn_sysmeta_mutability/workspace/target/d1_integration-2.0-SNAPSHOT with includes "" and excludes ""
[INFO] Unpacking /var/lib/jenkins/.m2/repository/org/eclipse/jetty/orbit/javax.annotation/1.1.0.v201108011116/javax.annotation-1.1.0.v201108011116.jar to /var/lib/jenkins/jobs/d1_integration_DEV2_mn_sysmeta_mutability/workspace/target/d1_integration-2.0-SNAPSHOT with includes "" and excludes ""
[INFO] Unpacking /var/lib/jenkins/.m2/repository/org/eclipse/jetty/jetty-http/8.1.15.v20140411/jetty-http-8.1.15.v20140411.jar to /var/lib/jenkins/jobs/d1_integration_DEV2_mn_sysmeta_mutability/workspace/target/d1_integration-2.0-SNAPSHOT with includes "" and excludes ""
[INFO] Unpacking /var/lib/jenkins/.m2/repository/org/eclipse/jetty/jetty-util/8.1.15.v20140411/jetty-util-8.1.15.v20140411.jar to /var/lib/jenkins/jobs/d1_integration_DEV2_mn_sysmeta_mutability/workspace/target/d1_integration-2.0-SNAPSHOT with includes "" and excludes ""
[INFO] Unpacking /var/lib/jenkins/.m2/repository/org/eclipse/jetty/orbit/org.eclipse.jdt.core/3.7.1/org.eclipse.jdt.core-3.7.1.jar to /var/lib/jenkins/jobs/d1_integration_DEV2_mn_sysmeta_mutability/workspace/target/d1_integration-2.0-SNAPSHOT with includes "" and excludes ""
[INFO] Unpacking /var/lib/jenkins/.m2/repository/org/eclipse/jetty/orbit/javax.servlet/3.0.0.v201112011016/javax.servlet-3.0.0.v201112011016.jar to /var/lib/jenkins/jobs/d1_integration_DEV2_mn_sysmeta_mutability/workspace/target/d1_integration-2.0-SNAPSHOT with includes "" and excludes ""
[INFO] Unpacking /var/lib/jenkins/.m2/repository/org/eclipse/jetty/orbit/javax.el/2.2.0.v201108011116/javax.el-2.2.0.v201108011116.jar to /var/lib/jenkins/jobs/d1_integration_DEV2_mn_sysmeta_mutability/workspace/target/d1_integration-2.0-SNAPSHOT with includes "" and excludes ""
[INFO] 
[INFO] --- maven-war-plugin:2.1.1:war (default-war) @ d1_integration ---
[INFO] Packaging webapp
[INFO] Assembling webapp [d1_integration] in [/var/lib/jenkins/jobs/d1_integration_DEV2_mn_sysmeta_mutability/workspace/target/d1_integration-2.0-SNAPSHOT]
[INFO] Processing war project
[INFO] Copying webapp resources [/var/lib/jenkins/jobs/d1_integration_DEV2_mn_sysmeta_mutability/workspace/src/main/webapp]
[INFO] Webapp assembled in [378 msecs]
[INFO] Building war: /var/lib/jenkins/jobs/d1_integration_DEV2_mn_sysmeta_mutability/workspace/target/d1_integration-2.0-SNAPSHOT.war
[INFO] WEB-INF/web.xml already added, skipping
[INFO] 
[INFO] --- maven-antrun-plugin:1.3:run (execution2) @ d1_integration ---
[INFO] Executing tasks
     [move] Moving 1 file to /var/lib/jenkins/jobs/d1_integration_DEV2_mn_sysmeta_mutability/workspace/target
[INFO] Executed tasks
[INFO] 
[INFO] --- maven-failsafe-plugin:2.8.1:integration-test (integration-test) @ d1_integration ---
[INFO] Failsafe report directory: /var/lib/jenkins/jobs/d1_integration_DEV2_mn_sysmeta_mutability/workspace/target/failsafe-reports

-------------------------------------------------------
 T E S T S
-------------------------------------------------------
Running org.dataone.integration.it.apiTests.MNSystemMetadataMutabilityIt
20151115-05:09:41: [INFO]: **************************************************** [org.dataone.integration.ContextAwareTestCaseDataone]
20151115-05:09:41: [INFO]: ***  context label:   DEV2 [org.dataone.integration.ContextAwareTestCaseDataone]
20151115-05:09:41: [INFO]: **************************************************** [org.dataone.integration.ContextAwareTestCaseDataone]
~~~ Context is from d1client.properties: https://cn-dev-2.test.dataone.org/cn
20151115-05:09:41: [INFO]: rest call info: GET https://cn-dev-2.test.dataone.org/cn/v1/node [org.dataone.client.rest.RestClient]
20151115-05:09:42: [INFO]: isNodeAlive for Node: https://cn-dev-2.test.dataone.org/cn ... [org.dataone.integration.ContextAwareTestCaseDataone]
20151115-05:09:42: [INFO]: ... calling node ... [org.dataone.integration.ContextAwareTestCaseDataone]
20151115-05:09:42: [INFO]: rest call info: GET https://cn-dev-2.test.dataone.org/cn [org.dataone.client.rest.RestClient]
20151115-05:09:42: [INFO]: ... called node [org.dataone.integration.ContextAwareTestCaseDataone]
20151115-05:09:42: [INFO]: *** Adding CN to list: cn-dev-2 [ https://cn-dev-2.test.dataone.org/cn ] [org.dataone.integration.ContextAwareTestCaseDataone]
20151115-05:09:42: [INFO]: isNodeAlive for Node: https://cn-dev-ucsb-2.test.dataone.org/cn ... [org.dataone.integration.ContextAwareTestCaseDataone]
20151115-05:09:42: [INFO]: ... calling node ... [org.dataone.integration.ContextAwareTestCaseDataone]
20151115-05:09:42: [INFO]: rest call info: GET https://cn-dev-ucsb-2.test.dataone.org/cn [org.dataone.client.rest.RestClient]
20151115-05:09:42: [INFO]: ... called node [org.dataone.integration.ContextAwareTestCaseDataone]
20151115-05:09:42: [INFO]: *** Adding CN to list: cn-dev-ucsb-2 [ https://cn-dev-ucsb-2.test.dataone.org/cn ] [org.dataone.integration.ContextAwareTestCaseDataone]
20151115-05:09:42: [INFO]: isNodeAlive for Node: https://cn-dev-unm-2.test.dataone.org/cn ... [org.dataone.integration.ContextAwareTestCaseDataone]
20151115-05:09:42: [INFO]: ... calling node ... [org.dataone.integration.ContextAwareTestCaseDataone]
20151115-05:09:43: [INFO]: rest call info: GET https://cn-dev-unm-2.test.dataone.org/cn [org.dataone.client.rest.RestClient]
20151115-05:09:43: [INFO]: ... called node [org.dataone.integration.ContextAwareTestCaseDataone]
20151115-05:09:43: [INFO]: *** Adding CN to list: cn-dev-unm-2 [ https://cn-dev-unm-2.test.dataone.org/cn ] [org.dataone.integration.ContextAwareTestCaseDataone]
20151115-05:09:43: [INFO]: isNodeAlive for Node: https://mn-dev-ucsb-1.test.dataone.org/metacat/d1/mn ... [org.dataone.integration.ContextAwareTestCaseDataone]
20151115-05:09:43: [INFO]: ... calling node ... [org.dataone.integration.ContextAwareTestCaseDataone]
20151115-05:09:43: [INFO]: rest call info: GET https://mn-dev-ucsb-1.test.dataone.org/metacat/d1/mn [org.dataone.client.rest.RestClient]
20151115-05:09:43: [INFO]: ... called node [org.dataone.integration.ContextAwareTestCaseDataone]
20151115-05:09:43: [INFO]: *** Adding MN to list: mn-dev-ucsb-1 [ https://mn-dev-ucsb-1.test.dataone.org/metacat/d1/mn ] [org.dataone.integration.ContextAwareTestCaseDataone]
20151115-05:09:43: [INFO]: isNodeAlive for Node: https://mn-dev-ucsb-2.test.dataone.org/metacat/d1/mn ... [org.dataone.integration.ContextAwareTestCaseDataone]
20151115-05:09:43: [INFO]: ... calling node ... [org.dataone.integration.ContextAwareTestCaseDataone]
20151115-05:09:44: [INFO]: rest call info: GET https://mn-dev-ucsb-2.test.dataone.org/metacat/d1/mn [org.dataone.client.rest.RestClient]
20151115-05:09:44: [INFO]: ... called node [org.dataone.integration.ContextAwareTestCaseDataone]
20151115-05:09:44: [INFO]: *** Adding MN to list: mn-dev-ucsb-2 [ https://mn-dev-ucsb-2.test.dataone.org/metacat/d1/mn ] [org.dataone.integration.ContextAwareTestCaseDataone]
20151115-05:09:44: [INFO]: isNodeAlive for Node: https://mn-dev-unm-1.test.dataone.org/metacat/d1/mn ... [org.dataone.integration.ContextAwareTestCaseDataone]
20151115-05:09:44: [INFO]: ... calling node ... [org.dataone.integration.ContextAwareTestCaseDataone]
20151115-05:09:44: [INFO]: rest call info: GET https://mn-dev-unm-1.test.dataone.org/metacat/d1/mn [org.dataone.client.rest.RestClient]
20151115-05:09:44: [INFO]: ... called node [org.dataone.integration.ContextAwareTestCaseDataone]
20151115-05:09:44: [INFO]: *** Adding MN to list: mn-dev-unm-1 [ https://mn-dev-unm-1.test.dataone.org/metacat/d1/mn ] [org.dataone.integration.ContextAwareTestCaseDataone]
20151115-05:09:44: [INFO]: isNodeAlive for Node: https://mn-dev-unm-2.test.dataone.org/metacat/d1/mn ... [org.dataone.integration.ContextAwareTestCaseDataone]
20151115-05:09:44: [INFO]: ... calling node ... [org.dataone.integration.ContextAwareTestCaseDataone]
20151115-05:09:44: [INFO]: rest call info: GET https://mn-dev-unm-2.test.dataone.org/metacat/d1/mn [org.dataone.client.rest.RestClient]
20151115-05:09:44: [INFO]: ... called node [org.dataone.integration.ContextAwareTestCaseDataone]
20151115-05:09:44: [INFO]: *** Adding MN to list: mn-dev-unm-2 [ https://mn-dev-unm-2.test.dataone.org/metacat/d1/mn ] [org.dataone.integration.ContextAwareTestCaseDataone]
20151115-05:09:44: [INFO]: trying to filter CN list for the round robin CN... original size: 3, includes nodes: [org.dataone.integration.ContextAwareTestCaseDataone]
20151115-05:09:44: [INFO]:     CN: https://cn-dev-2.test.dataone.org/cn "Development 2 Round Robin Router Node" [org.dataone.integration.ContextAwareTestCaseDataone]
20151115-05:09:44: [INFO]:     CN: https://cn-dev-ucsb-2.test.dataone.org/cn "UCSB Development 2 Protocol Coordinating Node" [org.dataone.integration.ContextAwareTestCaseDataone]
20151115-05:09:44: [INFO]:     CN: https://cn-dev-unm-2.test.dataone.org/cn "UNM Development 2 Protocol Coordinating Node" [org.dataone.integration.ContextAwareTestCaseDataone]
20151115-05:09:44: [INFO]: excluding round robin CN: https://cn-dev-2.test.dataone.org/cn "Development 2 Round Robin Router Node" [org.dataone.integration.ContextAwareTestCaseDataone]
20151115-05:09:44: [INFO]: including CN: https://cn-dev-ucsb-2.test.dataone.org/cn "UCSB Development 2 Protocol Coordinating Node" [org.dataone.integration.ContextAwareTestCaseDataone]
20151115-05:09:44: [INFO]: including CN: https://cn-dev-unm-2.test.dataone.org/cn "UNM Development 2 Protocol Coordinating Node" [org.dataone.integration.ContextAwareTestCaseDataone]
20151115-05:09:44: [INFO]: filtered CN list without round robin CN. size: 2, including nodes: [org.dataone.integration.ContextAwareTestCaseDataone]
20151115-05:09:44: [INFO]:     CN: https://cn-dev-ucsb-2.test.dataone.org/cn "UCSB Development 2 Protocol Coordinating Node" [org.dataone.integration.ContextAwareTestCaseDataone]
20151115-05:09:44: [INFO]:     CN: https://cn-dev-unm-2.test.dataone.org/cn "UNM Development 2 Protocol Coordinating Node" [org.dataone.integration.ContextAwareTestCaseDataone]
20151115-05:09:44: [INFO]: **************************************************** [org.dataone.integration.ContextAwareTestCaseDataone]
20151115-05:09:44: [INFO]: certificate directory: /etc/dataone/client/testClientCerts/ [org.dataone.integration.ContextAwareTestCaseDataone]
20151115-05:09:44: [INFO]: certificate filename: cnDevUNM2 [org.dataone.integration.ContextAwareTestCaseDataone]
20151115-05:09:45: [INFO]: client setup as Subject: CN=urn:node:cnDevUNM2,DC=dataone,DC=org [org.dataone.integration.ContextAwareTestCaseDataone]
20151115-05:09:45: [INFO]: rest call info: GET https://cn-dev-ucsb-2.test.dataone.org/cn/v2/node [org.dataone.client.rest.RestClient]
20151115-05:09:45: [INFO]: **************************************************** [org.dataone.integration.ContextAwareTestCaseDataone]
20151115-05:09:45: [INFO]: ***  context label:   DEV2 [org.dataone.integration.ContextAwareTestCaseDataone]
20151115-05:09:45: [INFO]: **************************************************** [org.dataone.integration.ContextAwareTestCaseDataone]
20151115-05:09:45: [INFO]: **************************************************** [org.dataone.integration.ContextAwareTestCaseDataone]
20151115-05:09:45: [INFO]: rest call info: GET https://cn-dev-ucsb-2.test.dataone.org/cn/v2/node [org.dataone.client.rest.RestClient]
20151115-05:09:45: [INFO]: **************************************************** [org.dataone.integration.ContextAwareTestCaseDataone]
20151115-05:09:45: [INFO]: ***  context label:   DEV2 [org.dataone.integration.ContextAwareTestCaseDataone]
20151115-05:09:45: [INFO]: **************************************************** [org.dataone.integration.ContextAwareTestCaseDataone]
20151115-05:09:45: [INFO]: **************************************************** [org.dataone.integration.ContextAwareTestCaseDataone]
20151115-05:09:45: [INFO]: rest call info: GET https://cn-dev-ucsb-2.test.dataone.org/cn/v2/node [org.dataone.client.rest.RestClient]
20151115-05:09:45: [INFO]: **************************************************** [org.dataone.integration.ContextAwareTestCaseDataone]
20151115-05:09:45: [INFO]: ***  context label:   DEV2 [org.dataone.integration.ContextAwareTestCaseDataone]
20151115-05:09:45: [INFO]: **************************************************** [org.dataone.integration.ContextAwareTestCaseDataone]
20151115-05:09:45: [INFO]: **************************************************** [org.dataone.integration.ContextAwareTestCaseDataone]
20151115-05:09:45: [INFO]: rest call info: GET https://cn-dev-ucsb-2.test.dataone.org/cn/v2/node [org.dataone.client.rest.RestClient]
Tests run: 4, Failures: 4, Errors: 0, Skipped: 0, Time elapsed: 6.236 sec <<< FAILURE!
Running org.dataone.integration.it.apiTests.MNUpdateSystemMetadataIT
20151115-05:09:45: [INFO]: **************************************************** [org.dataone.integration.ContextAwareTestCaseDataone]
20151115-05:09:45: [INFO]: ***  context label:   DEV2 [org.dataone.integration.ContextAwareTestCaseDataone]
20151115-05:09:45: [INFO]: **************************************************** [org.dataone.integration.ContextAwareTestCaseDataone]
20151115-05:09:45: [INFO]: **************************************************** [org.dataone.integration.ContextAwareTestCaseDataone]
20151115-05:09:46: [INFO]: rest call info: GET https://mn-dev-ucsb-1.test.dataone.org/metacat/d1/mn/v2/monitor/ping [org.dataone.client.rest.RestClient]
20151115-05:09:46: [INFO]: MN excluded from test: https://mn-dev-ucsb-1.test.dataone.org/metacat/d1/mn [org.dataone.integration.ContextAwareTestCaseDataone]
20151115-05:09:46: [INFO]: rest call info: GET https://mn-dev-ucsb-2.test.dataone.org/metacat/d1/mn/v2/monitor/ping [org.dataone.client.rest.RestClient]
20151115-05:09:46: [INFO]: MN included in test: https://mn-dev-ucsb-2.test.dataone.org/metacat/d1/mn [org.dataone.integration.ContextAwareTestCaseDataone]
20151115-05:09:46: [INFO]: rest call info: GET https://mn-dev-unm-1.test.dataone.org/metacat/d1/mn/v2/monitor/ping [org.dataone.client.rest.RestClient]
20151115-05:09:46: [INFO]: MN excluded from test: https://mn-dev-unm-1.test.dataone.org/metacat/d1/mn [org.dataone.integration.ContextAwareTestCaseDataone]
20151115-05:09:46: [INFO]: rest call info: GET https://mn-dev-unm-2.test.dataone.org/metacat/d1/mn/v2/monitor/ping [org.dataone.client.rest.RestClient]
20151115-05:09:46: [INFO]: MN included in test: https://mn-dev-unm-2.test.dataone.org/metacat/d1/mn [org.dataone.integration.ContextAwareTestCaseDataone]
20151115-05:09:46: [INFO]: certificate directory: /etc/dataone/client/testClientCerts/ [org.dataone.integration.ContextAwareTestCaseDataone]
20151115-05:09:46: [INFO]: certificate filename: testRightsHolder [org.dataone.integration.ContextAwareTestCaseDataone]
20151115-05:09:46: [INFO]: client setup as Subject: CN=testRightsHolder,DC=dataone,DC=org [org.dataone.integration.ContextAwareTestCaseDataone]
20151115-05:09:46: [INFO]: 
***************** running test for testUpdateSystemMetadata_RightsHolder(...) vs. node: https://mn-dev-ucsb-2.test.dataone.org/metacat/d1/mn ***************** [org.dataone.integration.ContextAwareTestCaseDataone]
20151115-05:09:47: [INFO]: certificate directory: /etc/dataone/client/testClientCerts/ [org.dataone.integration.ContextAwareTestCaseDataone]
20151115-05:09:47: [INFO]: certificate filename: cnDevUNM2 [org.dataone.integration.ContextAwareTestCaseDataone]
20151115-05:09:47: [INFO]: client setup as Subject: CN=urn:node:cnDevUNM2,DC=dataone,DC=org [org.dataone.integration.ContextAwareTestCaseDataone]
20151115-05:09:47: [INFO]: refreshing objectFormatCache from cn: null [org.dataone.client.v2.formats.ObjectFormatCache]
20151115-05:09:47: [INFO]: rest call info: GET https://cn-dev-2.test.dataone.org/cn/v2/formats [org.dataone.client.rest.RestClient]
20151115-05:09:47: [INFO]: successful cache refresh from cn.listFormats() [org.dataone.client.v2.formats.ObjectFormatCache]
20151115-05:09:47: [INFO]: creating a test object.  pid = testUpdateSystemMetadata_RightsHolder_201531821946999 on https://mn-dev-ucsb-2.test.dataone.org/metacat/d1/mn/v2 [org.dataone.integration.ContextAwareTestCaseDataone]
20151115-05:09:47: [INFO]: SystemMetadata for pid: testUpdateSystemMetadata_RightsHolder_201531821946999
<?xml version="1.0" encoding="UTF-8"?><d1_v2.0:systemMetadata xmlns:d1_v2.0="http://ns.dataone.org/service/types/v2.0" xmlns:d1="http://ns.dataone.org/service/types/v1"><serialVersion>1</serialVersion><identifier>testUpdateSystemMetadata_RightsHolder_201531821946999</identifier><formatId>eml://ecoinformatics.org/eml-2.0.1</formatId><size>17181</size><checksum algorithm="MD5">03ce09c6b4c3efc1681f3023402998a2</checksum><submitter>CN=urn:node:cnDevUNM2,DC=dataone,DC=org</submitter><rightsHolder>CN=testRightsHolder,DC=dataone,DC=org</rightsHolder><accessPolicy><allow><subject>CN=testRightsHolder,DC=dataone,DC=org</subject><permission>changePermission</permission></allow></accessPolicy><dateUploaded>2015-11-15T05:09:47.384+00:00</dateUploaded><dateSysMetadataModified>2015-11-15T05:09:47.384+00:00</dateSysMetadataModified><originMemberNode>urn:node:mnDevUCSB2</originMemberNode><authoritativeMemberNode>urn:node:mnDevUCSB2</authoritativeMemberNode></d1_v2.0:systemMetadata> [org.dataone.integration.ContextAwareTestCaseDataone]
20151115-05:09:48: [INFO]: rest call info: POST https://mn-dev-ucsb-2.test.dataone.org/metacat/d1/mn/v2/object; MMP message has: ParamPart:pid = testUpdateSystemMetadata_RightsHolder_201531821946999; FilePart:object = /tmp/mmp.output.8738582840620273753.tmp (17181 bytes); FilePart:sysmeta = /tmp/mmp.output.270586301814578500.tmp (979 bytes);  [org.dataone.client.rest.RestClient]
20151115-05:09:48: [INFO]: object created.  pid = testUpdateSystemMetadata_RightsHolder_201531821946999 [org.dataone.integration.ContextAwareTestCaseDataone]
20151115-05:09:49: [INFO]: rest call info: GET https://mn-dev-ucsb-2.test.dataone.org/metacat/d1/mn/v2/meta/testUpdateSystemMetadata_RightsHolder_201531821946999 [org.dataone.client.rest.RestClient]
20151115-05:09:55: [INFO]: rest call info: PUT https://mn-dev-ucsb-2.test.dataone.org/metacat/d1/mn/v2/meta; MMP message has: ParamPart:pid = testUpdateSystemMetadata_RightsHolder_201531821946999; FilePart:sysmeta = /tmp/mmp.output.7177924423173780257.tmp (1003 bytes);  [org.dataone.client.rest.RestClient]
20151115-05:10:05: [INFO]: rest call info: GET https://mn-dev-ucsb-2.test.dataone.org/metacat/d1/mn/v2/meta/testUpdateSystemMetadata_RightsHolder_201531821946999 [org.dataone.client.rest.RestClient]
20151115-05:10:05: [INFO]: 
***************** running test for testUpdateSystemMetadata_RightsHolder(...) vs. node: https://mn-dev-unm-2.test.dataone.org/metacat/d1/mn ***************** [org.dataone.integration.ContextAwareTestCaseDataone]
20151115-05:10:05: [INFO]: certificate directory: /etc/dataone/client/testClientCerts/ [org.dataone.integration.ContextAwareTestCaseDataone]
20151115-05:10:05: [INFO]: certificate filename: cnDevUNM2 [org.dataone.integration.ContextAwareTestCaseDataone]
20151115-05:10:05: [INFO]: client setup as Subject: CN=urn:node:cnDevUNM2,DC=dataone,DC=org [org.dataone.integration.ContextAwareTestCaseDataone]
20151115-05:10:05: [INFO]: creating a test object.  pid = testUpdateSystemMetadata_RightsHolder_201531821105774 on https://mn-dev-unm-2.test.dataone.org/metacat/d1/mn/v2 [org.dataone.integration.ContextAwareTestCaseDataone]
20151115-05:10:05: [INFO]: SystemMetadata for pid: testUpdateSystemMetadata_RightsHolder_201531821105774
<?xml version="1.0" encoding="UTF-8"?><d1_v2.0:systemMetadata xmlns:d1_v2.0="http://ns.dataone.org/service/types/v2.0" xmlns:d1="http://ns.dataone.org/service/types/v1"><serialVersion>1</serialVersion><identifier>testUpdateSystemMetadata_RightsHolder_201531821105774</identifier><formatId>eml://ecoinformatics.org/eml-2.0.1</formatId><size>17181</size><checksum algorithm="MD5">03ce09c6b4c3efc1681f3023402998a2</checksum><submitter>CN=urn:node:cnDevUNM2,DC=dataone,DC=org</submitter><rightsHolder>CN=testRightsHolder,DC=dataone,DC=org</rightsHolder><accessPolicy><allow><subject>CN=testRightsHolder,DC=dataone,DC=org</subject><permission>changePermission</permission></allow></accessPolicy><dateUploaded>2015-11-15T05:10:05.795+00:00</dateUploaded><dateSysMetadataModified>2015-11-15T05:10:05.795+00:00</dateSysMetadataModified><originMemberNode>urn:node:mnDevUNM2</originMemberNode><authoritativeMemberNode>urn:node:mnDevUNM2</authoritativeMemberNode></d1_v2.0:systemMetadata> [org.dataone.integration.ContextAwareTestCaseDataone]
20151115-05:10:06: [INFO]: rest call info: POST https://mn-dev-unm-2.test.dataone.org/metacat/d1/mn/v2/object; MMP message has: ParamPart:pid = testUpdateSystemMetadata_RightsHolder_201531821105774; FilePart:object = /tmp/mmp.output.5721881927655191054.tmp (17181 bytes); FilePart:sysmeta = /tmp/mmp.output.4354171984159368561.tmp (977 bytes);  [org.dataone.client.rest.RestClient]
20151115-05:10:06: [INFO]: object created.  pid = testUpdateSystemMetadata_RightsHolder_201531821105774 [org.dataone.integration.ContextAwareTestCaseDataone]
20151115-05:10:07: [INFO]: rest call info: GET https://mn-dev-unm-2.test.dataone.org/metacat/d1/mn/v2/meta/testUpdateSystemMetadata_RightsHolder_201531821105774 [org.dataone.client.rest.RestClient]
20151115-05:10:12: [INFO]: rest call info: PUT https://mn-dev-unm-2.test.dataone.org/metacat/d1/mn/v2/meta; MMP message has: ParamPart:pid = testUpdateSystemMetadata_RightsHolder_201531821105774; FilePart:sysmeta = /tmp/mmp.output.2936788510175803097.tmp (1001 bytes);  [org.dataone.client.rest.RestClient]
20151115-05:10:22: [INFO]: rest call info: GET https://mn-dev-unm-2.test.dataone.org/metacat/d1/mn/v2/meta/testUpdateSystemMetadata_RightsHolder_201531821105774 [org.dataone.client.rest.RestClient]
20151115-05:10:22: [INFO]: **************************************************** [org.dataone.integration.ContextAwareTestCaseDataone]
20151115-05:10:22: [INFO]: ***  context label:   DEV2 [org.dataone.integration.ContextAwareTestCaseDataone]
20151115-05:10:22: [INFO]: **************************************************** [org.dataone.integration.ContextAwareTestCaseDataone]
20151115-05:10:22: [INFO]: **************************************************** [org.dataone.integration.ContextAwareTestCaseDataone]
20151115-05:10:23: [INFO]: rest call info: GET https://mn-dev-ucsb-1.test.dataone.org/metacat/d1/mn/v2/monitor/ping [org.dataone.client.rest.RestClient]
20151115-05:10:23: [INFO]: MN excluded from test: https://mn-dev-ucsb-1.test.dataone.org/metacat/d1/mn [org.dataone.integration.ContextAwareTestCaseDataone]
20151115-05:10:23: [INFO]: rest call info: GET https://mn-dev-ucsb-2.test.dataone.org/metacat/d1/mn/v2/monitor/ping [org.dataone.client.rest.RestClient]
20151115-05:10:23: [INFO]: MN included in test: https://mn-dev-ucsb-2.test.dataone.org/metacat/d1/mn [org.dataone.integration.ContextAwareTestCaseDataone]
20151115-05:10:23: [INFO]: rest call info: GET https://mn-dev-unm-1.test.dataone.org/metacat/d1/mn/v2/monitor/ping [org.dataone.client.rest.RestClient]
20151115-05:10:23: [INFO]: MN excluded from test: https://mn-dev-unm-1.test.dataone.org/metacat/d1/mn [org.dataone.integration.ContextAwareTestCaseDataone]
20151115-05:10:23: [INFO]: rest call info: GET https://mn-dev-unm-2.test.dataone.org/metacat/d1/mn/v2/monitor/ping [org.dataone.client.rest.RestClient]
20151115-05:10:23: [INFO]: MN included in test: https://mn-dev-unm-2.test.dataone.org/metacat/d1/mn [org.dataone.integration.ContextAwareTestCaseDataone]
20151115-05:10:23: [INFO]: 
***************** running test for testUpdateSystemMetadata_MutableRightsHolder(...) vs. node: https://mn-dev-ucsb-2.test.dataone.org/metacat/d1/mn ***************** [org.dataone.integration.ContextAwareTestCaseDataone]
20151115-05:10:23: [INFO]: certificate directory: /etc/dataone/client/testClientCerts/ [org.dataone.integration.ContextAwareTestCaseDataone]
20151115-05:10:23: [INFO]: certificate filename: cnDevUNM2 [org.dataone.integration.ContextAwareTestCaseDataone]
20151115-05:10:23: [INFO]: client setup as Subject: CN=urn:node:cnDevUNM2,DC=dataone,DC=org [org.dataone.integration.ContextAwareTestCaseDataone]
20151115-05:10:23: [INFO]: creating a test object.  pid = testUpdateSystemMetadata_MutableRightsHolder_2015318211023783 on https://mn-dev-ucsb-2.test.dataone.org/metacat/d1/mn/v2 [org.dataone.integration.ContextAwareTestCaseDataone]
20151115-05:10:23: [INFO]: SystemMetadata for pid: testUpdateSystemMetadata_MutableRightsHolder_2015318211023783
<?xml version="1.0" encoding="UTF-8"?><d1_v2.0:systemMetadata xmlns:d1_v2.0="http://ns.dataone.org/service/types/v2.0" xmlns:d1="http://ns.dataone.org/service/types/v1"><serialVersion>1</serialVersion><identifier>testUpdateSystemMetadata_MutableRightsHolder_2015318211023783</identifier><formatId>eml://ecoinformatics.org/eml-2.0.1</formatId><size>17181</size><checksum algorithm="MD5">03ce09c6b4c3efc1681f3023402998a2</checksum><submitter>CN=urn:node:cnDevUNM2,DC=dataone,DC=org</submitter><rightsHolder>CN=testRightsHolder,DC=dataone,DC=org</rightsHolder><accessPolicy><allow><subject>CN=testRightsHolder,DC=dataone,DC=org</subject><permission>changePermission</permission></allow></accessPolicy><dateUploaded>2015-11-15T05:10:23.802+00:00</dateUploaded><dateSysMetadataModified>2015-11-15T05:10:23.802+00:00</dateSysMetadataModified><originMemberNode>urn:node:mnDevUCSB2</originMemberNode><authoritativeMemberNode>urn:node:mnDevUCSB2</authoritativeMemberNode></d1_v2.0:systemMetadata> [org.dataone.integration.ContextAwareTestCaseDataone]
20151115-05:10:25: [INFO]: rest call info: POST https://mn-dev-ucsb-2.test.dataone.org/metacat/d1/mn/v2/object; MMP message has: ParamPart:pid = testUpdateSystemMetadata_MutableRightsHolder_2015318211023783; FilePart:object = /tmp/mmp.output.475341783259469219.tmp (17181 bytes); FilePart:sysmeta = /tmp/mmp.output.3095575759765525354.tmp (987 bytes);  [org.dataone.client.rest.RestClient]
20151115-05:10:25: [INFO]: object created.  pid = testUpdateSystemMetadata_MutableRightsHolder_2015318211023783 [org.dataone.integration.ContextAwareTestCaseDataone]
20151115-05:10:25: [INFO]: rest call info: GET https://mn-dev-ucsb-2.test.dataone.org/metacat/d1/mn/v2/meta/testUpdateSystemMetadata_MutableRightsHolder_2015318211023783 [org.dataone.client.rest.RestClient]
20151115-05:10:25: [INFO]: certificate directory: /etc/dataone/client/testClientCerts/ [org.dataone.integration.ContextAwareTestCaseDataone]
20151115-05:10:25: [INFO]: certificate filename: testPerson [org.dataone.integration.ContextAwareTestCaseDataone]
20151115-05:10:25: [INFO]: client setup as Subject: CN=testPerson,DC=dataone,DC=org [org.dataone.integration.ContextAwareTestCaseDataone]
20151115-05:10:31: [INFO]: rest call info: PUT https://mn-dev-ucsb-2.test.dataone.org/metacat/d1/mn/v2/meta; MMP message has: ParamPart:pid = testUpdateSystemMetadata_MutableRightsHolder_2015318211023783; FilePart:sysmeta = /tmp/mmp.output.5109731858541988962.tmp (1005 bytes);  [org.dataone.client.rest.RestClient]
20151115-05:10:42: [INFO]: rest call info: GET https://mn-dev-ucsb-2.test.dataone.org/metacat/d1/mn/v2/meta/testUpdateSystemMetadata_MutableRightsHolder_2015318211023783 [org.dataone.client.rest.RestClient]
20151115-05:10:42: [INFO]: 
***************** running test for testUpdateSystemMetadata_MutableRightsHolder(...) vs. node: https://mn-dev-unm-2.test.dataone.org/metacat/d1/mn ***************** [org.dataone.integration.ContextAwareTestCaseDataone]
20151115-05:10:42: [INFO]: certificate directory: /etc/dataone/client/testClientCerts/ [org.dataone.integration.ContextAwareTestCaseDataone]
20151115-05:10:42: [INFO]: certificate filename: cnDevUNM2 [org.dataone.integration.ContextAwareTestCaseDataone]
20151115-05:10:42: [INFO]: client setup as Subject: CN=urn:node:cnDevUNM2,DC=dataone,DC=org [org.dataone.integration.ContextAwareTestCaseDataone]
20151115-05:10:42: [INFO]: creating a test object.  pid = testUpdateSystemMetadata_MutableRightsHolder_2015318211042156 on https://mn-dev-unm-2.test.dataone.org/metacat/d1/mn/v2 [org.dataone.integration.ContextAwareTestCaseDataone]
20151115-05:10:42: [INFO]: SystemMetadata for pid: testUpdateSystemMetadata_MutableRightsHolder_2015318211042156
<?xml version="1.0" encoding="UTF-8"?><d1_v2.0:systemMetadata xmlns:d1_v2.0="http://ns.dataone.org/service/types/v2.0" xmlns:d1="http://ns.dataone.org/service/types/v1"><serialVersion>1</serialVersion><identifier>testUpdateSystemMetadata_MutableRightsHolder_2015318211042156</identifier><formatId>eml://ecoinformatics.org/eml-2.0.1</formatId><size>17181</size><checksum algorithm="MD5">03ce09c6b4c3efc1681f3023402998a2</checksum><submitter>CN=urn:node:cnDevUNM2,DC=dataone,DC=org</submitter><rightsHolder>CN=testRightsHolder,DC=dataone,DC=org</rightsHolder><accessPolicy><allow><subject>CN=testRightsHolder,DC=dataone,DC=org</subject><permission>changePermission</permission></allow></accessPolicy><dateUploaded>2015-11-15T05:10:42.176+00:00</dateUploaded><dateSysMetadataModified>2015-11-15T05:10:42.176+00:00</dateSysMetadataModified><originMemberNode>urn:node:mnDevUNM2</originMemberNode><authoritativeMemberNode>urn:node:mnDevUNM2</authoritativeMemberNode></d1_v2.0:systemMetadata> [org.dataone.integration.ContextAwareTestCaseDataone]
20151115-05:10:43: [INFO]: rest call info: POST https://mn-dev-unm-2.test.dataone.org/metacat/d1/mn/v2/object; MMP message has: ParamPart:pid = testUpdateSystemMetadata_MutableRightsHolder_2015318211042156; FilePart:object = /tmp/mmp.output.8337963250790123203.tmp (17181 bytes); FilePart:sysmeta = /tmp/mmp.output.4271943298757030601.tmp (985 bytes);  [org.dataone.client.rest.RestClient]
20151115-05:10:43: [INFO]: object created.  pid = testUpdateSystemMetadata_MutableRightsHolder_2015318211042156 [org.dataone.integration.ContextAwareTestCaseDataone]
20151115-05:10:43: [INFO]: rest call info: GET https://mn-dev-unm-2.test.dataone.org/metacat/d1/mn/v2/meta/testUpdateSystemMetadata_MutableRightsHolder_2015318211042156 [org.dataone.client.rest.RestClient]
20151115-05:10:48: [INFO]: rest call info: PUT https://mn-dev-unm-2.test.dataone.org/metacat/d1/mn/v2/meta; MMP message has: ParamPart:pid = testUpdateSystemMetadata_MutableRightsHolder_2015318211042156; FilePart:sysmeta = /tmp/mmp.output.8424235878997155065.tmp (1003 bytes);  [org.dataone.client.rest.RestClient]
20151115-05:10:58: [INFO]: rest call info: GET https://mn-dev-unm-2.test.dataone.org/metacat/d1/mn/v2/meta/testUpdateSystemMetadata_MutableRightsHolder_2015318211042156 [org.dataone.client.rest.RestClient]
20151115-05:10:58: [INFO]: **************************************************** [org.dataone.integration.ContextAwareTestCaseDataone]
20151115-05:10:58: [INFO]: ***  context label:   DEV2 [org.dataone.integration.ContextAwareTestCaseDataone]
20151115-05:10:58: [INFO]: **************************************************** [org.dataone.integration.ContextAwareTestCaseDataone]
20151115-05:10:58: [INFO]: **************************************************** [org.dataone.integration.ContextAwareTestCaseDataone]
20151115-05:10:59: [INFO]: rest call info: GET https://mn-dev-ucsb-1.test.dataone.org/metacat/d1/mn/v2/monitor/ping [org.dataone.client.rest.RestClient]
20151115-05:10:59: [INFO]: MN excluded from test: https://mn-dev-ucsb-1.test.dataone.org/metacat/d1/mn [org.dataone.integration.ContextAwareTestCaseDataone]
20151115-05:10:59: [INFO]: rest call info: GET https://mn-dev-ucsb-2.test.dataone.org/metacat/d1/mn/v2/monitor/ping [org.dataone.client.rest.RestClient]
20151115-05:10:59: [INFO]: MN included in test: https://mn-dev-ucsb-2.test.dataone.org/metacat/d1/mn [org.dataone.integration.ContextAwareTestCaseDataone]
20151115-05:10:59: [INFO]: rest call info: GET https://mn-dev-unm-1.test.dataone.org/metacat/d1/mn/v2/monitor/ping [org.dataone.client.rest.RestClient]
20151115-05:10:59: [INFO]: MN excluded from test: https://mn-dev-unm-1.test.dataone.org/metacat/d1/mn [org.dataone.integration.ContextAwareTestCaseDataone]
20151115-05:10:59: [INFO]: rest call info: GET https://mn-dev-unm-2.test.dataone.org/metacat/d1/mn/v2/monitor/ping [org.dataone.client.rest.RestClient]
20151115-05:10:59: [INFO]: MN included in test: https://mn-dev-unm-2.test.dataone.org/metacat/d1/mn [org.dataone.integration.ContextAwareTestCaseDataone]
20151115-05:10:59: [INFO]: 
***************** running test for testUpdateSystemMetadata_MutableFormat(...) vs. node: https://mn-dev-ucsb-2.test.dataone.org/metacat/d1/mn ***************** [org.dataone.integration.ContextAwareTestCaseDataone]
20151115-05:10:59: [INFO]: certificate directory: /etc/dataone/client/testClientCerts/ [org.dataone.integration.ContextAwareTestCaseDataone]
20151115-05:10:59: [INFO]: certificate filename: cnDevUNM2 [org.dataone.integration.ContextAwareTestCaseDataone]
20151115-05:10:59: [INFO]: client setup as Subject: CN=urn:node:cnDevUNM2,DC=dataone,DC=org [org.dataone.integration.ContextAwareTestCaseDataone]
20151115-05:10:59: [INFO]: creating a test object.  pid = testUpdateSystemMetadata_MutableFormat_2015318211059878 on https://mn-dev-ucsb-2.test.dataone.org/metacat/d1/mn/v2 [org.dataone.integration.ContextAwareTestCaseDataone]
20151115-05:10:59: [INFO]: SystemMetadata for pid: testUpdateSystemMetadata_MutableFormat_2015318211059878
<?xml version="1.0" encoding="UTF-8"?><d1_v2.0:systemMetadata xmlns:d1_v2.0="http://ns.dataone.org/service/types/v2.0" xmlns:d1="http://ns.dataone.org/service/types/v1"><serialVersion>1</serialVersion><identifier>testUpdateSystemMetadata_MutableFormat_2015318211059878</identifier><formatId>eml://ecoinformatics.org/eml-2.0.1</formatId><size>17181</size><checksum algorithm="MD5">03ce09c6b4c3efc1681f3023402998a2</checksum><submitter>CN=urn:node:cnDevUNM2,DC=dataone,DC=org</submitter><rightsHolder>CN=testRightsHolder,DC=dataone,DC=org</rightsHolder><accessPolicy><allow><subject>CN=testRightsHolder,DC=dataone,DC=org</subject><permission>changePermission</permission></allow></accessPolicy><dateUploaded>2015-11-15T05:10:59.897+00:00</dateUploaded><dateSysMetadataModified>2015-11-15T05:10:59.897+00:00</dateSysMetadataModified><originMemberNode>urn:node:mnDevUCSB2</originMemberNode><authoritativeMemberNode>urn:node:mnDevUCSB2</authoritativeMemberNode></d1_v2.0:systemMetadata> [org.dataone.integration.ContextAwareTestCaseDataone]
20151115-05:11:01: [INFO]: rest call info: POST https://mn-dev-ucsb-2.test.dataone.org/metacat/d1/mn/v2/object; MMP message has: ParamPart:pid = testUpdateSystemMetadata_MutableFormat_2015318211059878; FilePart:object = /tmp/mmp.output.2648207540432317845.tmp (17181 bytes); FilePart:sysmeta = /tmp/mmp.output.3610167412814259044.tmp (981 bytes);  [org.dataone.client.rest.RestClient]
20151115-05:11:01: [INFO]: object created.  pid = testUpdateSystemMetadata_MutableFormat_2015318211059878 [org.dataone.integration.ContextAwareTestCaseDataone]
20151115-05:11:01: [INFO]: rest call info: GET https://mn-dev-ucsb-2.test.dataone.org/metacat/d1/mn/v2/meta/testUpdateSystemMetadata_MutableFormat_2015318211059878 [org.dataone.client.rest.RestClient]
20151115-05:11:07: [INFO]: rest call info: PUT https://mn-dev-ucsb-2.test.dataone.org/metacat/d1/mn/v2/meta; MMP message has: ParamPart:pid = testUpdateSystemMetadata_MutableFormat_2015318211059878; FilePart:sysmeta = /tmp/mmp.output.7867161444999884305.tmp (980 bytes);  [org.dataone.client.rest.RestClient]
20151115-05:11:18: [INFO]: rest call info: GET https://mn-dev-ucsb-2.test.dataone.org/metacat/d1/mn/v2/meta/testUpdateSystemMetadata_MutableFormat_2015318211059878 [org.dataone.client.rest.RestClient]
20151115-05:11:18: [INFO]: 
***************** running test for testUpdateSystemMetadata_MutableFormat(...) vs. node: https://mn-dev-unm-2.test.dataone.org/metacat/d1/mn ***************** [org.dataone.integration.ContextAwareTestCaseDataone]
20151115-05:11:18: [INFO]: certificate directory: /etc/dataone/client/testClientCerts/ [org.dataone.integration.ContextAwareTestCaseDataone]
20151115-05:11:18: [INFO]: certificate filename: cnDevUNM2 [org.dataone.integration.ContextAwareTestCaseDataone]
20151115-05:11:18: [INFO]: client setup as Subject: CN=urn:node:cnDevUNM2,DC=dataone,DC=org [org.dataone.integration.ContextAwareTestCaseDataone]
20151115-05:11:18: [INFO]: creating a test object.  pid = testUpdateSystemMetadata_MutableFormat_2015318211118288 on https://mn-dev-unm-2.test.dataone.org/metacat/d1/mn/v2 [org.dataone.integration.ContextAwareTestCaseDataone]
20151115-05:11:18: [INFO]: SystemMetadata for pid: testUpdateSystemMetadata_MutableFormat_2015318211118288
<?xml version="1.0" encoding="UTF-8"?><d1_v2.0:systemMetadata xmlns:d1_v2.0="http://ns.dataone.org/service/types/v2.0" xmlns:d1="http://ns.dataone.org/service/types/v1"><serialVersion>1</serialVersion><identifier>testUpdateSystemMetadata_MutableFormat_2015318211118288</identifier><formatId>eml://ecoinformatics.org/eml-2.0.1</formatId><size>17181</size><checksum algorithm="MD5">03ce09c6b4c3efc1681f3023402998a2</checksum><submitter>CN=urn:node:cnDevUNM2,DC=dataone,DC=org</submitter><rightsHolder>CN=testRightsHolder,DC=dataone,DC=org</rightsHolder><accessPolicy><allow><subject>CN=testRightsHolder,DC=dataone,DC=org</subject><permission>changePermission</permission></allow></accessPolicy><dateUploaded>2015-11-15T05:11:18.305+00:00</dateUploaded><dateSysMetadataModified>2015-11-15T05:11:18.305+00:00</dateSysMetadataModified><originMemberNode>urn:node:mnDevUNM2</originMemberNode><authoritativeMemberNode>urn:node:mnDevUNM2</authoritativeMemberNode></d1_v2.0:systemMetadata> [org.dataone.integration.ContextAwareTestCaseDataone]
20151115-05:11:19: [INFO]: rest call info: POST https://mn-dev-unm-2.test.dataone.org/metacat/d1/mn/v2/object; MMP message has: ParamPart:pid = testUpdateSystemMetadata_MutableFormat_2015318211118288; FilePart:object = /tmp/mmp.output.6520470804878108154.tmp (17181 bytes); FilePart:sysmeta = /tmp/mmp.output.3331986883869860658.tmp (979 bytes);  [org.dataone.client.rest.RestClient]
20151115-05:11:19: [INFO]: object created.  pid = testUpdateSystemMetadata_MutableFormat_2015318211118288 [org.dataone.integration.ContextAwareTestCaseDataone]
20151115-05:11:19: [INFO]: rest call info: GET https://mn-dev-unm-2.test.dataone.org/metacat/d1/mn/v2/meta/testUpdateSystemMetadata_MutableFormat_2015318211118288 [org.dataone.client.rest.RestClient]
20151115-05:11:24: [INFO]: rest call info: PUT https://mn-dev-unm-2.test.dataone.org/metacat/d1/mn/v2/meta; MMP message has: ParamPart:pid = testUpdateSystemMetadata_MutableFormat_2015318211118288; FilePart:sysmeta = /tmp/mmp.output.7563362757959660872.tmp (978 bytes);  [org.dataone.client.rest.RestClient]
20151115-05:11:34: [INFO]: rest call info: GET https://mn-dev-unm-2.test.dataone.org/metacat/d1/mn/v2/meta/testUpdateSystemMetadata_MutableFormat_2015318211118288 [org.dataone.client.rest.RestClient]
20151115-05:11:35: [INFO]: **************************************************** [org.dataone.integration.ContextAwareTestCaseDataone]
20151115-05:11:35: [INFO]: ***  context label:   DEV2 [org.dataone.integration.ContextAwareTestCaseDataone]
20151115-05:11:35: [INFO]: **************************************************** [org.dataone.integration.ContextAwareTestCaseDataone]
20151115-05:11:35: [INFO]: **************************************************** [org.dataone.integration.ContextAwareTestCaseDataone]
20151115-05:11:35: [INFO]: rest call info: GET https://mn-dev-ucsb-1.test.dataone.org/metacat/d1/mn/v2/monitor/ping [org.dataone.client.rest.RestClient]
20151115-05:11:35: [INFO]: MN excluded from test: https://mn-dev-ucsb-1.test.dataone.org/metacat/d1/mn [org.dataone.integration.ContextAwareTestCaseDataone]
20151115-05:11:35: [INFO]: rest call info: GET https://mn-dev-ucsb-2.test.dataone.org/metacat/d1/mn/v2/monitor/ping [org.dataone.client.rest.RestClient]
20151115-05:11:35: [INFO]: MN included in test: https://mn-dev-ucsb-2.test.dataone.org/metacat/d1/mn [org.dataone.integration.ContextAwareTestCaseDataone]
20151115-05:11:35: [INFO]: rest call info: GET https://mn-dev-unm-1.test.dataone.org/metacat/d1/mn/v2/monitor/ping [org.dataone.client.rest.RestClient]
20151115-05:11:35: [INFO]: MN excluded from test: https://mn-dev-unm-1.test.dataone.org/metacat/d1/mn [org.dataone.integration.ContextAwareTestCaseDataone]
20151115-05:11:35: [INFO]: rest call info: GET https://mn-dev-unm-2.test.dataone.org/metacat/d1/mn/v2/monitor/ping [org.dataone.client.rest.RestClient]
20151115-05:11:35: [INFO]: MN included in test: https://mn-dev-unm-2.test.dataone.org/metacat/d1/mn [org.dataone.integration.ContextAwareTestCaseDataone]
20151115-05:11:35: [INFO]: 
***************** running test for testUpdateSystemMetadata_MutableAccessPolicy(...) vs. node: https://mn-dev-ucsb-2.test.dataone.org/metacat/d1/mn ***************** [org.dataone.integration.ContextAwareTestCaseDataone]
20151115-05:11:35: [INFO]: certificate directory: /etc/dataone/client/testClientCerts/ [org.dataone.integration.ContextAwareTestCaseDataone]
20151115-05:11:35: [INFO]: certificate filename: cnDevUNM2 [org.dataone.integration.ContextAwareTestCaseDataone]
20151115-05:11:35: [INFO]: client setup as Subject: CN=urn:node:cnDevUNM2,DC=dataone,DC=org [org.dataone.integration.ContextAwareTestCaseDataone]
20151115-05:11:35: [INFO]: creating a test object.  pid = testUpdateSystemMetadata_MutableAccessPolicy_2015318211135958 on https://mn-dev-ucsb-2.test.dataone.org/metacat/d1/mn/v2 [org.dataone.integration.ContextAwareTestCaseDataone]
20151115-05:11:35: [INFO]: SystemMetadata for pid: testUpdateSystemMetadata_MutableAccessPolicy_2015318211135958
<?xml version="1.0" encoding="UTF-8"?><d1_v2.0:systemMetadata xmlns:d1_v2.0="http://ns.dataone.org/service/types/v2.0" xmlns:d1="http://ns.dataone.org/service/types/v1"><serialVersion>1</serialVersion><identifier>testUpdateSystemMetadata_MutableAccessPolicy_2015318211135958</identifier><formatId>eml://ecoinformatics.org/eml-2.0.1</formatId><size>17181</size><checksum algorithm="MD5">03ce09c6b4c3efc1681f3023402998a2</checksum><submitter>CN=urn:node:cnDevUNM2,DC=dataone,DC=org</submitter><rightsHolder>CN=testRightsHolder,DC=dataone,DC=org</rightsHolder><accessPolicy><allow><subject>CN=testRightsHolder,DC=dataone,DC=org</subject><permission>changePermission</permission></allow></accessPolicy><dateUploaded>2015-11-15T05:11:35.975+00:00</dateUploaded><dateSysMetadataModified>2015-11-15T05:11:35.975+00:00</dateSysMetadataModified><originMemberNode>urn:node:mnDevUCSB2</originMemberNode><authoritativeMemberNode>urn:node:mnDevUCSB2</authoritativeMemberNode></d1_v2.0:systemMetadata> [org.dataone.integration.ContextAwareTestCaseDataone]
20151115-05:11:37: [INFO]: rest call info: POST https://mn-dev-ucsb-2.test.dataone.org/metacat/d1/mn/v2/object; MMP message has: ParamPart:pid = testUpdateSystemMetadata_MutableAccessPolicy_2015318211135958; FilePart:object = /tmp/mmp.output.9055416084288633315.tmp (17181 bytes); FilePart:sysmeta = /tmp/mmp.output.9185737263586732897.tmp (987 bytes);  [org.dataone.client.rest.RestClient]
20151115-05:11:37: [INFO]: object created.  pid = testUpdateSystemMetadata_MutableAccessPolicy_2015318211135958 [org.dataone.integration.ContextAwareTestCaseDataone]
20151115-05:11:38: [INFO]: rest call info: GET https://mn-dev-ucsb-2.test.dataone.org/metacat/d1/mn/v2/meta/testUpdateSystemMetadata_MutableAccessPolicy_2015318211135958 [org.dataone.client.rest.RestClient]
20151115-05:11:38: [INFO]: certificate directory: /etc/dataone/client/testClientCerts/ [org.dataone.integration.ContextAwareTestCaseDataone]
20151115-05:11:38: [INFO]: certificate filename: testGroup [org.dataone.integration.ContextAwareTestCaseDataone]
20151115-05:11:38: [INFO]: client setup as Subject: public [org.dataone.integration.ContextAwareTestCaseDataone]
20151115-05:11:44: [INFO]: rest call info: PUT https://mn-dev-ucsb-2.test.dataone.org/metacat/d1/mn/v2/meta; MMP message has: ParamPart:pid = testUpdateSystemMetadata_MutableAccessPolicy_2015318211135958; FilePart:sysmeta = /tmp/mmp.output.2111364236997240321.tmp (980 bytes);  [org.dataone.client.rest.RestClient]
20151115-05:11:54: [INFO]: rest call info: GET https://mn-dev-ucsb-2.test.dataone.org/metacat/d1/mn/v2/meta/testUpdateSystemMetadata_MutableAccessPolicy_2015318211135958 [org.dataone.client.rest.RestClient]
20151115-05:11:54: [INFO]: 
***************** running test for testUpdateSystemMetadata_MutableAccessPolicy(...) vs. node: https://mn-dev-unm-2.test.dataone.org/metacat/d1/mn ***************** [org.dataone.integration.ContextAwareTestCaseDataone]
20151115-05:11:54: [INFO]: certificate directory: /etc/dataone/client/testClientCerts/ [org.dataone.integration.ContextAwareTestCaseDataone]
20151115-05:11:54: [INFO]: certificate filename: cnDevUNM2 [org.dataone.integration.ContextAwareTestCaseDataone]
20151115-05:11:54: [INFO]: client setup as Subject: CN=urn:node:cnDevUNM2,DC=dataone,DC=org [org.dataone.integration.ContextAwareTestCaseDataone]
20151115-05:11:55: [INFO]: creating a test object.  pid = testUpdateSystemMetadata_MutableAccessPolicy_2015318211154980 on https://mn-dev-unm-2.test.dataone.org/metacat/d1/mn/v2 [org.dataone.integration.ContextAwareTestCaseDataone]
20151115-05:11:55: [INFO]: SystemMetadata for pid: testUpdateSystemMetadata_MutableAccessPolicy_2015318211154980
<?xml version="1.0" encoding="UTF-8"?><d1_v2.0:systemMetadata xmlns:d1_v2.0="http://ns.dataone.org/service/types/v2.0" xmlns:d1="http://ns.dataone.org/service/types/v1"><serialVersion>1</serialVersion><identifier>testUpdateSystemMetadata_MutableAccessPolicy_2015318211154980</identifier><formatId>eml://ecoinformatics.org/eml-2.0.1</formatId><size>17181</size><checksum algorithm="MD5">03ce09c6b4c3efc1681f3023402998a2</checksum><submitter>CN=urn:node:cnDevUNM2,DC=dataone,DC=org</submitter><rightsHolder>CN=testRightsHolder,DC=dataone,DC=org</rightsHolder><accessPolicy><allow><subject>CN=testRightsHolder,DC=dataone,DC=org</subject><permission>changePermission</permission></allow></accessPolicy><dateUploaded>2015-11-15T05:11:54.996+00:00</dateUploaded><dateSysMetadataModified>2015-11-15T05:11:54.996+00:00</dateSysMetadataModified><originMemberNode>urn:node:mnDevUNM2</originMemberNode><authoritativeMemberNode>urn:node:mnDevUNM2</authoritativeMemberNode></d1_v2.0:systemMetadata> [org.dataone.integration.ContextAwareTestCaseDataone]
20151115-05:11:55: [INFO]: rest call info: POST https://mn-dev-unm-2.test.dataone.org/metacat/d1/mn/v2/object; MMP message has: ParamPart:pid = testUpdateSystemMetadata_MutableAccessPolicy_2015318211154980; FilePart:object = /tmp/mmp.output.6715944279683461684.tmp (17181 bytes); FilePart:sysmeta = /tmp/mmp.output.3879976651718817799.tmp (985 bytes);  [org.dataone.client.rest.RestClient]
20151115-05:11:55: [INFO]: object created.  pid = testUpdateSystemMetadata_MutableAccessPolicy_2015318211154980 [org.dataone.integration.ContextAwareTestCaseDataone]
20151115-05:11:56: [INFO]: rest call info: GET https://mn-dev-unm-2.test.dataone.org/metacat/d1/mn/v2/meta/testUpdateSystemMetadata_MutableAccessPolicy_2015318211154980 [org.dataone.client.rest.RestClient]
20151115-05:12:01: [INFO]: rest call info: PUT https://mn-dev-unm-2.test.dataone.org/metacat/d1/mn/v2/meta; MMP message has: ParamPart:pid = testUpdateSystemMetadata_MutableAccessPolicy_2015318211154980; FilePart:sysmeta = /tmp/mmp.output.8776295516375528858.tmp (978 bytes);  [org.dataone.client.rest.RestClient]
20151115-05:12:11: [INFO]: rest call info: GET https://mn-dev-unm-2.test.dataone.org/metacat/d1/mn/v2/meta/testUpdateSystemMetadata_MutableAccessPolicy_2015318211154980 [org.dataone.client.rest.RestClient]
20151115-05:12:11: [INFO]: **************************************************** [org.dataone.integration.ContextAwareTestCaseDataone]
20151115-05:12:11: [INFO]: ***  context label:   DEV2 [org.dataone.integration.ContextAwareTestCaseDataone]
20151115-05:12:11: [INFO]: **************************************************** [org.dataone.integration.ContextAwareTestCaseDataone]
20151115-05:12:11: [INFO]: **************************************************** [org.dataone.integration.ContextAwareTestCaseDataone]
20151115-05:12:12: [INFO]: rest call info: GET https://mn-dev-ucsb-1.test.dataone.org/metacat/d1/mn/v2/monitor/ping [org.dataone.client.rest.RestClient]
20151115-05:12:12: [INFO]: MN excluded from test: https://mn-dev-ucsb-1.test.dataone.org/metacat/d1/mn [org.dataone.integration.ContextAwareTestCaseDataone]
20151115-05:12:12: [INFO]: rest call info: GET https://mn-dev-ucsb-2.test.dataone.org/metacat/d1/mn/v2/monitor/ping [org.dataone.client.rest.RestClient]
20151115-05:12:12: [INFO]: MN included in test: https://mn-dev-ucsb-2.test.dataone.org/metacat/d1/mn [org.dataone.integration.ContextAwareTestCaseDataone]
20151115-05:12:12: [INFO]: rest call info: GET https://mn-dev-unm-1.test.dataone.org/metacat/d1/mn/v2/monitor/ping [org.dataone.client.rest.RestClient]
20151115-05:12:12: [INFO]: MN excluded from test: https://mn-dev-unm-1.test.dataone.org/metacat/d1/mn [org.dataone.integration.ContextAwareTestCaseDataone]
20151115-05:12:12: [INFO]: rest call info: GET https://mn-dev-unm-2.test.dataone.org/metacat/d1/mn/v2/monitor/ping [org.dataone.client.rest.RestClient]
20151115-05:12:12: [INFO]: MN included in test: https://mn-dev-unm-2.test.dataone.org/metacat/d1/mn [org.dataone.integration.ContextAwareTestCaseDataone]
20151115-05:12:12: [INFO]: 
***************** running test for testUpdateSystemMetadata_MutableReplPolicy(...) vs. node: https://mn-dev-ucsb-2.test.dataone.org/metacat/d1/mn ***************** [org.dataone.integration.ContextAwareTestCaseDataone]
20151115-05:12:12: [INFO]: certificate directory: /etc/dataone/client/testClientCerts/ [org.dataone.integration.ContextAwareTestCaseDataone]
20151115-05:12:12: [INFO]: certificate filename: cnDevUNM2 [org.dataone.integration.ContextAwareTestCaseDataone]
20151115-05:12:12: [INFO]: client setup as Subject: CN=urn:node:cnDevUNM2,DC=dataone,DC=org [org.dataone.integration.ContextAwareTestCaseDataone]
20151115-05:12:12: [INFO]: creating a test object.  pid = testUpdateSystemMetadata_MutableReplPolicy_2015318211212749 on https://mn-dev-ucsb-2.test.dataone.org/metacat/d1/mn/v2 [org.dataone.integration.ContextAwareTestCaseDataone]
20151115-05:12:12: [INFO]: SystemMetadata for pid: testUpdateSystemMetadata_MutableReplPolicy_2015318211212749
<?xml version="1.0" encoding="UTF-8"?><d1_v2.0:systemMetadata xmlns:d1_v2.0="http://ns.dataone.org/service/types/v2.0" xmlns:d1="http://ns.dataone.org/service/types/v1"><serialVersion>1</serialVersion><identifier>testUpdateSystemMetadata_MutableReplPolicy_2015318211212749</identifier><formatId>eml://ecoinformatics.org/eml-2.0.1</formatId><size>17181</size><checksum algorithm="MD5">03ce09c6b4c3efc1681f3023402998a2</checksum><submitter>CN=urn:node:cnDevUNM2,DC=dataone,DC=org</submitter><rightsHolder>CN=testRightsHolder,DC=dataone,DC=org</rightsHolder><accessPolicy><allow><subject>CN=testRightsHolder,DC=dataone,DC=org</subject><permission>changePermission</permission></allow></accessPolicy><dateUploaded>2015-11-15T05:12:12.764+00:00</dateUploaded><dateSysMetadataModified>2015-11-15T05:12:12.764+00:00</dateSysMetadataModified><originMemberNode>urn:node:mnDevUCSB2</originMemberNode><authoritativeMemberNode>urn:node:mnDevUCSB2</authoritativeMemberNode></d1_v2.0:systemMetadata> [org.dataone.integration.ContextAwareTestCaseDataone]
20151115-05:12:14: [INFO]: rest call info: POST https://mn-dev-ucsb-2.test.dataone.org/metacat/d1/mn/v2/object; MMP message has: ParamPart:pid = testUpdateSystemMetadata_MutableReplPolicy_2015318211212749; FilePart:object = /tmp/mmp.output.3012527748208538428.tmp (17181 bytes); FilePart:sysmeta = /tmp/mmp.output.2661513991821461952.tmp (985 bytes);  [org.dataone.client.rest.RestClient]
20151115-05:12:14: [INFO]: object created.  pid = testUpdateSystemMetadata_MutableReplPolicy_2015318211212749 [org.dataone.integration.ContextAwareTestCaseDataone]
20151115-05:12:14: [INFO]: rest call info: GET https://mn-dev-ucsb-2.test.dataone.org/metacat/d1/mn/v2/meta/testUpdateSystemMetadata_MutableReplPolicy_2015318211212749 [org.dataone.client.rest.RestClient]
20151115-05:12:20: [INFO]: rest call info: PUT https://mn-dev-ucsb-2.test.dataone.org/metacat/d1/mn/v2/meta; MMP message has: ParamPart:pid = testUpdateSystemMetadata_MutableReplPolicy_2015318211212749; FilePart:sysmeta = /tmp/mmp.output.8802845744343457884.tmp (1076 bytes);  [org.dataone.client.rest.RestClient]
20151115-05:12:30: [INFO]: rest call info: GET https://mn-dev-ucsb-2.test.dataone.org/metacat/d1/mn/v2/meta/testUpdateSystemMetadata_MutableReplPolicy_2015318211212749 [org.dataone.client.rest.RestClient]
20151115-05:12:30: [INFO]: 
***************** running test for testUpdateSystemMetadata_MutableReplPolicy(...) vs. node: https://mn-dev-unm-2.test.dataone.org/metacat/d1/mn ***************** [org.dataone.integration.ContextAwareTestCaseDataone]
20151115-05:12:30: [INFO]: certificate directory: /etc/dataone/client/testClientCerts/ [org.dataone.integration.ContextAwareTestCaseDataone]
20151115-05:12:30: [INFO]: certificate filename: cnDevUNM2 [org.dataone.integration.ContextAwareTestCaseDataone]
20151115-05:12:30: [INFO]: client setup as Subject: CN=urn:node:cnDevUNM2,DC=dataone,DC=org [org.dataone.integration.ContextAwareTestCaseDataone]
20151115-05:12:31: [INFO]: creating a test object.  pid = testUpdateSystemMetadata_MutableReplPolicy_2015318211230987 on https://mn-dev-unm-2.test.dataone.org/metacat/d1/mn/v2 [org.dataone.integration.ContextAwareTestCaseDataone]
20151115-05:12:31: [INFO]: SystemMetadata for pid: testUpdateSystemMetadata_MutableReplPolicy_2015318211230987
<?xml version="1.0" encoding="UTF-8"?><d1_v2.0:systemMetadata xmlns:d1_v2.0="http://ns.dataone.org/service/types/v2.0" xmlns:d1="http://ns.dataone.org/service/types/v1"><serialVersion>1</serialVersion><identifier>testUpdateSystemMetadata_MutableReplPolicy_2015318211230987</identifier><formatId>eml://ecoinformatics.org/eml-2.0.1</formatId><size>17181</size><checksum algorithm="MD5">03ce09c6b4c3efc1681f3023402998a2</checksum><submitter>CN=urn:node:cnDevUNM2,DC=dataone,DC=org</submitter><rightsHolder>CN=testRightsHolder,DC=dataone,DC=org</rightsHolder><accessPolicy><allow><subject>CN=testRightsHolder,DC=dataone,DC=org</subject><permission>changePermission</permission></allow></accessPolicy><dateUploaded>2015-11-15T05:12:31.002+00:00</dateUploaded><dateSysMetadataModified>2015-11-15T05:12:31.002+00:00</dateSysMetadataModified><originMemberNode>urn:node:mnDevUNM2</originMemberNode><authoritativeMemberNode>urn:node:mnDevUNM2</authoritativeMemberNode></d1_v2.0:systemMetadata> [org.dataone.integration.ContextAwareTestCaseDataone]
20151115-05:12:31: [INFO]: rest call info: POST https://mn-dev-unm-2.test.dataone.org/metacat/d1/mn/v2/object; MMP message has: ParamPart:pid = testUpdateSystemMetadata_MutableReplPolicy_2015318211230987; FilePart:object = /tmp/mmp.output.4184230582047823300.tmp (17181 bytes); FilePart:sysmeta = /tmp/mmp.output.3509797011993498197.tmp (983 bytes);  [org.dataone.client.rest.RestClient]
20151115-05:12:31: [INFO]: object created.  pid = testUpdateSystemMetadata_MutableReplPolicy_2015318211230987 [org.dataone.integration.ContextAwareTestCaseDataone]
20151115-05:12:32: [INFO]: rest call info: GET https://mn-dev-unm-2.test.dataone.org/metacat/d1/mn/v2/meta/testUpdateSystemMetadata_MutableReplPolicy_2015318211230987 [org.dataone.client.rest.RestClient]
20151115-05:12:37: [INFO]: rest call info: PUT https://mn-dev-unm-2.test.dataone.org/metacat/d1/mn/v2/meta; MMP message has: ParamPart:pid = testUpdateSystemMetadata_MutableReplPolicy_2015318211230987; FilePart:sysmeta = /tmp/mmp.output.4052902959116741925.tmp (1074 bytes);  [org.dataone.client.rest.RestClient]
20151115-05:12:47: [INFO]: rest call info: GET https://mn-dev-unm-2.test.dataone.org/metacat/d1/mn/v2/meta/testUpdateSystemMetadata_MutableReplPolicy_2015318211230987 [org.dataone.client.rest.RestClient]
20151115-05:12:47: [INFO]: **************************************************** [org.dataone.integration.ContextAwareTestCaseDataone]
20151115-05:12:47: [INFO]: ***  context label:   DEV2 [org.dataone.integration.ContextAwareTestCaseDataone]
20151115-05:12:47: [INFO]: **************************************************** [org.dataone.integration.ContextAwareTestCaseDataone]
20151115-05:12:47: [INFO]: **************************************************** [org.dataone.integration.ContextAwareTestCaseDataone]
20151115-05:12:47: [INFO]: rest call info: GET https://mn-dev-ucsb-1.test.dataone.org/metacat/d1/mn/v2/monitor/ping [org.dataone.client.rest.RestClient]
20151115-05:12:47: [INFO]: MN excluded from test: https://mn-dev-ucsb-1.test.dataone.org/metacat/d1/mn [org.dataone.integration.ContextAwareTestCaseDataone]
20151115-05:12:48: [INFO]: rest call info: GET https://mn-dev-ucsb-2.test.dataone.org/metacat/d1/mn/v2/monitor/ping [org.dataone.client.rest.RestClient]
20151115-05:12:48: [INFO]: MN included in test: https://mn-dev-ucsb-2.test.dataone.org/metacat/d1/mn [org.dataone.integration.ContextAwareTestCaseDataone]
20151115-05:12:48: [INFO]: rest call info: GET https://mn-dev-unm-1.test.dataone.org/metacat/d1/mn/v2/monitor/ping [org.dataone.client.rest.RestClient]
20151115-05:12:48: [INFO]: MN excluded from test: https://mn-dev-unm-1.test.dataone.org/metacat/d1/mn [org.dataone.integration.ContextAwareTestCaseDataone]
20151115-05:12:48: [INFO]: rest call info: GET https://mn-dev-unm-2.test.dataone.org/metacat/d1/mn/v2/monitor/ping [org.dataone.client.rest.RestClient]
20151115-05:12:48: [INFO]: MN included in test: https://mn-dev-unm-2.test.dataone.org/metacat/d1/mn [org.dataone.integration.ContextAwareTestCaseDataone]
20151115-05:12:48: [INFO]: 
***************** running test for testUpdateSystemMetadata_MutableAuthMN(...) vs. node: https://mn-dev-ucsb-2.test.dataone.org/metacat/d1/mn ***************** [org.dataone.integration.ContextAwareTestCaseDataone]
20151115-05:12:48: [INFO]: certificate directory: /etc/dataone/client/testClientCerts/ [org.dataone.integration.ContextAwareTestCaseDataone]
20151115-05:12:48: [INFO]: certificate filename: cnDevUNM2 [org.dataone.integration.ContextAwareTestCaseDataone]
20151115-05:12:48: [INFO]: client setup as Subject: CN=urn:node:cnDevUNM2,DC=dataone,DC=org [org.dataone.integration.ContextAwareTestCaseDataone]
20151115-05:12:48: [INFO]: creating a test object.  pid = testUpdateSystemMetadata_MutableAuthMN_2015318211248467 on https://mn-dev-ucsb-2.test.dataone.org/metacat/d1/mn/v2 [org.dataone.integration.ContextAwareTestCaseDataone]
20151115-05:12:48: [INFO]: SystemMetadata for pid: testUpdateSystemMetadata_MutableAuthMN_2015318211248467
<?xml version="1.0" encoding="UTF-8"?><d1_v2.0:systemMetadata xmlns:d1_v2.0="http://ns.dataone.org/service/types/v2.0" xmlns:d1="http://ns.dataone.org/service/types/v1"><serialVersion>1</serialVersion><identifier>testUpdateSystemMetadata_MutableAuthMN_2015318211248467</identifier><formatId>eml://ecoinformatics.org/eml-2.0.1</formatId><size>17181</size><checksum algorithm="MD5">03ce09c6b4c3efc1681f3023402998a2</checksum><submitter>CN=urn:node:cnDevUNM2,DC=dataone,DC=org</submitter><rightsHolder>CN=testRightsHolder,DC=dataone,DC=org</rightsHolder><accessPolicy><allow><subject>CN=testRightsHolder,DC=dataone,DC=org</subject><permission>changePermission</permission></allow></accessPolicy><dateUploaded>2015-11-15T05:12:48.483+00:00</dateUploaded><dateSysMetadataModified>2015-11-15T05:12:48.483+00:00</dateSysMetadataModified><originMemberNode>urn:node:mnDevUCSB2</originMemberNode><authoritativeMemberNode>urn:node:mnDevUCSB2</authoritativeMemberNode></d1_v2.0:systemMetadata> [org.dataone.integration.ContextAwareTestCaseDataone]
20151115-05:12:49: [INFO]: rest call info: POST https://mn-dev-ucsb-2.test.dataone.org/metacat/d1/mn/v2/object; MMP message has: ParamPart:pid = testUpdateSystemMetadata_MutableAuthMN_2015318211248467; FilePart:object = /tmp/mmp.output.4720472361895657838.tmp (17181 bytes); FilePart:sysmeta = /tmp/mmp.output.2294907532593742259.tmp (981 bytes);  [org.dataone.client.rest.RestClient]
20151115-05:12:49: [INFO]: object created.  pid = testUpdateSystemMetadata_MutableAuthMN_2015318211248467 [org.dataone.integration.ContextAwareTestCaseDataone]
20151115-05:12:50: [INFO]: rest call info: GET https://mn-dev-ucsb-2.test.dataone.org/metacat/d1/mn/v2/meta/testUpdateSystemMetadata_MutableAuthMN_2015318211248467 [org.dataone.client.rest.RestClient]
20151115-05:12:50: [INFO]: rest call info: GET https://cn-dev-ucsb-2.test.dataone.org/cn/v2/node [org.dataone.client.rest.RestClient]
20151115-05:12:50: [WARN]: MN.updateSystemMetadata() returned a ServiceFailure. [org.dataone.integration.it.ContextAwareAdapter]
20151115-05:12:50: [INFO]: 
***************** running test for testUpdateSystemMetadata_MutableAuthMN(...) vs. node: https://mn-dev-unm-2.test.dataone.org/metacat/d1/mn ***************** [org.dataone.integration.ContextAwareTestCaseDataone]
20151115-05:12:50: [INFO]: certificate directory: /etc/dataone/client/testClientCerts/ [org.dataone.integration.ContextAwareTestCaseDataone]
20151115-05:12:50: [INFO]: certificate filename: cnDevUNM2 [org.dataone.integration.ContextAwareTestCaseDataone]
20151115-05:12:50: [INFO]: client setup as Subject: CN=urn:node:cnDevUNM2,DC=dataone,DC=org [org.dataone.integration.ContextAwareTestCaseDataone]
20151115-05:12:50: [INFO]: creating a test object.  pid = testUpdateSystemMetadata_MutableAuthMN_2015318211250549 on https://mn-dev-unm-2.test.dataone.org/metacat/d1/mn/v2 [org.dataone.integration.ContextAwareTestCaseDataone]
20151115-05:12:50: [INFO]: SystemMetadata for pid: testUpdateSystemMetadata_MutableAuthMN_2015318211250549
<?xml version="1.0" encoding="UTF-8"?><d1_v2.0:systemMetadata xmlns:d1_v2.0="http://ns.dataone.org/service/types/v2.0" xmlns:d1="http://ns.dataone.org/service/types/v1"><serialVersion>1</serialVersion><identifier>testUpdateSystemMetadata_MutableAuthMN_2015318211250549</identifier><formatId>eml://ecoinformatics.org/eml-2.0.1</formatId><size>17181</size><checksum algorithm="MD5">03ce09c6b4c3efc1681f3023402998a2</checksum><submitter>CN=urn:node:cnDevUNM2,DC=dataone,DC=org</submitter><rightsHolder>CN=testRightsHolder,DC=dataone,DC=org</rightsHolder><accessPolicy><allow><subject>CN=testRightsHolder,DC=dataone,DC=org</subject><permission>changePermission</permission></allow></accessPolicy><dateUploaded>2015-11-15T05:12:50.564+00:00</dateUploaded><dateSysMetadataModified>2015-11-15T05:12:50.564+00:00</dateSysMetadataModified><originMemberNode>urn:node:mnDevUNM2</originMemberNode><authoritativeMemberNode>urn:node:mnDevUNM2</authoritativeMemberNode></d1_v2.0:systemMetadata> [org.dataone.integration.ContextAwareTestCaseDataone]
20151115-05:12:51: [INFO]: rest call info: POST https://mn-dev-unm-2.test.dataone.org/metacat/d1/mn/v2/object; MMP message has: ParamPart:pid = testUpdateSystemMetadata_MutableAuthMN_2015318211250549; FilePart:object = /tmp/mmp.output.4736263622129088747.tmp (17181 bytes); FilePart:sysmeta = /tmp/mmp.output.1639939926017647783.tmp (979 bytes);  [org.dataone.client.rest.RestClient]
20151115-05:12:51: [INFO]: object created.  pid = testUpdateSystemMetadata_MutableAuthMN_2015318211250549 [org.dataone.integration.ContextAwareTestCaseDataone]
20151115-05:12:51: [INFO]: rest call info: GET https://mn-dev-unm-2.test.dataone.org/metacat/d1/mn/v2/meta/testUpdateSystemMetadata_MutableAuthMN_2015318211250549 [org.dataone.client.rest.RestClient]
20151115-05:12:51: [INFO]: rest call info: GET https://cn-dev-ucsb-2.test.dataone.org/cn/v2/node [org.dataone.client.rest.RestClient]
20151115-05:12:51: [WARN]: MN.updateSystemMetadata() returned a ServiceFailure. [org.dataone.integration.it.ContextAwareAdapter]
20151115-05:12:51: [INFO]: **************************************************** [org.dataone.integration.ContextAwareTestCaseDataone]
20151115-05:12:51: [INFO]: ***  context label:   DEV2 [org.dataone.integration.ContextAwareTestCaseDataone]
20151115-05:12:51: [INFO]: **************************************************** [org.dataone.integration.ContextAwareTestCaseDataone]
20151115-05:12:51: [INFO]: **************************************************** [org.dataone.integration.ContextAwareTestCaseDataone]
20151115-05:12:52: [INFO]: rest call info: GET https://mn-dev-ucsb-1.test.dataone.org/metacat/d1/mn/v2/monitor/ping [org.dataone.client.rest.RestClient]
20151115-05:12:52: [INFO]: MN excluded from test: https://mn-dev-ucsb-1.test.dataone.org/metacat/d1/mn [org.dataone.integration.ContextAwareTestCaseDataone]
20151115-05:12:52: [INFO]: rest call info: GET https://mn-dev-ucsb-2.test.dataone.org/metacat/d1/mn/v2/monitor/ping [org.dataone.client.rest.RestClient]
20151115-05:12:52: [INFO]: MN included in test: https://mn-dev-ucsb-2.test.dataone.org/metacat/d1/mn [org.dataone.integration.ContextAwareTestCaseDataone]
20151115-05:12:52: [INFO]: rest call info: GET https://mn-dev-unm-1.test.dataone.org/metacat/d1/mn/v2/monitor/ping [org.dataone.client.rest.RestClient]
20151115-05:12:52: [INFO]: MN excluded from test: https://mn-dev-unm-1.test.dataone.org/metacat/d1/mn [org.dataone.integration.ContextAwareTestCaseDataone]
20151115-05:12:52: [INFO]: rest call info: GET https://mn-dev-unm-2.test.dataone.org/metacat/d1/mn/v2/monitor/ping [org.dataone.client.rest.RestClient]
20151115-05:12:52: [INFO]: MN included in test: https://mn-dev-unm-2.test.dataone.org/metacat/d1/mn [org.dataone.integration.ContextAwareTestCaseDataone]
20151115-05:12:52: [INFO]: 
***************** running test for testUpdateSystemMetadata_MutableArchived(...) vs. node: https://mn-dev-ucsb-2.test.dataone.org/metacat/d1/mn ***************** [org.dataone.integration.ContextAwareTestCaseDataone]
20151115-05:12:52: [INFO]: certificate directory: /etc/dataone/client/testClientCerts/ [org.dataone.integration.ContextAwareTestCaseDataone]
20151115-05:12:52: [INFO]: certificate filename: cnDevUNM2 [org.dataone.integration.ContextAwareTestCaseDataone]
20151115-05:12:52: [INFO]: client setup as Subject: CN=urn:node:cnDevUNM2,DC=dataone,DC=org [org.dataone.integration.ContextAwareTestCaseDataone]
20151115-05:12:52: [INFO]: creating a test object.  pid = testUpdateSystemMetadata_MutableArchived_2015318211252183 on https://mn-dev-ucsb-2.test.dataone.org/metacat/d1/mn/v2 [org.dataone.integration.ContextAwareTestCaseDataone]
20151115-05:12:52: [INFO]: SystemMetadata for pid: testUpdateSystemMetadata_MutableArchived_2015318211252183
<?xml version="1.0" encoding="UTF-8"?><d1_v2.0:systemMetadata xmlns:d1_v2.0="http://ns.dataone.org/service/types/v2.0" xmlns:d1="http://ns.dataone.org/service/types/v1"><serialVersion>1</serialVersion><identifier>testUpdateSystemMetadata_MutableArchived_2015318211252183</identifier><formatId>eml://ecoinformatics.org/eml-2.0.1</formatId><size>17181</size><checksum algorithm="MD5">03ce09c6b4c3efc1681f3023402998a2</checksum><submitter>CN=urn:node:cnDevUNM2,DC=dataone,DC=org</submitter><rightsHolder>CN=testRightsHolder,DC=dataone,DC=org</rightsHolder><accessPolicy><allow><subject>CN=testRightsHolder,DC=dataone,DC=org</subject><permission>changePermission</permission></allow></accessPolicy><dateUploaded>2015-11-15T05:12:52.198+00:00</dateUploaded><dateSysMetadataModified>2015-11-15T05:12:52.198+00:00</dateSysMetadataModified><originMemberNode>urn:node:mnDevUCSB2</originMemberNode><authoritativeMemberNode>urn:node:mnDevUCSB2</authoritativeMemberNode></d1_v2.0:systemMetadata> [org.dataone.integration.ContextAwareTestCaseDataone]
20151115-05:12:53: [INFO]: rest call info: POST https://mn-dev-ucsb-2.test.dataone.org/metacat/d1/mn/v2/object; MMP message has: ParamPart:pid = testUpdateSystemMetadata_MutableArchived_2015318211252183; FilePart:object = /tmp/mmp.output.6245171266303017281.tmp (17181 bytes); FilePart:sysmeta = /tmp/mmp.output.5011395570590672470.tmp (983 bytes);  [org.dataone.client.rest.RestClient]
20151115-05:12:53: [INFO]: object created.  pid = testUpdateSystemMetadata_MutableArchived_2015318211252183 [org.dataone.integration.ContextAwareTestCaseDataone]
20151115-05:12:54: [INFO]: rest call info: GET https://mn-dev-ucsb-2.test.dataone.org/metacat/d1/mn/v2/meta/testUpdateSystemMetadata_MutableArchived_2015318211252183 [org.dataone.client.rest.RestClient]
20151115-05:13:00: [INFO]: rest call info: PUT https://mn-dev-ucsb-2.test.dataone.org/metacat/d1/mn/v2/meta; MMP message has: ParamPart:pid = testUpdateSystemMetadata_MutableArchived_2015318211252183; FilePart:sysmeta = /tmp/mmp.output.3534957416504730031.tmp (1006 bytes);  [org.dataone.client.rest.RestClient]
20151115-05:13:10: [INFO]: rest call info: GET https://mn-dev-ucsb-2.test.dataone.org/metacat/d1/mn/v2/meta/testUpdateSystemMetadata_MutableArchived_2015318211252183 [org.dataone.client.rest.RestClient]
20151115-05:13:10: [INFO]: 
***************** running test for testUpdateSystemMetadata_MutableArchived(...) vs. node: https://mn-dev-unm-2.test.dataone.org/metacat/d1/mn ***************** [org.dataone.integration.ContextAwareTestCaseDataone]
20151115-05:13:10: [INFO]: certificate directory: /etc/dataone/client/testClientCerts/ [org.dataone.integration.ContextAwareTestCaseDataone]
20151115-05:13:10: [INFO]: certificate filename: cnDevUNM2 [org.dataone.integration.ContextAwareTestCaseDataone]
20151115-05:13:10: [INFO]: client setup as Subject: CN=urn:node:cnDevUNM2,DC=dataone,DC=org [org.dataone.integration.ContextAwareTestCaseDataone]
20151115-05:13:10: [INFO]: creating a test object.  pid = testUpdateSystemMetadata_MutableArchived_2015318211310900 on https://mn-dev-unm-2.test.dataone.org/metacat/d1/mn/v2 [org.dataone.integration.ContextAwareTestCaseDataone]
20151115-05:13:10: [INFO]: SystemMetadata for pid: testUpdateSystemMetadata_MutableArchived_2015318211310900
<?xml version="1.0" encoding="UTF-8"?><d1_v2.0:systemMetadata xmlns:d1_v2.0="http://ns.dataone.org/service/types/v2.0" xmlns:d1="http://ns.dataone.org/service/types/v1"><serialVersion>1</serialVersion><identifier>testUpdateSystemMetadata_MutableArchived_2015318211310900</identifier><formatId>eml://ecoinformatics.org/eml-2.0.1</formatId><size>17181</size><checksum algorithm="MD5">03ce09c6b4c3efc1681f3023402998a2</checksum><submitter>CN=urn:node:cnDevUNM2,DC=dataone,DC=org</submitter><rightsHolder>CN=testRightsHolder,DC=dataone,DC=org</rightsHolder><accessPolicy><allow><subject>CN=testRightsHolder,DC=dataone,DC=org</subject><permission>changePermission</permission></allow></accessPolicy><dateUploaded>2015-11-15T05:13:10.915+00:00</dateUploaded><dateSysMetadataModified>2015-11-15T05:13:10.915+00:00</dateSysMetadataModified><originMemberNode>urn:node:mnDevUNM2</originMemberNode><authoritativeMemberNode>urn:node:mnDevUNM2</authoritativeMemberNode></d1_v2.0:systemMetadata> [org.dataone.integration.ContextAwareTestCaseDataone]
20151115-05:13:11: [INFO]: rest call info: POST https://mn-dev-unm-2.test.dataone.org/metacat/d1/mn/v2/object; MMP message has: ParamPart:pid = testUpdateSystemMetadata_MutableArchived_2015318211310900; FilePart:object = /tmp/mmp.output.7065869189719495020.tmp (17181 bytes); FilePart:sysmeta = /tmp/mmp.output.7996175884540641593.tmp (981 bytes);  [org.dataone.client.rest.RestClient]
20151115-05:13:11: [INFO]: object created.  pid = testUpdateSystemMetadata_MutableArchived_2015318211310900 [org.dataone.integration.ContextAwareTestCaseDataone]
20151115-05:13:11: [INFO]: rest call info: GET https://mn-dev-unm-2.test.dataone.org/metacat/d1/mn/v2/meta/testUpdateSystemMetadata_MutableArchived_2015318211310900 [org.dataone.client.rest.RestClient]
20151115-05:13:12: [INFO]: rest call info: PUT https://mn-dev-unm-2.test.dataone.org/metacat/d1/mn/v2/meta; MMP message has: ParamPart:pid = testUpdateSystemMetadata_MutableArchived_2015318211310900; FilePart:sysmeta = /tmp/mmp.output.6182559736778239670.tmp (1004 bytes);  [org.dataone.client.rest.RestClient]
20151115-05:13:12: [WARN]: MN.updateSystemMetadata() returned a ServiceFailure. [org.dataone.integration.it.ContextAwareAdapter]
20151115-05:13:12: [INFO]: **************************************************** [org.dataone.integration.ContextAwareTestCaseDataone]
20151115-05:13:12: [INFO]: ***  context label:   DEV2 [org.dataone.integration.ContextAwareTestCaseDataone]
20151115-05:13:12: [INFO]: **************************************************** [org.dataone.integration.ContextAwareTestCaseDataone]
20151115-05:13:12: [INFO]: **************************************************** [org.dataone.integration.ContextAwareTestCaseDataone]
20151115-05:13:12: [INFO]: rest call info: GET https://mn-dev-ucsb-1.test.dataone.org/metacat/d1/mn/v2/monitor/ping [org.dataone.client.rest.RestClient]
20151115-05:13:12: [INFO]: MN excluded from test: https://mn-dev-ucsb-1.test.dataone.org/metacat/d1/mn [org.dataone.integration.ContextAwareTestCaseDataone]
20151115-05:13:12: [INFO]: rest call info: GET https://mn-dev-ucsb-2.test.dataone.org/metacat/d1/mn/v2/monitor/ping [org.dataone.client.rest.RestClient]
20151115-05:13:12: [INFO]: MN included in test: https://mn-dev-ucsb-2.test.dataone.org/metacat/d1/mn [org.dataone.integration.ContextAwareTestCaseDataone]
20151115-05:13:12: [INFO]: rest call info: GET https://mn-dev-unm-1.test.dataone.org/metacat/d1/mn/v2/monitor/ping [org.dataone.client.rest.RestClient]
20151115-05:13:12: [INFO]: MN excluded from test: https://mn-dev-unm-1.test.dataone.org/metacat/d1/mn [org.dataone.integration.ContextAwareTestCaseDataone]
20151115-05:13:12: [INFO]: rest call info: GET https://mn-dev-unm-2.test.dataone.org/metacat/d1/mn/v2/monitor/ping [org.dataone.client.rest.RestClient]
20151115-05:13:12: [INFO]: MN included in test: https://mn-dev-unm-2.test.dataone.org/metacat/d1/mn [org.dataone.integration.ContextAwareTestCaseDataone]
20151115-05:13:12: [INFO]: 
***************** running test for testUpdateSystemMetadata_MutableAuthMN(...) vs. node: https://mn-dev-ucsb-2.test.dataone.org/metacat/d1/mn ***************** [org.dataone.integration.ContextAwareTestCaseDataone]
20151115-05:13:12: [INFO]: certificate directory: /etc/dataone/client/testClientCerts/ [org.dataone.integration.ContextAwareTestCaseDataone]
20151115-05:13:12: [INFO]: certificate filename: cnDevUNM2 [org.dataone.integration.ContextAwareTestCaseDataone]
20151115-05:13:12: [INFO]: client setup as Subject: CN=urn:node:cnDevUNM2,DC=dataone,DC=org [org.dataone.integration.ContextAwareTestCaseDataone]
20151115-05:13:12: [INFO]: creating a test object.  pid = testUpdateSystemMetadata_MutableAuthMN_2015318211312971 on https://mn-dev-ucsb-2.test.dataone.org/metacat/d1/mn/v2 [org.dataone.integration.ContextAwareTestCaseDataone]
20151115-05:13:12: [INFO]: SystemMetadata for pid: testUpdateSystemMetadata_MutableAuthMN_2015318211312971
<?xml version="1.0" encoding="UTF-8"?><d1_v2.0:systemMetadata xmlns:d1_v2.0="http://ns.dataone.org/service/types/v2.0" xmlns:d1="http://ns.dataone.org/service/types/v1"><serialVersion>1</serialVersion><identifier>testUpdateSystemMetadata_MutableAuthMN_2015318211312971</identifier><formatId>eml://ecoinformatics.org/eml-2.0.1</formatId><size>17181</size><checksum algorithm="MD5">03ce09c6b4c3efc1681f3023402998a2</checksum><submitter>CN=urn:node:cnDevUNM2,DC=dataone,DC=org</submitter><rightsHolder>CN=testRightsHolder,DC=dataone,DC=org</rightsHolder><accessPolicy><allow><subject>CN=testRightsHolder,DC=dataone,DC=org</subject><permission>changePermission</permission></allow></accessPolicy><dateUploaded>2015-11-15T05:13:12.985+00:00</dateUploaded><dateSysMetadataModified>2015-11-15T05:13:12.985+00:00</dateSysMetadataModified><originMemberNode>urn:node:mnDevUCSB2</originMemberNode><authoritativeMemberNode>urn:node:mnDevUCSB2</authoritativeMemberNode></d1_v2.0:systemMetadata> [org.dataone.integration.ContextAwareTestCaseDataone]
20151115-05:13:14: [INFO]: rest call info: POST https://mn-dev-ucsb-2.test.dataone.org/metacat/d1/mn/v2/object; MMP message has: ParamPart:pid = testUpdateSystemMetadata_MutableAuthMN_2015318211312971; FilePart:object = /tmp/mmp.output.176969290904396232.tmp (17181 bytes); FilePart:sysmeta = /tmp/mmp.output.4564879976792758443.tmp (981 bytes);  [org.dataone.client.rest.RestClient]
20151115-05:13:14: [INFO]: object created.  pid = testUpdateSystemMetadata_MutableAuthMN_2015318211312971 [org.dataone.integration.ContextAwareTestCaseDataone]
20151115-05:13:14: [INFO]: rest call info: GET https://mn-dev-ucsb-2.test.dataone.org/metacat/d1/mn/v2/meta/testUpdateSystemMetadata_MutableAuthMN_2015318211312971 [org.dataone.client.rest.RestClient]
20151115-05:13:14: [INFO]: rest call info: GET https://cn-dev-ucsb-2.test.dataone.org/cn/v2/node [org.dataone.client.rest.RestClient]
20151115-05:13:14: [WARN]: MN.updateSystemMetadata() returned a ServiceFailure, was expecting an InvalidRequest or NotAuthorized. [org.dataone.integration.it.ContextAwareAdapter]
20151115-05:13:14: [INFO]: 
***************** running test for testUpdateSystemMetadata_MutableAuthMN(...) vs. node: https://mn-dev-unm-2.test.dataone.org/metacat/d1/mn ***************** [org.dataone.integration.ContextAwareTestCaseDataone]
20151115-05:13:14: [INFO]: certificate directory: /etc/dataone/client/testClientCerts/ [org.dataone.integration.ContextAwareTestCaseDataone]
20151115-05:13:14: [INFO]: certificate filename: cnDevUNM2 [org.dataone.integration.ContextAwareTestCaseDataone]
20151115-05:13:14: [INFO]: client setup as Subject: CN=urn:node:cnDevUNM2,DC=dataone,DC=org [org.dataone.integration.ContextAwareTestCaseDataone]
20151115-05:13:14: [INFO]: creating a test object.  pid = testUpdateSystemMetadata_MutableAuthMN_2015318211314903 on https://mn-dev-unm-2.test.dataone.org/metacat/d1/mn/v2 [org.dataone.integration.ContextAwareTestCaseDataone]
20151115-05:13:14: [INFO]: SystemMetadata for pid: testUpdateSystemMetadata_MutableAuthMN_2015318211314903
<?xml version="1.0" encoding="UTF-8"?><d1_v2.0:systemMetadata xmlns:d1_v2.0="http://ns.dataone.org/service/types/v2.0" xmlns:d1="http://ns.dataone.org/service/types/v1"><serialVersion>1</serialVersion><identifier>testUpdateSystemMetadata_MutableAuthMN_2015318211314903</identifier><formatId>eml://ecoinformatics.org/eml-2.0.1</formatId><size>17181</size><checksum algorithm="MD5">03ce09c6b4c3efc1681f3023402998a2</checksum><submitter>CN=urn:node:cnDevUNM2,DC=dataone,DC=org</submitter><rightsHolder>CN=testRightsHolder,DC=dataone,DC=org</rightsHolder><accessPolicy><allow><subject>CN=testRightsHolder,DC=dataone,DC=org</subject><permission>changePermission</permission></allow></accessPolicy><dateUploaded>2015-11-15T05:13:14.917+00:00</dateUploaded><dateSysMetadataModified>2015-11-15T05:13:14.917+00:00</dateSysMetadataModified><originMemberNode>urn:node:mnDevUNM2</originMemberNode><authoritativeMemberNode>urn:node:mnDevUNM2</authoritativeMemberNode></d1_v2.0:systemMetadata> [org.dataone.integration.ContextAwareTestCaseDataone]
20151115-05:13:15: [INFO]: rest call info: POST https://mn-dev-unm-2.test.dataone.org/metacat/d1/mn/v2/object; MMP message has: ParamPart:pid = testUpdateSystemMetadata_MutableAuthMN_2015318211314903; FilePart:object = /tmp/mmp.output.7510149041771307966.tmp (17181 bytes); FilePart:sysmeta = /tmp/mmp.output.4100163680416204699.tmp (979 bytes);  [org.dataone.client.rest.RestClient]
20151115-05:13:15: [INFO]: object created.  pid = testUpdateSystemMetadata_MutableAuthMN_2015318211314903 [org.dataone.integration.ContextAwareTestCaseDataone]
20151115-05:13:16: [INFO]: rest call info: GET https://mn-dev-unm-2.test.dataone.org/metacat/d1/mn/v2/meta/testUpdateSystemMetadata_MutableAuthMN_2015318211314903 [org.dataone.client.rest.RestClient]
20151115-05:13:16: [INFO]: rest call info: GET https://cn-dev-ucsb-2.test.dataone.org/cn/v2/node [org.dataone.client.rest.RestClient]
20151115-05:13:16: [WARN]: MN.updateSystemMetadata() returned a ServiceFailure, was expecting an InvalidRequest or NotAuthorized. [org.dataone.integration.it.ContextAwareAdapter]
20151115-05:13:16: [INFO]: **************************************************** [org.dataone.integration.ContextAwareTestCaseDataone]
20151115-05:13:16: [INFO]: ***  context label:   DEV2 [org.dataone.integration.ContextAwareTestCaseDataone]
20151115-05:13:16: [INFO]: **************************************************** [org.dataone.integration.ContextAwareTestCaseDataone]
20151115-05:13:16: [INFO]: **************************************************** [org.dataone.integration.ContextAwareTestCaseDataone]
20151115-05:13:16: [INFO]: rest call info: GET https://mn-dev-ucsb-1.test.dataone.org/metacat/d1/mn/v2/monitor/ping [org.dataone.client.rest.RestClient]
20151115-05:13:16: [INFO]: MN excluded from test: https://mn-dev-ucsb-1.test.dataone.org/metacat/d1/mn [org.dataone.integration.ContextAwareTestCaseDataone]
20151115-05:13:16: [INFO]: rest call info: GET https://mn-dev-ucsb-2.test.dataone.org/metacat/d1/mn/v2/monitor/ping [org.dataone.client.rest.RestClient]
20151115-05:13:16: [INFO]: MN included in test: https://mn-dev-ucsb-2.test.dataone.org/metacat/d1/mn [org.dataone.integration.ContextAwareTestCaseDataone]
20151115-05:13:16: [INFO]: rest call info: GET https://mn-dev-unm-1.test.dataone.org/metacat/d1/mn/v2/monitor/ping [org.dataone.client.rest.RestClient]
20151115-05:13:16: [INFO]: MN excluded from test: https://mn-dev-unm-1.test.dataone.org/metacat/d1/mn [org.dataone.integration.ContextAwareTestCaseDataone]
20151115-05:13:16: [INFO]: rest call info: GET https://mn-dev-unm-2.test.dataone.org/metacat/d1/mn/v2/monitor/ping [org.dataone.client.rest.RestClient]
20151115-05:13:16: [INFO]: MN included in test: https://mn-dev-unm-2.test.dataone.org/metacat/d1/mn [org.dataone.integration.ContextAwareTestCaseDataone]
20151115-05:13:16: [INFO]: 
***************** running test for testUpdateSystemMetadata_ObsoletesFail(...) vs. node: https://mn-dev-ucsb-2.test.dataone.org/metacat/d1/mn ***************** [org.dataone.integration.ContextAwareTestCaseDataone]
20151115-05:13:16: [INFO]: certificate directory: /etc/dataone/client/testClientCerts/ [org.dataone.integration.ContextAwareTestCaseDataone]
20151115-05:13:16: [INFO]: certificate filename: cnDevUNM2 [org.dataone.integration.ContextAwareTestCaseDataone]
20151115-05:13:16: [INFO]: client setup as Subject: CN=urn:node:cnDevUNM2,DC=dataone,DC=org [org.dataone.integration.ContextAwareTestCaseDataone]
20151115-05:13:16: [INFO]: creating a test object.  pid = testUpdateSystemMetadata_ObsoletesFail_2015318211316543 on https://mn-dev-ucsb-2.test.dataone.org/metacat/d1/mn/v2 [org.dataone.integration.ContextAwareTestCaseDataone]
20151115-05:13:16: [INFO]: SystemMetadata for pid: testUpdateSystemMetadata_ObsoletesFail_2015318211316543
<?xml version="1.0" encoding="UTF-8"?><d1_v2.0:systemMetadata xmlns:d1_v2.0="http://ns.dataone.org/service/types/v2.0" xmlns:d1="http://ns.dataone.org/service/types/v1"><serialVersion>1</serialVersion><identifier>testUpdateSystemMetadata_ObsoletesFail_2015318211316543</identifier><formatId>eml://ecoinformatics.org/eml-2.0.1</formatId><size>17181</size><checksum algorithm="MD5">03ce09c6b4c3efc1681f3023402998a2</checksum><submitter>CN=urn:node:cnDevUNM2,DC=dataone,DC=org</submitter><rightsHolder>CN=testRightsHolder,DC=dataone,DC=org</rightsHolder><accessPolicy><allow><subject>CN=testRightsHolder,DC=dataone,DC=org</subject><permission>changePermission</permission></allow></accessPolicy><dateUploaded>2015-11-15T05:13:16.560+00:00</dateUploaded><dateSysMetadataModified>2015-11-15T05:13:16.560+00:00</dateSysMetadataModified><originMemberNode>urn:node:mnDevUCSB2</originMemberNode><authoritativeMemberNode>urn:node:mnDevUCSB2</authoritativeMemberNode></d1_v2.0:systemMetadata> [org.dataone.integration.ContextAwareTestCaseDataone]
20151115-05:13:18: [INFO]: rest call info: POST https://mn-dev-ucsb-2.test.dataone.org/metacat/d1/mn/v2/object; MMP message has: ParamPart:pid = testUpdateSystemMetadata_ObsoletesFail_2015318211316543; FilePart:object = /tmp/mmp.output.1576565336274612303.tmp (17181 bytes); FilePart:sysmeta = /tmp/mmp.output.4079056352256248113.tmp (981 bytes);  [org.dataone.client.rest.RestClient]
20151115-05:13:18: [INFO]: object created.  pid = testUpdateSystemMetadata_ObsoletesFail_2015318211316543 [org.dataone.integration.ContextAwareTestCaseDataone]
20151115-05:13:30: [INFO]: rest call info: PUT https://mn-dev-ucsb-2.test.dataone.org/metacat/d1/mn/v2/object/testUpdateSystemMetadata_ObsoletesFail_2015318211316543; MMP message has: ParamPart:newPid = testUpdateSystemMetadata_ObsoletesFail_2015318211316545; FilePart:object = /tmp/mmp.output.5099344476771953931.tmp (17181 bytes); FilePart:sysmeta = /tmp/mmp.output.6147557771278146082.tmp (781 bytes);  [org.dataone.client.rest.RestClient]
20151115-05:13:30: [INFO]: certificate directory: /etc/dataone/client/testClientCerts/ [org.dataone.integration.ContextAwareTestCaseDataone]
20151115-05:13:30: [INFO]: certificate filename: cnDevUNM2 [org.dataone.integration.ContextAwareTestCaseDataone]
20151115-05:13:30: [INFO]: client setup as Subject: CN=urn:node:cnDevUNM2,DC=dataone,DC=org [org.dataone.integration.ContextAwareTestCaseDataone]
20151115-05:13:30: [INFO]: creating a test object.  pid = testUpdateSystemMetadata_ObsoletesFail_2015318211316546 on https://mn-dev-ucsb-2.test.dataone.org/metacat/d1/mn/v2 [org.dataone.integration.ContextAwareTestCaseDataone]
20151115-05:13:30: [INFO]: SystemMetadata for pid: testUpdateSystemMetadata_ObsoletesFail_2015318211316546
<?xml version="1.0" encoding="UTF-8"?><d1_v2.0:systemMetadata xmlns:d1_v2.0="http://ns.dataone.org/service/types/v2.0" xmlns:d1="http://ns.dataone.org/service/types/v1"><serialVersion>1</serialVersion><identifier>testUpdateSystemMetadata_ObsoletesFail_2015318211316546</identifier><formatId>eml://ecoinformatics.org/eml-2.0.1</formatId><size>17181</size><checksum algorithm="MD5">03ce09c6b4c3efc1681f3023402998a2</checksum><submitter>CN=urn:node:cnDevUNM2,DC=dataone,DC=org</submitter><rightsHolder>CN=testRightsHolder,DC=dataone,DC=org</rightsHolder><accessPolicy><allow><subject>CN=testRightsHolder,DC=dataone,DC=org</subject><permission>changePermission</permission></allow></accessPolicy><dateUploaded>2015-11-15T05:13:30.301+00:00</dateUploaded><dateSysMetadataModified>2015-11-15T05:13:30.301+00:00</dateSysMetadataModified><originMemberNode>urn:node:mnDevUCSB2</originMemberNode><authoritativeMemberNode>urn:node:mnDevUCSB2</authoritativeMemberNode></d1_v2.0:systemMetadata> [org.dataone.integration.ContextAwareTestCaseDataone]
20151115-05:13:31: [INFO]: rest call info: POST https://mn-dev-ucsb-2.test.dataone.org/metacat/d1/mn/v2/object; MMP message has: ParamPart:pid = testUpdateSystemMetadata_ObsoletesFail_2015318211316546; FilePart:object = /tmp/mmp.output.2959585869133926538.tmp (17181 bytes); FilePart:sysmeta = /tmp/mmp.output.5184300243471996290.tmp (981 bytes);  [org.dataone.client.rest.RestClient]
20151115-05:13:31: [INFO]: object created.  pid = testUpdateSystemMetadata_ObsoletesFail_2015318211316546 [org.dataone.integration.ContextAwareTestCaseDataone]
20151115-05:13:42: [INFO]: rest call info: GET https://mn-dev-ucsb-2.test.dataone.org/metacat/d1/mn/v2/meta/testUpdateSystemMetadata_ObsoletesFail_2015318211316545 [org.dataone.client.rest.RestClient]
20151115-05:13:42: [INFO]: rest call info: PUT https://mn-dev-ucsb-2.test.dataone.org/metacat/d1/mn/v2/meta; MMP message has: ParamPart:pid = testUpdateSystemMetadata_ObsoletesFail_2015318211316545; FilePart:sysmeta = /tmp/mmp.output.4953564637869116705.tmp (916 bytes);  [org.dataone.client.rest.RestClient]
20151115-05:13:42: [INFO]: 
***************** running test for testUpdateSystemMetadata_ObsoletesFail(...) vs. node: https://mn-dev-unm-2.test.dataone.org/metacat/d1/mn ***************** [org.dataone.integration.ContextAwareTestCaseDataone]
20151115-05:13:42: [INFO]: certificate directory: /etc/dataone/client/testClientCerts/ [org.dataone.integration.ContextAwareTestCaseDataone]
20151115-05:13:42: [INFO]: certificate filename: cnDevUNM2 [org.dataone.integration.ContextAwareTestCaseDataone]
20151115-05:13:42: [INFO]: client setup as Subject: CN=urn:node:cnDevUNM2,DC=dataone,DC=org [org.dataone.integration.ContextAwareTestCaseDataone]
20151115-05:13:42: [INFO]: creating a test object.  pid = testUpdateSystemMetadata_ObsoletesFail_2015318211342503 on https://mn-dev-unm-2.test.dataone.org/metacat/d1/mn/v2 [org.dataone.integration.ContextAwareTestCaseDataone]
20151115-05:13:42: [INFO]: SystemMetadata for pid: testUpdateSystemMetadata_ObsoletesFail_2015318211342503
<?xml version="1.0" encoding="UTF-8"?><d1_v2.0:systemMetadata xmlns:d1_v2.0="http://ns.dataone.org/service/types/v2.0" xmlns:d1="http://ns.dataone.org/service/types/v1"><serialVersion>1</serialVersion><identifier>testUpdateSystemMetadata_ObsoletesFail_2015318211342503</identifier><formatId>eml://ecoinformatics.org/eml-2.0.1</formatId><size>17181</size><checksum algorithm="MD5">03ce09c6b4c3efc1681f3023402998a2</checksum><submitter>CN=urn:node:cnDevUNM2,DC=dataone,DC=org</submitter><rightsHolder>CN=testRightsHolder,DC=dataone,DC=org</rightsHolder><accessPolicy><allow><subject>CN=testRightsHolder,DC=dataone,DC=org</subject><permission>changePermission</permission></allow></accessPolicy><dateUploaded>2015-11-15T05:13:42.520+00:00</dateUploaded><dateSysMetadataModified>2015-11-15T05:13:42.520+00:00</dateSysMetadataModified><originMemberNode>urn:node:mnDevUNM2</originMemberNode><authoritativeMemberNode>urn:node:mnDevUNM2</authoritativeMemberNode></d1_v2.0:systemMetadata> [org.dataone.integration.ContextAwareTestCaseDataone]
20151115-05:13:43: [INFO]: rest call info: POST https://mn-dev-unm-2.test.dataone.org/metacat/d1/mn/v2/object; MMP message has: ParamPart:pid = testUpdateSystemMetadata_ObsoletesFail_2015318211342503; FilePart:object = /tmp/mmp.output.6120792821579859013.tmp (17181 bytes); FilePart:sysmeta = /tmp/mmp.output.6650031451356761981.tmp (979 bytes);  [org.dataone.client.rest.RestClient]
20151115-05:13:43: [INFO]: object created.  pid = testUpdateSystemMetadata_ObsoletesFail_2015318211342503 [org.dataone.integration.ContextAwareTestCaseDataone]
20151115-05:13:54: [INFO]: rest call info: PUT https://mn-dev-unm-2.test.dataone.org/metacat/d1/mn/v2/object/testUpdateSystemMetadata_ObsoletesFail_2015318211342503; MMP message has: ParamPart:newPid = testUpdateSystemMetadata_ObsoletesFail_2015318211342504; FilePart:object = /tmp/mmp.output.4018599662477219154.tmp (17181 bytes); FilePart:sysmeta = /tmp/mmp.output.1377495937478072820.tmp (780 bytes);  [org.dataone.client.rest.RestClient]
20151115-05:13:54: [INFO]: certificate directory: /etc/dataone/client/testClientCerts/ [org.dataone.integration.ContextAwareTestCaseDataone]
20151115-05:13:54: [INFO]: certificate filename: cnDevUNM2 [org.dataone.integration.ContextAwareTestCaseDataone]
20151115-05:13:54: [INFO]: client setup as Subject: CN=urn:node:cnDevUNM2,DC=dataone,DC=org [org.dataone.integration.ContextAwareTestCaseDataone]
20151115-05:13:54: [INFO]: creating a test object.  pid = testUpdateSystemMetadata_ObsoletesFail_2015318211342505 on https://mn-dev-unm-2.test.dataone.org/metacat/d1/mn/v2 [org.dataone.integration.ContextAwareTestCaseDataone]
20151115-05:13:54: [INFO]: SystemMetadata for pid: testUpdateSystemMetadata_ObsoletesFail_2015318211342505
<?xml version="1.0" encoding="UTF-8"?><d1_v2.0:systemMetadata xmlns:d1_v2.0="http://ns.dataone.org/service/types/v2.0" xmlns:d1="http://ns.dataone.org/service/types/v1"><serialVersion>1</serialVersion><identifier>testUpdateSystemMetadata_ObsoletesFail_2015318211342505</identifier><formatId>eml://ecoinformatics.org/eml-2.0.1</formatId><size>17181</size><checksum algorithm="MD5">03ce09c6b4c3efc1681f3023402998a2</checksum><submitter>CN=urn:node:cnDevUNM2,DC=dataone,DC=org</submitter><rightsHolder>CN=testRightsHolder,DC=dataone,DC=org</rightsHolder><accessPolicy><allow><subject>CN=testRightsHolder,DC=dataone,DC=org</subject><permission>changePermission</permission></allow></accessPolicy><dateUploaded>2015-11-15T05:13:54.947+00:00</dateUploaded><dateSysMetadataModified>2015-11-15T05:13:54.947+00:00</dateSysMetadataModified><originMemberNode>urn:node:mnDevUNM2</originMemberNode><authoritativeMemberNode>urn:node:mnDevUNM2</authoritativeMemberNode></d1_v2.0:systemMetadata> [org.dataone.integration.ContextAwareTestCaseDataone]
20151115-05:13:55: [INFO]: rest call info: POST https://mn-dev-unm-2.test.dataone.org/metacat/d1/mn/v2/object; MMP message has: ParamPart:pid = testUpdateSystemMetadata_ObsoletesFail_2015318211342505; FilePart:object = /tmp/mmp.output.4244462341797572843.tmp (17181 bytes); FilePart:sysmeta = /tmp/mmp.output.2333803254217649502.tmp (979 bytes);  [org.dataone.client.rest.RestClient]
20151115-05:13:55: [INFO]: object created.  pid = testUpdateSystemMetadata_ObsoletesFail_2015318211342505 [org.dataone.integration.ContextAwareTestCaseDataone]
20151115-05:14:06: [INFO]: rest call info: GET https://mn-dev-unm-2.test.dataone.org/metacat/d1/mn/v2/meta/testUpdateSystemMetadata_ObsoletesFail_2015318211342504 [org.dataone.client.rest.RestClient]
20151115-05:14:06: [INFO]: rest call info: PUT https://mn-dev-unm-2.test.dataone.org/metacat/d1/mn/v2/meta; MMP message has: ParamPart:pid = testUpdateSystemMetadata_ObsoletesFail_2015318211342504; FilePart:sysmeta = /tmp/mmp.output.6338240279064803833.tmp (914 bytes);  [org.dataone.client.rest.RestClient]
20151115-05:14:06: [INFO]: **************************************************** [org.dataone.integration.ContextAwareTestCaseDataone]
20151115-05:14:06: [INFO]: ***  context label:   DEV2 [org.dataone.integration.ContextAwareTestCaseDataone]
20151115-05:14:06: [INFO]: **************************************************** [org.dataone.integration.ContextAwareTestCaseDataone]
20151115-05:14:06: [INFO]: **************************************************** [org.dataone.integration.ContextAwareTestCaseDataone]
20151115-05:14:06: [INFO]: rest call info: GET https://mn-dev-ucsb-1.test.dataone.org/metacat/d1/mn/v2/monitor/ping [org.dataone.client.rest.RestClient]
20151115-05:14:06: [INFO]: MN excluded from test: https://mn-dev-ucsb-1.test.dataone.org/metacat/d1/mn [org.dataone.integration.ContextAwareTestCaseDataone]
20151115-05:14:07: [INFO]: rest call info: GET https://mn-dev-ucsb-2.test.dataone.org/metacat/d1/mn/v2/monitor/ping [org.dataone.client.rest.RestClient]
20151115-05:14:07: [INFO]: MN included in test: https://mn-dev-ucsb-2.test.dataone.org/metacat/d1/mn [org.dataone.integration.ContextAwareTestCaseDataone]
20151115-05:14:07: [INFO]: rest call info: GET https://mn-dev-unm-1.test.dataone.org/metacat/d1/mn/v2/monitor/ping [org.dataone.client.rest.RestClient]
20151115-05:14:07: [INFO]: MN excluded from test: https://mn-dev-unm-1.test.dataone.org/metacat/d1/mn [org.dataone.integration.ContextAwareTestCaseDataone]
20151115-05:14:07: [INFO]: rest call info: GET https://mn-dev-unm-2.test.dataone.org/metacat/d1/mn/v2/monitor/ping [org.dataone.client.rest.RestClient]
20151115-05:14:07: [INFO]: MN included in test: https://mn-dev-unm-2.test.dataone.org/metacat/d1/mn [org.dataone.integration.ContextAwareTestCaseDataone]
20151115-05:14:07: [INFO]: 
***************** running test for testUpdateSystemMetadata_ObsoletedByFail(...) vs. node: https://mn-dev-ucsb-2.test.dataone.org/metacat/d1/mn ***************** [org.dataone.integration.ContextAwareTestCaseDataone]
20151115-05:14:07: [INFO]: certificate directory: /etc/dataone/client/testClientCerts/ [org.dataone.integration.ContextAwareTestCaseDataone]
20151115-05:14:07: [INFO]: certificate filename: cnDevUNM2 [org.dataone.integration.ContextAwareTestCaseDataone]
20151115-05:14:07: [INFO]: client setup as Subject: CN=urn:node:cnDevUNM2,DC=dataone,DC=org [org.dataone.integration.ContextAwareTestCaseDataone]
20151115-05:14:07: [INFO]: creating a test object.  pid = testUpdateSystemMetadata_ObsoletedByFail_201531821147280 on https://mn-dev-ucsb-2.test.dataone.org/metacat/d1/mn/v2 [org.dataone.integration.ContextAwareTestCaseDataone]
20151115-05:14:07: [INFO]: SystemMetadata for pid: testUpdateSystemMetadata_ObsoletedByFail_201531821147280
<?xml version="1.0" encoding="UTF-8"?><d1_v2.0:systemMetadata xmlns:d1_v2.0="http://ns.dataone.org/service/types/v2.0" xmlns:d1="http://ns.dataone.org/service/types/v1"><serialVersion>1</serialVersion><identifier>testUpdateSystemMetadata_ObsoletedByFail_201531821147280</identifier><formatId>eml://ecoinformatics.org/eml-2.0.1</formatId><size>17181</size><checksum algorithm="MD5">03ce09c6b4c3efc1681f3023402998a2</checksum><submitter>CN=urn:node:cnDevUNM2,DC=dataone,DC=org</submitter><rightsHolder>CN=testRightsHolder,DC=dataone,DC=org</rightsHolder><accessPolicy><allow><subject>CN=testRightsHolder,DC=dataone,DC=org</subject><permission>changePermission</permission></allow></accessPolicy><dateUploaded>2015-11-15T05:14:07.297+00:00</dateUploaded><dateSysMetadataModified>2015-11-15T05:14:07.297+00:00</dateSysMetadataModified><originMemberNode>urn:node:mnDevUCSB2</originMemberNode><authoritativeMemberNode>urn:node:mnDevUCSB2</authoritativeMemberNode></d1_v2.0:systemMetadata> [org.dataone.integration.ContextAwareTestCaseDataone]
20151115-05:14:08: [INFO]: rest call info: POST https://mn-dev-ucsb-2.test.dataone.org/metacat/d1/mn/v2/object; MMP message has: ParamPart:pid = testUpdateSystemMetadata_ObsoletedByFail_201531821147280; FilePart:object = /tmp/mmp.output.6435109098126833545.tmp (17181 bytes); FilePart:sysmeta = /tmp/mmp.output.3418250074810306286.tmp (982 bytes);  [org.dataone.client.rest.RestClient]
20151115-05:14:08: [INFO]: object created.  pid = testUpdateSystemMetadata_ObsoletedByFail_201531821147280 [org.dataone.integration.ContextAwareTestCaseDataone]
20151115-05:14:20: [INFO]: rest call info: PUT https://mn-dev-ucsb-2.test.dataone.org/metacat/d1/mn/v2/object/testUpdateSystemMetadata_ObsoletedByFail_201531821147280; MMP message has: ParamPart:newPid = testUpdateSystemMetadata_ObsoletedByFail_201531821147281; FilePart:object = /tmp/mmp.output.3825793063195193618.tmp (17181 bytes); FilePart:sysmeta = /tmp/mmp.output.1220799851455814587.tmp (785 bytes);  [org.dataone.client.rest.RestClient]
20151115-05:14:20: [INFO]: certificate directory: /etc/dataone/client/testClientCerts/ [org.dataone.integration.ContextAwareTestCaseDataone]
20151115-05:14:20: [INFO]: certificate filename: cnDevUNM2 [org.dataone.integration.ContextAwareTestCaseDataone]
20151115-05:14:20: [INFO]: client setup as Subject: CN=urn:node:cnDevUNM2,DC=dataone,DC=org [org.dataone.integration.ContextAwareTestCaseDataone]
20151115-05:14:20: [INFO]: creating a test object.  pid = testUpdateSystemMetadata_ObsoletedByFail_201531821147283 on https://mn-dev-ucsb-2.test.dataone.org/metacat/d1/mn/v2 [org.dataone.integration.ContextAwareTestCaseDataone]
20151115-05:14:20: [INFO]: SystemMetadata for pid: testUpdateSystemMetadata_ObsoletedByFail_201531821147283
<?xml version="1.0" encoding="UTF-8"?><d1_v2.0:systemMetadata xmlns:d1_v2.0="http://ns.dataone.org/service/types/v2.0" xmlns:d1="http://ns.dataone.org/service/types/v1"><serialVersion>1</serialVersion><identifier>testUpdateSystemMetadata_ObsoletedByFail_201531821147283</identifier><formatId>eml://ecoinformatics.org/eml-2.0.1</formatId><size>17181</size><checksum algorithm="MD5">03ce09c6b4c3efc1681f3023402998a2</checksum><submitter>CN=urn:node:cnDevUNM2,DC=dataone,DC=org</submitter><rightsHolder>CN=testRightsHolder,DC=dataone,DC=org</rightsHolder><accessPolicy><allow><subject>CN=testRightsHolder,DC=dataone,DC=org</subject><permission>changePermission</permission></allow></accessPolicy><dateUploaded>2015-11-15T05:14:20.856+00:00</dateUploaded><dateSysMetadataModified>2015-11-15T05:14:20.856+00:00</dateSysMetadataModified><originMemberNode>urn:node:mnDevUCSB2</originMemberNode><authoritativeMemberNode>urn:node:mnDevUCSB2</authoritativeMemberNode></d1_v2.0:systemMetadata> [org.dataone.integration.ContextAwareTestCaseDataone]
20151115-05:14:22: [INFO]: rest call info: POST https://mn-dev-ucsb-2.test.dataone.org/metacat/d1/mn/v2/object; MMP message has: ParamPart:pid = testUpdateSystemMetadata_ObsoletedByFail_201531821147283; FilePart:object = /tmp/mmp.output.1425519674172456323.tmp (17181 bytes); FilePart:sysmeta = /tmp/mmp.output.7689577373460507957.tmp (982 bytes);  [org.dataone.client.rest.RestClient]
20151115-05:14:22: [INFO]: object created.  pid = testUpdateSystemMetadata_ObsoletedByFail_201531821147283 [org.dataone.integration.ContextAwareTestCaseDataone]
20151115-05:14:32: [INFO]: rest call info: GET https://mn-dev-ucsb-2.test.dataone.org/metacat/d1/mn/v2/meta/testUpdateSystemMetadata_ObsoletedByFail_201531821147280 [org.dataone.client.rest.RestClient]
20151115-05:14:33: [INFO]: rest call info: PUT https://mn-dev-ucsb-2.test.dataone.org/metacat/d1/mn/v2/meta; MMP message has: ParamPart:pid = testUpdateSystemMetadata_ObsoletedByFail_201531821147280; FilePart:sysmeta = /tmp/mmp.output.3134882800542535873.tmp (1089 bytes);  [org.dataone.client.rest.RestClient]
20151115-05:14:33: [INFO]: 
***************** running test for testUpdateSystemMetadata_ObsoletedByFail(...) vs. node: https://mn-dev-unm-2.test.dataone.org/metacat/d1/mn ***************** [org.dataone.integration.ContextAwareTestCaseDataone]
20151115-05:14:33: [INFO]: certificate directory: /etc/dataone/client/testClientCerts/ [org.dataone.integration.ContextAwareTestCaseDataone]
20151115-05:14:33: [INFO]: certificate filename: cnDevUNM2 [org.dataone.integration.ContextAwareTestCaseDataone]
20151115-05:14:33: [INFO]: client setup as Subject: CN=urn:node:cnDevUNM2,DC=dataone,DC=org [org.dataone.integration.ContextAwareTestCaseDataone]
20151115-05:14:33: [INFO]: creating a test object.  pid = testUpdateSystemMetadata_ObsoletedByFail_2015318211433163 on https://mn-dev-unm-2.test.dataone.org/metacat/d1/mn/v2 [org.dataone.integration.ContextAwareTestCaseDataone]
20151115-05:14:33: [INFO]: SystemMetadata for pid: testUpdateSystemMetadata_ObsoletedByFail_2015318211433163
<?xml version="1.0" encoding="UTF-8"?><d1_v2.0:systemMetadata xmlns:d1_v2.0="http://ns.dataone.org/service/types/v2.0" xmlns:d1="http://ns.dataone.org/service/types/v1"><serialVersion>1</serialVersion><identifier>testUpdateSystemMetadata_ObsoletedByFail_2015318211433163</identifier><formatId>eml://ecoinformatics.org/eml-2.0.1</formatId><size>17181</size><checksum algorithm="MD5">03ce09c6b4c3efc1681f3023402998a2</checksum><submitter>CN=urn:node:cnDevUNM2,DC=dataone,DC=org</submitter><rightsHolder>CN=testRightsHolder,DC=dataone,DC=org</rightsHolder><accessPolicy><allow><subject>CN=testRightsHolder,DC=dataone,DC=org</subject><permission>changePermission</permission></allow></accessPolicy><dateUploaded>2015-11-15T05:14:33.181+00:00</dateUploaded><dateSysMetadataModified>2015-11-15T05:14:33.181+00:00</dateSysMetadataModified><originMemberNode>urn:node:mnDevUNM2</originMemberNode><authoritativeMemberNode>urn:node:mnDevUNM2</authoritativeMemberNode></d1_v2.0:systemMetadata> [org.dataone.integration.ContextAwareTestCaseDataone]
20151115-05:14:34: [INFO]: rest call info: POST https://mn-dev-unm-2.test.dataone.org/metacat/d1/mn/v2/object; MMP message has: ParamPart:pid = testUpdateSystemMetadata_ObsoletedByFail_2015318211433163; FilePart:object = /tmp/mmp.output.1339615009536277541.tmp (17181 bytes); FilePart:sysmeta = /tmp/mmp.output.3008878807370110089.tmp (981 bytes);  [org.dataone.client.rest.RestClient]
20151115-05:14:34: [INFO]: object created.  pid = testUpdateSystemMetadata_ObsoletedByFail_2015318211433163 [org.dataone.integration.ContextAwareTestCaseDataone]
20151115-05:14:45: [INFO]: rest call info: PUT https://mn-dev-unm-2.test.dataone.org/metacat/d1/mn/v2/object/testUpdateSystemMetadata_ObsoletedByFail_2015318211433163; MMP message has: ParamPart:newPid = testUpdateSystemMetadata_ObsoletedByFail_2015318211433165; FilePart:object = /tmp/mmp.output.4825309629210354861.tmp (17181 bytes); FilePart:sysmeta = /tmp/mmp.output.4121444487732942662.tmp (786 bytes);  [org.dataone.client.rest.RestClient]
20151115-05:14:45: [INFO]: certificate directory: /etc/dataone/client/testClientCerts/ [org.dataone.integration.ContextAwareTestCaseDataone]
20151115-05:14:45: [INFO]: certificate filename: cnDevUNM2 [org.dataone.integration.ContextAwareTestCaseDataone]
20151115-05:14:45: [INFO]: client setup as Subject: CN=urn:node:cnDevUNM2,DC=dataone,DC=org [org.dataone.integration.ContextAwareTestCaseDataone]
20151115-05:14:45: [INFO]: creating a test object.  pid = testUpdateSystemMetadata_ObsoletedByFail_2015318211433166 on https://mn-dev-unm-2.test.dataone.org/metacat/d1/mn/v2 [org.dataone.integration.ContextAwareTestCaseDataone]
20151115-05:14:45: [INFO]: SystemMetadata for pid: testUpdateSystemMetadata_ObsoletedByFail_2015318211433166
<?xml version="1.0" encoding="UTF-8"?><d1_v2.0:systemMetadata xmlns:d1_v2.0="http://ns.dataone.org/service/types/v2.0" xmlns:d1="http://ns.dataone.org/service/types/v1"><serialVersion>1</serialVersion><identifier>testUpdateSystemMetadata_ObsoletedByFail_2015318211433166</identifier><formatId>eml://ecoinformatics.org/eml-2.0.1</formatId><size>17181</size><checksum algorithm="MD5">03ce09c6b4c3efc1681f3023402998a2</checksum><submitter>CN=urn:node:cnDevUNM2,DC=dataone,DC=org</submitter><rightsHolder>CN=testRightsHolder,DC=dataone,DC=org</rightsHolder><accessPolicy><allow><subject>CN=testRightsHolder,DC=dataone,DC=org</subject><permission>changePermission</permission></allow></accessPolicy><dateUploaded>2015-11-15T05:14:45.675+00:00</dateUploaded><dateSysMetadataModified>2015-11-15T05:14:45.675+00:00</dateSysMetadataModified><originMemberNode>urn:node:mnDevUNM2</originMemberNode><authoritativeMemberNode>urn:node:mnDevUNM2</authoritativeMemberNode></d1_v2.0:systemMetadata> [org.dataone.integration.ContextAwareTestCaseDataone]
20151115-05:14:46: [INFO]: rest call info: POST https://mn-dev-unm-2.test.dataone.org/metacat/d1/mn/v2/object; MMP message has: ParamPart:pid = testUpdateSystemMetadata_ObsoletedByFail_2015318211433166; FilePart:object = /tmp/mmp.output.3747786743505298907.tmp (17181 bytes); FilePart:sysmeta = /tmp/mmp.output.8276743878677819860.tmp (981 bytes);  [org.dataone.client.rest.RestClient]
20151115-05:14:46: [INFO]: object created.  pid = testUpdateSystemMetadata_ObsoletedByFail_2015318211433166 [org.dataone.integration.ContextAwareTestCaseDataone]
20151115-05:14:56: [INFO]: rest call info: GET https://mn-dev-unm-2.test.dataone.org/metacat/d1/mn/v2/meta/testUpdateSystemMetadata_ObsoletedByFail_2015318211433163 [org.dataone.client.rest.RestClient]
20151115-05:14:57: [INFO]: rest call info: PUT https://mn-dev-unm-2.test.dataone.org/metacat/d1/mn/v2/meta; MMP message has: ParamPart:pid = testUpdateSystemMetadata_ObsoletedByFail_2015318211433163; FilePart:sysmeta = /tmp/mmp.output.2097261880151740507.tmp (1089 bytes);  [org.dataone.client.rest.RestClient]
20151115-05:14:57: [INFO]: **************************************************** [org.dataone.integration.ContextAwareTestCaseDataone]
20151115-05:14:57: [INFO]: ***  context label:   DEV2 [org.dataone.integration.ContextAwareTestCaseDataone]
20151115-05:14:57: [INFO]: **************************************************** [org.dataone.integration.ContextAwareTestCaseDataone]
20151115-05:14:57: [INFO]: **************************************************** [org.dataone.integration.ContextAwareTestCaseDataone]
20151115-05:14:57: [INFO]: rest call info: GET https://mn-dev-ucsb-1.test.dataone.org/metacat/d1/mn/v2/monitor/ping [org.dataone.client.rest.RestClient]
20151115-05:14:57: [INFO]: MN excluded from test: https://mn-dev-ucsb-1.test.dataone.org/metacat/d1/mn [org.dataone.integration.ContextAwareTestCaseDataone]
20151115-05:14:58: [INFO]: rest call info: GET https://mn-dev-ucsb-2.test.dataone.org/metacat/d1/mn/v2/monitor/ping [org.dataone.client.rest.RestClient]
20151115-05:14:58: [INFO]: MN included in test: https://mn-dev-ucsb-2.test.dataone.org/metacat/d1/mn [org.dataone.integration.ContextAwareTestCaseDataone]
20151115-05:14:58: [INFO]: rest call info: GET https://mn-dev-unm-1.test.dataone.org/metacat/d1/mn/v2/monitor/ping [org.dataone.client.rest.RestClient]
20151115-05:14:58: [INFO]: MN excluded from test: https://mn-dev-unm-1.test.dataone.org/metacat/d1/mn [org.dataone.integration.ContextAwareTestCaseDataone]
20151115-05:14:58: [INFO]: rest call info: GET https://mn-dev-unm-2.test.dataone.org/metacat/d1/mn/v2/monitor/ping [org.dataone.client.rest.RestClient]
20151115-05:14:58: [INFO]: MN included in test: https://mn-dev-unm-2.test.dataone.org/metacat/d1/mn [org.dataone.integration.ContextAwareTestCaseDataone]
20151115-05:14:58: [INFO]: 
***************** running test for testUpdateSystemMetadata_MutableObsoletedBy(...) vs. node: https://mn-dev-ucsb-2.test.dataone.org/metacat/d1/mn ***************** [org.dataone.integration.ContextAwareTestCaseDataone]
20151115-05:14:58: [INFO]: certificate directory: /etc/dataone/client/testClientCerts/ [org.dataone.integration.ContextAwareTestCaseDataone]
20151115-05:14:58: [INFO]: certificate filename: cnDevUNM2 [org.dataone.integration.ContextAwareTestCaseDataone]
20151115-05:14:58: [INFO]: client setup as Subject: CN=urn:node:cnDevUNM2,DC=dataone,DC=org [org.dataone.integration.ContextAwareTestCaseDataone]
20151115-05:14:58: [INFO]: creating a test object.  pid = testUpdateSystemMetadata_MutableObsoletedBy_2015318211458564 on https://mn-dev-ucsb-2.test.dataone.org/metacat/d1/mn/v2 [org.dataone.integration.ContextAwareTestCaseDataone]
20151115-05:14:58: [INFO]: SystemMetadata for pid: testUpdateSystemMetadata_MutableObsoletedBy_2015318211458564
<?xml version="1.0" encoding="UTF-8"?><d1_v2.0:systemMetadata xmlns:d1_v2.0="http://ns.dataone.org/service/types/v2.0" xmlns:d1="http://ns.dataone.org/service/types/v1"><serialVersion>1</serialVersion><identifier>testUpdateSystemMetadata_MutableObsoletedBy_2015318211458564</identifier><formatId>eml://ecoinformatics.org/eml-2.0.1</formatId><size>17181</size><checksum algorithm="MD5">03ce09c6b4c3efc1681f3023402998a2</checksum><submitter>CN=urn:node:cnDevUNM2,DC=dataone,DC=org</submitter><rightsHolder>CN=testRightsHolder,DC=dataone,DC=org</rightsHolder><accessPolicy><allow><subject>CN=testRightsHolder,DC=dataone,DC=org</subject><permission>changePermission</permission></allow></accessPolicy><dateUploaded>2015-11-15T05:14:58.579+00:00</dateUploaded><dateSysMetadataModified>2015-11-15T05:14:58.579+00:00</dateSysMetadataModified><originMemberNode>urn:node:mnDevUCSB2</originMemberNode><authoritativeMemberNode>urn:node:mnDevUCSB2</authoritativeMemberNode></d1_v2.0:systemMetadata> [org.dataone.integration.ContextAwareTestCaseDataone]
20151115-05:15:00: [INFO]: rest call info: POST https://mn-dev-ucsb-2.test.dataone.org/metacat/d1/mn/v2/object; MMP message has: ParamPart:pid = testUpdateSystemMetadata_MutableObsoletedBy_2015318211458564; FilePart:object = /tmp/mmp.output.286625391799485169.tmp (17181 bytes); FilePart:sysmeta = /tmp/mmp.output.3593113537640044385.tmp (986 bytes);  [org.dataone.client.rest.RestClient]
20151115-05:15:00: [INFO]: object created.  pid = testUpdateSystemMetadata_MutableObsoletedBy_2015318211458564 [org.dataone.integration.ContextAwareTestCaseDataone]
20151115-05:15:00: [INFO]: certificate directory: /etc/dataone/client/testClientCerts/ [org.dataone.integration.ContextAwareTestCaseDataone]
20151115-05:15:00: [INFO]: certificate filename: cnDevUNM2 [org.dataone.integration.ContextAwareTestCaseDataone]
20151115-05:15:00: [INFO]: client setup as Subject: CN=urn:node:cnDevUNM2,DC=dataone,DC=org [org.dataone.integration.ContextAwareTestCaseDataone]
20151115-05:15:00: [INFO]: creating a test object.  pid = testUpdateSystemMetadata_MutableObsoletedBy_2015318211458566 on https://mn-dev-ucsb-2.test.dataone.org/metacat/d1/mn/v2 [org.dataone.integration.ContextAwareTestCaseDataone]
20151115-05:15:00: [INFO]: SystemMetadata for pid: testUpdateSystemMetadata_MutableObsoletedBy_2015318211458566
<?xml version="1.0" encoding="UTF-8"?><d1_v2.0:systemMetadata xmlns:d1_v2.0="http://ns.dataone.org/service/types/v2.0" xmlns:d1="http://ns.dataone.org/service/types/v1"><serialVersion>1</serialVersion><identifier>testUpdateSystemMetadata_MutableObsoletedBy_2015318211458566</identifier><formatId>eml://ecoinformatics.org/eml-2.0.1</formatId><size>17181</size><checksum algorithm="MD5">03ce09c6b4c3efc1681f3023402998a2</checksum><submitter>CN=urn:node:cnDevUNM2,DC=dataone,DC=org</submitter><rightsHolder>CN=testRightsHolder,DC=dataone,DC=org</rightsHolder><accessPolicy><allow><subject>CN=testRightsHolder,DC=dataone,DC=org</subject><permission>changePermission</permission></allow></accessPolicy><dateUploaded>2015-11-15T05:15:00.225+00:00</dateUploaded><dateSysMetadataModified>2015-11-15T05:15:00.225+00:00</dateSysMetadataModified><originMemberNode>urn:node:mnDevUCSB2</originMemberNode><authoritativeMemberNode>urn:node:mnDevUCSB2</authoritativeMemberNode></d1_v2.0:systemMetadata> [org.dataone.integration.ContextAwareTestCaseDataone]
20151115-05:15:01: [INFO]: rest call info: POST https://mn-dev-ucsb-2.test.dataone.org/metacat/d1/mn/v2/object; MMP message has: ParamPart:pid = testUpdateSystemMetadata_MutableObsoletedBy_2015318211458566; FilePart:object = /tmp/mmp.output.7218284897224791018.tmp (17181 bytes); FilePart:sysmeta = /tmp/mmp.output.5490136673705597746.tmp (986 bytes);  [org.dataone.client.rest.RestClient]
20151115-05:15:01: [INFO]: object created.  pid = testUpdateSystemMetadata_MutableObsoletedBy_2015318211458566 [org.dataone.integration.ContextAwareTestCaseDataone]
20151115-05:15:12: [INFO]: rest call info: GET https://mn-dev-ucsb-2.test.dataone.org/metacat/d1/mn/v2/meta/testUpdateSystemMetadata_MutableObsoletedBy_2015318211458564 [org.dataone.client.rest.RestClient]
20151115-05:15:18: [INFO]: rest call info: PUT https://mn-dev-ucsb-2.test.dataone.org/metacat/d1/mn/v2/meta; MMP message has: ParamPart:pid = testUpdateSystemMetadata_MutableObsoletedBy_2015318211458564; FilePart:sysmeta = /tmp/mmp.output.43844282828425048.tmp (1097 bytes);  [org.dataone.client.rest.RestClient]
20151115-05:15:18: [INFO]: 
***************** running test for testUpdateSystemMetadata_MutableObsoletedBy(...) vs. node: https://mn-dev-unm-2.test.dataone.org/metacat/d1/mn ***************** [org.dataone.integration.ContextAwareTestCaseDataone]
20151115-05:15:18: [INFO]: certificate directory: /etc/dataone/client/testClientCerts/ [org.dataone.integration.ContextAwareTestCaseDataone]
20151115-05:15:18: [INFO]: certificate filename: cnDevUNM2 [org.dataone.integration.ContextAwareTestCaseDataone]
20151115-05:15:18: [INFO]: client setup as Subject: CN=urn:node:cnDevUNM2,DC=dataone,DC=org [org.dataone.integration.ContextAwareTestCaseDataone]
20151115-05:15:18: [INFO]: creating a test object.  pid = testUpdateSystemMetadata_MutableObsoletedBy_2015318211518207 on https://mn-dev-unm-2.test.dataone.org/metacat/d1/mn/v2 [org.dataone.integration.ContextAwareTestCaseDataone]
20151115-05:15:18: [INFO]: SystemMetadata for pid: testUpdateSystemMetadata_MutableObsoletedBy_2015318211518207
<?xml version="1.0" encoding="UTF-8"?><d1_v2.0:systemMetadata xmlns:d1_v2.0="http://ns.dataone.org/service/types/v2.0" xmlns:d1="http://ns.dataone.org/service/types/v1"><serialVersion>1</serialVersion><identifier>testUpdateSystemMetadata_MutableObsoletedBy_2015318211518207</identifier><formatId>eml://ecoinformatics.org/eml-2.0.1</formatId><size>17181</size><checksum algorithm="MD5">03ce09c6b4c3efc1681f3023402998a2</checksum><submitter>CN=urn:node:cnDevUNM2,DC=dataone,DC=org</submitter><rightsHolder>CN=testRightsHolder,DC=dataone,DC=org</rightsHolder><accessPolicy><allow><subject>CN=testRightsHolder,DC=dataone,DC=org</subject><permission>changePermission</permission></allow></accessPolicy><dateUploaded>2015-11-15T05:15:18.221+00:00</dateUploaded><dateSysMetadataModified>2015-11-15T05:15:18.221+00:00</dateSysMetadataModified><originMemberNode>urn:node:mnDevUNM2</originMemberNode><authoritativeMemberNode>urn:node:mnDevUNM2</authoritativeMemberNode></d1_v2.0:systemMetadata> [org.dataone.integration.ContextAwareTestCaseDataone]
20151115-05:15:19: [INFO]: rest call info: POST https://mn-dev-unm-2.test.dataone.org/metacat/d1/mn/v2/object; MMP message has: ParamPart:pid = testUpdateSystemMetadata_MutableObsoletedBy_2015318211518207; FilePart:object = /tmp/mmp.output.4262423526912991006.tmp (17181 bytes); FilePart:sysmeta = /tmp/mmp.output.4534255578188135367.tmp (984 bytes);  [org.dataone.client.rest.RestClient]
20151115-05:15:19: [INFO]: object created.  pid = testUpdateSystemMetadata_MutableObsoletedBy_2015318211518207 [org.dataone.integration.ContextAwareTestCaseDataone]
20151115-05:15:19: [INFO]: certificate directory: /etc/dataone/client/testClientCerts/ [org.dataone.integration.ContextAwareTestCaseDataone]
20151115-05:15:19: [INFO]: certificate filename: cnDevUNM2 [org.dataone.integration.ContextAwareTestCaseDataone]
20151115-05:15:19: [INFO]: client setup as Subject: CN=urn:node:cnDevUNM2,DC=dataone,DC=org [org.dataone.integration.ContextAwareTestCaseDataone]
20151115-05:15:19: [INFO]: creating a test object.  pid = testUpdateSystemMetadata_MutableObsoletedBy_2015318211518209 on https://mn-dev-unm-2.test.dataone.org/metacat/d1/mn/v2 [org.dataone.integration.ContextAwareTestCaseDataone]
20151115-05:15:19: [INFO]: SystemMetadata for pid: testUpdateSystemMetadata_MutableObsoletedBy_2015318211518209
<?xml version="1.0" encoding="UTF-8"?><d1_v2.0:systemMetadata xmlns:d1_v2.0="http://ns.dataone.org/service/types/v2.0" xmlns:d1="http://ns.dataone.org/service/types/v1"><serialVersion>1</serialVersion><identifier>testUpdateSystemMetadata_MutableObsoletedBy_2015318211518209</identifier><formatId>eml://ecoinformatics.org/eml-2.0.1</formatId><size>17181</size><checksum algorithm="MD5">03ce09c6b4c3efc1681f3023402998a2</checksum><submitter>CN=urn:node:cnDevUNM2,DC=dataone,DC=org</submitter><rightsHolder>CN=testRightsHolder,DC=dataone,DC=org</rightsHolder><accessPolicy><allow><subject>CN=testRightsHolder,DC=dataone,DC=org</subject><permission>changePermission</permission></allow></accessPolicy><dateUploaded>2015-11-15T05:15:19.514+00:00</dateUploaded><dateSysMetadataModified>2015-11-15T05:15:19.514+00:00</dateSysMetadataModified><originMemberNode>urn:node:mnDevUNM2</originMemberNode><authoritativeMemberNode>urn:node:mnDevUNM2</authoritativeMemberNode></d1_v2.0:systemMetadata> [org.dataone.integration.ContextAwareTestCaseDataone]
20151115-05:15:20: [INFO]: rest call info: POST https://mn-dev-unm-2.test.dataone.org/metacat/d1/mn/v2/object; MMP message has: ParamPart:pid = testUpdateSystemMetadata_MutableObsoletedBy_2015318211518209; FilePart:object = /tmp/mmp.output.8214577955697623112.tmp (17181 bytes); FilePart:sysmeta = /tmp/mmp.output.6072737547664093995.tmp (984 bytes);  [org.dataone.client.rest.RestClient]
20151115-05:15:20: [INFO]: object created.  pid = testUpdateSystemMetadata_MutableObsoletedBy_2015318211518209 [org.dataone.integration.ContextAwareTestCaseDataone]
20151115-05:15:30: [INFO]: rest call info: GET https://mn-dev-unm-2.test.dataone.org/metacat/d1/mn/v2/meta/testUpdateSystemMetadata_MutableObsoletedBy_2015318211518207 [org.dataone.client.rest.RestClient]
20151115-05:15:35: [INFO]: rest call info: PUT https://mn-dev-unm-2.test.dataone.org/metacat/d1/mn/v2/meta; MMP message has: ParamPart:pid = testUpdateSystemMetadata_MutableObsoletedBy_2015318211518207; FilePart:sysmeta = /tmp/mmp.output.8160753187665179440.tmp (1095 bytes);  [org.dataone.client.rest.RestClient]
20151115-05:15:35: [INFO]: **************************************************** [org.dataone.integration.ContextAwareTestCaseDataone]
20151115-05:15:35: [INFO]: ***  context label:   DEV2 [org.dataone.integration.ContextAwareTestCaseDataone]
20151115-05:15:35: [INFO]: **************************************************** [org.dataone.integration.ContextAwareTestCaseDataone]
20151115-05:15:35: [INFO]: **************************************************** [org.dataone.integration.ContextAwareTestCaseDataone]
20151115-05:15:36: [INFO]: rest call info: GET https://mn-dev-ucsb-1.test.dataone.org/metacat/d1/mn/v2/monitor/ping [org.dataone.client.rest.RestClient]
20151115-05:15:36: [INFO]: MN excluded from test: https://mn-dev-ucsb-1.test.dataone.org/metacat/d1/mn [org.dataone.integration.ContextAwareTestCaseDataone]
20151115-05:15:36: [INFO]: rest call info: GET https://mn-dev-ucsb-2.test.dataone.org/metacat/d1/mn/v2/monitor/ping [org.dataone.client.rest.RestClient]
20151115-05:15:36: [INFO]: MN included in test: https://mn-dev-ucsb-2.test.dataone.org/metacat/d1/mn [org.dataone.integration.ContextAwareTestCaseDataone]
20151115-05:15:36: [INFO]: rest call info: GET https://mn-dev-unm-1.test.dataone.org/metacat/d1/mn/v2/monitor/ping [org.dataone.client.rest.RestClient]
20151115-05:15:36: [INFO]: MN excluded from test: https://mn-dev-unm-1.test.dataone.org/metacat/d1/mn [org.dataone.integration.ContextAwareTestCaseDataone]
20151115-05:15:36: [INFO]: rest call info: GET https://mn-dev-unm-2.test.dataone.org/metacat/d1/mn/v2/monitor/ping [org.dataone.client.rest.RestClient]
20151115-05:15:36: [INFO]: MN included in test: https://mn-dev-unm-2.test.dataone.org/metacat/d1/mn [org.dataone.integration.ContextAwareTestCaseDataone]
20151115-05:15:36: [INFO]: 
***************** running test for testUpdateSystemMetadata_MutableObsoletes(...) vs. node: https://mn-dev-ucsb-2.test.dataone.org/metacat/d1/mn ***************** [org.dataone.integration.ContextAwareTestCaseDataone]
20151115-05:15:36: [INFO]: certificate directory: /etc/dataone/client/testClientCerts/ [org.dataone.integration.ContextAwareTestCaseDataone]
20151115-05:15:36: [INFO]: certificate filename: cnDevUNM2 [org.dataone.integration.ContextAwareTestCaseDataone]
20151115-05:15:36: [INFO]: client setup as Subject: CN=urn:node:cnDevUNM2,DC=dataone,DC=org [org.dataone.integration.ContextAwareTestCaseDataone]
20151115-05:15:36: [INFO]: creating a test object.  pid = testUpdateSystemMetadata_MutableObsoletes_2015318211536655 on https://mn-dev-ucsb-2.test.dataone.org/metacat/d1/mn/v2 [org.dataone.integration.ContextAwareTestCaseDataone]
20151115-05:15:36: [INFO]: SystemMetadata for pid: testUpdateSystemMetadata_MutableObsoletes_2015318211536655
<?xml version="1.0" encoding="UTF-8"?><d1_v2.0:systemMetadata xmlns:d1_v2.0="http://ns.dataone.org/service/types/v2.0" xmlns:d1="http://ns.dataone.org/service/types/v1"><serialVersion>1</serialVersion><identifier>testUpdateSystemMetadata_MutableObsoletes_2015318211536655</identifier><formatId>eml://ecoinformatics.org/eml-2.0.1</formatId><size>17181</size><checksum algorithm="MD5">03ce09c6b4c3efc1681f3023402998a2</checksum><submitter>CN=urn:node:cnDevUNM2,DC=dataone,DC=org</submitter><rightsHolder>CN=testRightsHolder,DC=dataone,DC=org</rightsHolder><accessPolicy><allow><subject>CN=testRightsHolder,DC=dataone,DC=org</subject><permission>changePermission</permission></allow></accessPolicy><dateUploaded>2015-11-15T05:15:36.668+00:00</dateUploaded><dateSysMetadataModified>2015-11-15T05:15:36.668+00:00</dateSysMetadataModified><originMemberNode>urn:node:mnDevUCSB2</originMemberNode><authoritativeMemberNode>urn:node:mnDevUCSB2</authoritativeMemberNode></d1_v2.0:systemMetadata> [org.dataone.integration.ContextAwareTestCaseDataone]
20151115-05:15:38: [INFO]: rest call info: POST https://mn-dev-ucsb-2.test.dataone.org/metacat/d1/mn/v2/object; MMP message has: ParamPart:pid = testUpdateSystemMetadata_MutableObsoletes_2015318211536655; FilePart:object = /tmp/mmp.output.1508228967479182575.tmp (17181 bytes); FilePart:sysmeta = /tmp/mmp.output.4777269419928318620.tmp (984 bytes);  [org.dataone.client.rest.RestClient]
20151115-05:15:38: [INFO]: object created.  pid = testUpdateSystemMetadata_MutableObsoletes_2015318211536655 [org.dataone.integration.ContextAwareTestCaseDataone]
20151115-05:15:38: [INFO]: certificate directory: /etc/dataone/client/testClientCerts/ [org.dataone.integration.ContextAwareTestCaseDataone]
20151115-05:15:38: [INFO]: certificate filename: cnDevUNM2 [org.dataone.integration.ContextAwareTestCaseDataone]
20151115-05:15:38: [INFO]: client setup as Subject: CN=urn:node:cnDevUNM2,DC=dataone,DC=org [org.dataone.integration.ContextAwareTestCaseDataone]
20151115-05:15:38: [INFO]: creating a test object.  pid = testUpdateSystemMetadata_MutableObsoletes_2015318211536656 on https://mn-dev-ucsb-2.test.dataone.org/metacat/d1/mn/v2 [org.dataone.integration.ContextAwareTestCaseDataone]
20151115-05:15:38: [INFO]: SystemMetadata for pid: testUpdateSystemMetadata_MutableObsoletes_2015318211536656
<?xml version="1.0" encoding="UTF-8"?><d1_v2.0:systemMetadata xmlns:d1_v2.0="http://ns.dataone.org/service/types/v2.0" xmlns:d1="http://ns.dataone.org/service/types/v1"><serialVersion>1</serialVersion><identifier>testUpdateSystemMetadata_MutableObsoletes_2015318211536656</identifier><formatId>eml://ecoinformatics.org/eml-2.0.1</formatId><size>17181</size><checksum algorithm="MD5">03ce09c6b4c3efc1681f3023402998a2</checksum><submitter>CN=urn:node:cnDevUNM2,DC=dataone,DC=org</submitter><rightsHolder>CN=testRightsHolder,DC=dataone,DC=org</rightsHolder><accessPolicy><allow><subject>CN=testRightsHolder,DC=dataone,DC=org</subject><permission>changePermission</permission></allow></accessPolicy><dateUploaded>2015-11-15T05:15:38.071+00:00</dateUploaded><dateSysMetadataModified>2015-11-15T05:15:38.071+00:00</dateSysMetadataModified><originMemberNode>urn:node:mnDevUCSB2</originMemberNode><authoritativeMemberNode>urn:node:mnDevUCSB2</authoritativeMemberNode></d1_v2.0:systemMetadata> [org.dataone.integration.ContextAwareTestCaseDataone]
20151115-05:15:39: [INFO]: rest call info: POST https://mn-dev-ucsb-2.test.dataone.org/metacat/d1/mn/v2/object; MMP message has: ParamPart:pid = testUpdateSystemMetadata_MutableObsoletes_2015318211536656; FilePart:object = /tmp/mmp.output.8822680730286297688.tmp (17181 bytes); FilePart:sysmeta = /tmp/mmp.output.8079108005425781968.tmp (984 bytes);  [org.dataone.client.rest.RestClient]
20151115-05:15:39: [INFO]: object created.  pid = testUpdateSystemMetadata_MutableObsoletes_2015318211536656 [org.dataone.integration.ContextAwareTestCaseDataone]
20151115-05:15:50: [INFO]: rest call info: GET https://mn-dev-ucsb-2.test.dataone.org/metacat/d1/mn/v2/meta/testUpdateSystemMetadata_MutableObsoletes_2015318211536656 [org.dataone.client.rest.RestClient]
20151115-05:15:55: [INFO]: rest call info: PUT https://mn-dev-ucsb-2.test.dataone.org/metacat/d1/mn/v2/meta; MMP message has: ParamPart:pid = testUpdateSystemMetadata_MutableObsoletes_2015318211536656; FilePart:sysmeta = /tmp/mmp.output.3215843669330816168.tmp (1089 bytes);  [org.dataone.client.rest.RestClient]
20151115-05:15:55: [INFO]: 
***************** running test for testUpdateSystemMetadata_MutableObsoletes(...) vs. node: https://mn-dev-unm-2.test.dataone.org/metacat/d1/mn ***************** [org.dataone.integration.ContextAwareTestCaseDataone]
20151115-05:15:55: [INFO]: certificate directory: /etc/dataone/client/testClientCerts/ [org.dataone.integration.ContextAwareTestCaseDataone]
20151115-05:15:55: [INFO]: certificate filename: cnDevUNM2 [org.dataone.integration.ContextAwareTestCaseDataone]
20151115-05:15:55: [INFO]: client setup as Subject: CN=urn:node:cnDevUNM2,DC=dataone,DC=org [org.dataone.integration.ContextAwareTestCaseDataone]
20151115-05:15:55: [INFO]: creating a test object.  pid = testUpdateSystemMetadata_MutableObsoletes_2015318211555640 on https://mn-dev-unm-2.test.dataone.org/metacat/d1/mn/v2 [org.dataone.integration.ContextAwareTestCaseDataone]
20151115-05:15:55: [INFO]: SystemMetadata for pid: testUpdateSystemMetadata_MutableObsoletes_2015318211555640
<?xml version="1.0" encoding="UTF-8"?><d1_v2.0:systemMetadata xmlns:d1_v2.0="http://ns.dataone.org/service/types/v2.0" xmlns:d1="http://ns.dataone.org/service/types/v1"><serialVersion>1</serialVersion><identifier>testUpdateSystemMetadata_MutableObsoletes_2015318211555640</identifier><formatId>eml://ecoinformatics.org/eml-2.0.1</formatId><size>17181</size><checksum algorithm="MD5">03ce09c6b4c3efc1681f3023402998a2</checksum><submitter>CN=urn:node:cnDevUNM2,DC=dataone,DC=org</submitter><rightsHolder>CN=testRightsHolder,DC=dataone,DC=org</rightsHolder><accessPolicy><allow><subject>CN=testRightsHolder,DC=dataone,DC=org</subject><permission>changePermission</permission></allow></accessPolicy><dateUploaded>2015-11-15T05:15:55.652+00:00</dateUploaded><dateSysMetadataModified>2015-11-15T05:15:55.652+00:00</dateSysMetadataModified><originMemberNode>urn:node:mnDevUNM2</originMemberNode><authoritativeMemberNode>urn:node:mnDevUNM2</authoritativeMemberNode></d1_v2.0:systemMetadata> [org.dataone.integration.ContextAwareTestCaseDataone]
20151115-05:15:56: [INFO]: rest call info: POST https://mn-dev-unm-2.test.dataone.org/metacat/d1/mn/v2/object; MMP message has: ParamPart:pid = testUpdateSystemMetadata_MutableObsoletes_2015318211555640; FilePart:object = /tmp/mmp.output.2413530763199201008.tmp (17181 bytes); FilePart:sysmeta = /tmp/mmp.output.6789651153276213880.tmp (982 bytes);  [org.dataone.client.rest.RestClient]
20151115-05:15:56: [INFO]: object created.  pid = testUpdateSystemMetadata_MutableObsoletes_2015318211555640 [org.dataone.integration.ContextAwareTestCaseDataone]
20151115-05:15:56: [INFO]: certificate directory: /etc/dataone/client/testClientCerts/ [org.dataone.integration.ContextAwareTestCaseDataone]
20151115-05:15:56: [INFO]: certificate filename: cnDevUNM2 [org.dataone.integration.ContextAwareTestCaseDataone]
20151115-05:15:56: [INFO]: client setup as Subject: CN=urn:node:cnDevUNM2,DC=dataone,DC=org [org.dataone.integration.ContextAwareTestCaseDataone]
20151115-05:15:56: [INFO]: creating a test object.  pid = testUpdateSystemMetadata_MutableObsoletes_2015318211555641 on https://mn-dev-unm-2.test.dataone.org/metacat/d1/mn/v2 [org.dataone.integration.ContextAwareTestCaseDataone]
20151115-05:15:56: [INFO]: SystemMetadata for pid: testUpdateSystemMetadata_MutableObsoletes_2015318211555641
<?xml version="1.0" encoding="UTF-8"?><d1_v2.0:systemMetadata xmlns:d1_v2.0="http://ns.dataone.org/service/types/v2.0" xmlns:d1="http://ns.dataone.org/service/types/v1"><serialVersion>1</serialVersion><identifier>testUpdateSystemMetadata_MutableObsoletes_2015318211555641</identifier><formatId>eml://ecoinformatics.org/eml-2.0.1</formatId><size>17181</size><checksum algorithm="MD5">03ce09c6b4c3efc1681f3023402998a2</checksum><submitter>CN=urn:node:cnDevUNM2,DC=dataone,DC=org</submitter><rightsHolder>CN=testRightsHolder,DC=dataone,DC=org</rightsHolder><accessPolicy><allow><subject>CN=testRightsHolder,DC=dataone,DC=org</subject><permission>changePermission</permission></allow></accessPolicy><dateUploaded>2015-11-15T05:15:56.781+00:00</dateUploaded><dateSysMetadataModified>2015-11-15T05:15:56.781+00:00</dateSysMetadataModified><originMemberNode>urn:node:mnDevUNM2</originMemberNode><authoritativeMemberNode>urn:node:mnDevUNM2</authoritativeMemberNode></d1_v2.0:systemMetadata> [org.dataone.integration.ContextAwareTestCaseDataone]
20151115-05:15:57: [INFO]: rest call info: POST https://mn-dev-unm-2.test.dataone.org/metacat/d1/mn/v2/object; MMP message has: ParamPart:pid = testUpdateSystemMetadata_MutableObsoletes_2015318211555641; FilePart:object = /tmp/mmp.output.6047849273221496277.tmp (17181 bytes); FilePart:sysmeta = /tmp/mmp.output.2465090183371409173.tmp (982 bytes);  [org.dataone.client.rest.RestClient]
20151115-05:15:57: [INFO]: object created.  pid = testUpdateSystemMetadata_MutableObsoletes_2015318211555641 [org.dataone.integration.ContextAwareTestCaseDataone]
20151115-05:16:07: [INFO]: rest call info: GET https://mn-dev-unm-2.test.dataone.org/metacat/d1/mn/v2/meta/testUpdateSystemMetadata_MutableObsoletes_2015318211555641 [org.dataone.client.rest.RestClient]
20151115-05:16:13: [INFO]: rest call info: PUT https://mn-dev-unm-2.test.dataone.org/metacat/d1/mn/v2/meta; MMP message has: ParamPart:pid = testUpdateSystemMetadata_MutableObsoletes_2015318211555641; FilePart:sysmeta = /tmp/mmp.output.4947857341536283353.tmp (1087 bytes);  [org.dataone.client.rest.RestClient]
20151115-05:16:13: [INFO]: **************************************************** [org.dataone.integration.ContextAwareTestCaseDataone]
20151115-05:16:13: [INFO]: ***  context label:   DEV2 [org.dataone.integration.ContextAwareTestCaseDataone]
20151115-05:16:13: [INFO]: **************************************************** [org.dataone.integration.ContextAwareTestCaseDataone]
20151115-05:16:13: [INFO]: **************************************************** [org.dataone.integration.ContextAwareTestCaseDataone]
20151115-05:16:13: [INFO]: rest call info: GET https://mn-dev-ucsb-1.test.dataone.org/metacat/d1/mn/v2/monitor/ping [org.dataone.client.rest.RestClient]
20151115-05:16:13: [INFO]: MN excluded from test: https://mn-dev-ucsb-1.test.dataone.org/metacat/d1/mn [org.dataone.integration.ContextAwareTestCaseDataone]
20151115-05:16:13: [INFO]: rest call info: GET https://mn-dev-ucsb-2.test.dataone.org/metacat/d1/mn/v2/monitor/ping [org.dataone.client.rest.RestClient]
20151115-05:16:13: [INFO]: MN included in test: https://mn-dev-ucsb-2.test.dataone.org/metacat/d1/mn [org.dataone.integration.ContextAwareTestCaseDataone]
20151115-05:16:14: [INFO]: rest call info: GET https://mn-dev-unm-1.test.dataone.org/metacat/d1/mn/v2/monitor/ping [org.dataone.client.rest.RestClient]
20151115-05:16:14: [INFO]: MN excluded from test: https://mn-dev-unm-1.test.dataone.org/metacat/d1/mn [org.dataone.integration.ContextAwareTestCaseDataone]
20151115-05:16:14: [INFO]: rest call info: GET https://mn-dev-unm-2.test.dataone.org/metacat/d1/mn/v2/monitor/ping [org.dataone.client.rest.RestClient]
20151115-05:16:14: [INFO]: MN included in test: https://mn-dev-unm-2.test.dataone.org/metacat/d1/mn [org.dataone.integration.ContextAwareTestCaseDataone]
20151115-05:16:14: [INFO]: 
***************** running test for testUpdateSystemMetadata_CNCertNonAuthMN(...) vs. node: https://mn-dev-ucsb-2.test.dataone.org/metacat/d1/mn ***************** [org.dataone.integration.ContextAwareTestCaseDataone]
20151115-05:16:14: [INFO]: rest call info: GET https://cn-dev-ucsb-2.test.dataone.org/cn/v2/node [org.dataone.client.rest.RestClient]
Tests run: 14, Failures: 1, Errors: 0, Skipped: 1, Time elapsed: 388.804 sec <<< FAILURE!

Results :

Failed tests: 
  testRegisterSystemMetadata_dateModified(org.dataone.integration.it.apiTests.MNSystemMetadataMutabilityIt): Unable to fetch node list from CN: https://cn-dev-ucsb-2.test.dataone.org/cn/v2
  testSetReplicationStatus_dateModified(org.dataone.integration.it.apiTests.MNSystemMetadataMutabilityIt): Unable to fetch node list from CN: https://cn-dev-ucsb-2.test.dataone.org/cn/v2
  testSetReplicationMetadata_dateModified(org.dataone.integration.it.apiTests.MNSystemMetadataMutabilityIt): Unable to fetch node list from CN: https://cn-dev-ucsb-2.test.dataone.org/cn/v2
  testDeleteReplicationMetadata_dateModified(org.dataone.integration.it.apiTests.MNSystemMetadataMutabilityIt): Unable to fetch node list from CN: https://cn-dev-ucsb-2.test.dataone.org/cn/v2
  testUpdateSystemMetadata_CNCertNonAuthMN(org.dataone.integration.it.apiTests.MNUpdateSystemMetadataIT): Test setup failed. Couldn't create object: GET https://cn-dev-ucsb-2.test.dataone.org/cn/v2/node : ServiceFailure: -1: 500: Internal Server Error: Deserializing Text/Plain: Just providing message body:

Tests run: 18, Failures: 5, Errors: 0, Skipped: 1

[WARNING] File encoding has not been set, using platform encoding UTF-8, i.e. build is platform dependent!
[JENKINS] Recording test results
[INFO] 
[INFO] --- maven-failsafe-plugin:2.8.1:verify (verify) @ d1_integration ---
[INFO] Failsafe report directory: /var/lib/jenkins/jobs/d1_integration_DEV2_mn_sysmeta_mutability/workspace/target/failsafe-reports
[WARNING] File encoding has not been set, using platform encoding UTF-8, i.e. build is platform dependent!
[ERROR] There are test failures.

Please refer to /var/lib/jenkins/jobs/d1_integration_DEV2_mn_sysmeta_mutability/workspace/target/failsafe-reports for the individual test results.
[JENKINS] Recording test results
Notifying upstream projects of job completion
Join notifier requires a CauseAction
[INFO] ------------------------------------------------------------------------
[INFO] BUILD SUCCESS
[INFO] ------------------------------------------------------------------------
[INFO] Total time: 7:05.707s
[INFO] Finished at: Sun Nov 15 05:16:15 UTC 2015
[INFO] Final Memory: 46M/626M
[INFO] ------------------------------------------------------------------------
Waiting for Jenkins to finish collecting data
[JENKINS] Archiving /var/lib/jenkins/jobs/d1_integration_DEV2_mn_sysmeta_mutability/workspace/pom.xml to org.dataone/d1_integration/2.0-SNAPSHOT/d1_integration-2.0-SNAPSHOT.pom
channel stopped
Notifying upstream projects of job completion
Warning: you have no plugins providing access control for builds, so falling back to legacy behavior of permitting any downstream builds to be triggered
Finished: UNSTABLE