UnstableConsole Output

Skipping 186 KB.. Full Log
ers.java:31)
	at org.junit.runners.BlockJUnit4ClassRunner.runChild(BlockJUnit4ClassRunner.java:76)
	at org.junit.runners.BlockJUnit4ClassRunner.runChild(BlockJUnit4ClassRunner.java:50)
	at org.junit.runners.ParentRunner$3.run(ParentRunner.java:193)
	at org.junit.runners.ParentRunner$1.schedule(ParentRunner.java:52)
	at org.junit.runners.ParentRunner.runChildren(ParentRunner.java:191)
	at org.junit.runners.ParentRunner.access$000(ParentRunner.java:42)
	at org.junit.runners.ParentRunner$2.evaluate(ParentRunner.java:184)
	at org.junit.runners.ParentRunner.run(ParentRunner.java:236)
	at org.apache.maven.surefire.junit4.JUnit4TestSet.execute(JUnit4TestSet.java:53)
	at org.apache.maven.surefire.junit4.JUnit4Provider.executeTestSet(JUnit4Provider.java:123)
	at org.apache.maven.surefire.junit4.JUnit4Provider.invoke(JUnit4Provider.java:104)
	at sun.reflect.NativeMethodAccessorImpl.invoke0(Native Method)
	at sun.reflect.NativeMethodAccessorImpl.invoke(NativeMethodAccessorImpl.java:57)
	at sun.reflect.DelegatingMethodAccessorImpl.invoke(DelegatingMethodAccessorImpl.java:43)
	at java.lang.reflect.Method.invoke(Method.java:606)
	at org.apache.maven.surefire.util.ReflectionUtils.invokeMethodWithArray(ReflectionUtils.java:164)
	at org.apache.maven.surefire.booter.ProviderFactory$ProviderProxy.invoke(ProviderFactory.java:110)
	at org.apache.maven.surefire.booter.SurefireStarter.invokeProvider(SurefireStarter.java:175)
	at org.apache.maven.surefire.booter.SurefireStarter.runSuitesInProcessWhenForked(SurefireStarter.java:107)
	at org.apache.maven.surefire.booter.ForkedBooter.main(ForkedBooter.java:68)
Caused by: org.apache.commons.configuration.ConfigurationException: Cannot locate configuration source null
	at org.apache.commons.configuration.AbstractFileConfiguration.load(AbstractFileConfiguration.java:217)
	at org.apache.commons.configuration.AbstractFileConfiguration.load(AbstractFileConfiguration.java:197)
	at org.apache.commons.configuration.AbstractFileConfiguration.<init>(AbstractFileConfiguration.java:181)
	at org.apache.commons.configuration.PropertiesConfiguration.<init>(PropertiesConfiguration.java:269)
	at org.dataone.configuration.TestSettings.loadConfigurationFile(TestSettings.java:199)
	at org.dataone.configuration.TestSettings.getConfiguration(TestSettings.java:69)
	... 38 more
20151114-05:09:29: [ERROR]: Problem loading testing configuration at: 'null':: Cannot locate configuration source null [org.dataone.configuration.TestSettings]
20151114-05:09:29: [ERROR]: General Problem loading TestSettings. InvocationTargetException: null [org.dataone.configuration.Settings]
java.lang.reflect.InvocationTargetException
	at sun.reflect.NativeMethodAccessorImpl.invoke0(Native Method)
	at sun.reflect.NativeMethodAccessorImpl.invoke(NativeMethodAccessorImpl.java:57)
	at sun.reflect.DelegatingMethodAccessorImpl.invoke(DelegatingMethodAccessorImpl.java:43)
	at java.lang.reflect.Method.invoke(Method.java:606)
	at org.dataone.configuration.Settings.loadTestConfigurations(Settings.java:151)
	at org.dataone.configuration.Settings.getConfiguration(Settings.java:87)
	at org.dataone.configuration.Settings.getResetConfiguration(Settings.java:123)
	at org.dataone.configuration.TestSettingsTest.testContextSafetyOnError(TestSettingsTest.java:209)
	at sun.reflect.NativeMethodAccessorImpl.invoke0(Native Method)
	at sun.reflect.NativeMethodAccessorImpl.invoke(NativeMethodAccessorImpl.java:57)
	at sun.reflect.DelegatingMethodAccessorImpl.invoke(DelegatingMethodAccessorImpl.java:43)
	at java.lang.reflect.Method.invoke(Method.java:606)
	at org.junit.runners.model.FrameworkMethod$1.runReflectiveCall(FrameworkMethod.java:44)
	at org.junit.internal.runners.model.ReflectiveCallable.run(ReflectiveCallable.java:15)
	at org.junit.runners.model.FrameworkMethod.invokeExplosively(FrameworkMethod.java:41)
	at org.junit.internal.runners.statements.InvokeMethod.evaluate(InvokeMethod.java:20)
	at org.junit.internal.runners.statements.RunBefores.evaluate(RunBefores.java:28)
	at org.junit.internal.runners.statements.RunAfters.evaluate(RunAfters.java:31)
	at org.junit.runners.BlockJUnit4ClassRunner.runChild(BlockJUnit4ClassRunner.java:76)
	at org.junit.runners.BlockJUnit4ClassRunner.runChild(BlockJUnit4ClassRunner.java:50)
	at org.junit.runners.ParentRunner$3.run(ParentRunner.java:193)
	at org.junit.runners.ParentRunner$1.schedule(ParentRunner.java:52)
	at org.junit.runners.ParentRunner.runChildren(ParentRunner.java:191)
	at org.junit.runners.ParentRunner.access$000(ParentRunner.java:42)
	at org.junit.runners.ParentRunner$2.evaluate(ParentRunner.java:184)
	at org.junit.runners.ParentRunner.run(ParentRunner.java:236)
	at org.apache.maven.surefire.junit4.JUnit4TestSet.execute(JUnit4TestSet.java:53)
	at org.apache.maven.surefire.junit4.JUnit4Provider.executeTestSet(JUnit4Provider.java:123)
	at org.apache.maven.surefire.junit4.JUnit4Provider.invoke(JUnit4Provider.java:104)
	at sun.reflect.NativeMethodAccessorImpl.invoke0(Native Method)
	at sun.reflect.NativeMethodAccessorImpl.invoke(NativeMethodAccessorImpl.java:57)
	at sun.reflect.DelegatingMethodAccessorImpl.invoke(DelegatingMethodAccessorImpl.java:43)
	at java.lang.reflect.Method.invoke(Method.java:606)
	at org.apache.maven.surefire.util.ReflectionUtils.invokeMethodWithArray(ReflectionUtils.java:164)
	at org.apache.maven.surefire.booter.ProviderFactory$ProviderProxy.invoke(ProviderFactory.java:110)
	at org.apache.maven.surefire.booter.SurefireStarter.invokeProvider(SurefireStarter.java:175)
	at org.apache.maven.surefire.booter.SurefireStarter.runSuitesInProcessWhenForked(SurefireStarter.java:107)
	at org.apache.maven.surefire.booter.ForkedBooter.main(ForkedBooter.java:68)
Caused by: org.apache.commons.configuration.ConfigurationException: Cannot locate configuration source null
	at org.apache.commons.configuration.AbstractFileConfiguration.load(AbstractFileConfiguration.java:217)
	at org.apache.commons.configuration.AbstractFileConfiguration.load(AbstractFileConfiguration.java:197)
	at org.apache.commons.configuration.AbstractFileConfiguration.<init>(AbstractFileConfiguration.java:181)
	at org.apache.commons.configuration.PropertiesConfiguration.<init>(PropertiesConfiguration.java:269)
	at org.dataone.configuration.TestSettings.loadConfigurationFile(TestSettings.java:199)
	at org.dataone.configuration.TestSettings.getConfiguration(TestSettings.java:69)
	... 38 more
20151114-05:09:29: [ERROR]: Problem loading testing configuration at: 'null':: Cannot locate configuration source null [org.dataone.configuration.TestSettings]
20151114-05:09:29: [ERROR]: General Problem loading TestSettings. InvocationTargetException: null [org.dataone.configuration.Settings]
java.lang.reflect.InvocationTargetException
	at sun.reflect.NativeMethodAccessorImpl.invoke0(Native Method)
	at sun.reflect.NativeMethodAccessorImpl.invoke(NativeMethodAccessorImpl.java:57)
	at sun.reflect.DelegatingMethodAccessorImpl.invoke(DelegatingMethodAccessorImpl.java:43)
	at java.lang.reflect.Method.invoke(Method.java:606)
	at org.dataone.configuration.Settings.loadTestConfigurations(Settings.java:151)
	at org.dataone.configuration.Settings.getConfiguration(Settings.java:87)
	at org.dataone.configuration.Settings.getResetConfiguration(Settings.java:123)
	at org.dataone.configuration.TestSettingsTest.testContextSafetyOnError(TestSettingsTest.java:211)
	at sun.reflect.NativeMethodAccessorImpl.invoke0(Native Method)
	at sun.reflect.NativeMethodAccessorImpl.invoke(NativeMethodAccessorImpl.java:57)
	at sun.reflect.DelegatingMethodAccessorImpl.invoke(DelegatingMethodAccessorImpl.java:43)
	at java.lang.reflect.Method.invoke(Method.java:606)
	at org.junit.runners.model.FrameworkMethod$1.runReflectiveCall(FrameworkMethod.java:44)
	at org.junit.internal.runners.model.ReflectiveCallable.run(ReflectiveCallable.java:15)
	at org.junit.runners.model.FrameworkMethod.invokeExplosively(FrameworkMethod.java:41)
	at org.junit.internal.runners.statements.InvokeMethod.evaluate(InvokeMethod.java:20)
	at org.junit.internal.runners.statements.RunBefores.evaluate(RunBefores.java:28)
	at org.junit.internal.runners.statements.RunAfters.evaluate(RunAfters.java:31)
	at org.junit.runners.BlockJUnit4ClassRunner.runChild(BlockJUnit4ClassRunner.java:76)
	at org.junit.runners.BlockJUnit4ClassRunner.runChild(BlockJUnit4ClassRunner.java:50)
	at org.junit.runners.ParentRunner$3.run(ParentRunner.java:193)
	at org.junit.runners.ParentRunner$1.schedule(ParentRunner.java:52)
	at org.junit.runners.ParentRunner.runChildren(ParentRunner.java:191)
	at org.junit.runners.ParentRunner.access$000(ParentRunner.java:42)
	at org.junit.runners.ParentRunner$2.evaluate(ParentRunner.java:184)
	at org.junit.runners.ParentRunner.run(ParentRunner.java:236)
	at org.apache.maven.surefire.junit4.JUnit4TestSet.execute(JUnit4TestSet.java:53)
	at org.apache.maven.surefire.junit4.JUnit4Provider.executeTestSet(JUnit4Provider.java:123)
	at org.apache.maven.surefire.junit4.JUnit4Provider.invoke(JUnit4Provider.java:104)
	at sun.reflect.NativeMethodAccessorImpl.invoke0(Native Method)
	at sun.reflect.NativeMethodAccessorImpl.invoke(NativeMethodAccessorImpl.java:57)
	at sun.reflect.DelegatingMethodAccessorImpl.invoke(DelegatingMethodAccessorImpl.java:43)
	at java.lang.reflect.Method.invoke(Method.java:606)
	at org.apache.maven.surefire.util.ReflectionUtils.invokeMethodWithArray(ReflectionUtils.java:164)
	at org.apache.maven.surefire.booter.ProviderFactory$ProviderProxy.invoke(ProviderFactory.java:110)
	at org.apache.maven.surefire.booter.SurefireStarter.invokeProvider(SurefireStarter.java:175)
	at org.apache.maven.surefire.booter.SurefireStarter.runSuitesInProcessWhenForked(SurefireStarter.java:107)
	at org.apache.maven.surefire.booter.ForkedBooter.main(ForkedBooter.java:68)
Caused by: org.apache.commons.configuration.ConfigurationException: Cannot locate configuration source null
	at org.apache.commons.configuration.AbstractFileConfiguration.load(AbstractFileConfiguration.java:217)
	at org.apache.commons.configuration.AbstractFileConfiguration.load(AbstractFileConfiguration.java:197)
	at org.apache.commons.configuration.AbstractFileConfiguration.<init>(AbstractFileConfiguration.java:181)
	at org.apache.commons.configuration.PropertiesConfiguration.<init>(PropertiesConfiguration.java:269)
	at org.dataone.configuration.TestSettings.loadConfigurationFile(TestSettings.java:199)
	at org.dataone.configuration.TestSettings.getConfiguration(TestSettings.java:69)
	... 38 more
Tests run: 11, Failures: 0, Errors: 0, Skipped: 1, Time elapsed: 0.096 sec
Running org.dataone.client.PoolingHttpClientConnectionManagerTest
Tests run: 2, Failures: 0, Errors: 0, Skipped: 1, Time elapsed: 0 sec
Running org.dataone.client.CNRestURLTest
Tests run: 9, Failures: 0, Errors: 0, Skipped: 8, Time elapsed: 0.014 sec

Results :

Tests run: 35, Failures: 0, Errors: 0, Skipped: 12

[JENKINS] Recording test results
[INFO] 
[INFO] --- maven-antrun-plugin:1.3:run (execution1) @ d1_integration ---
[INFO] Executing tasks
     [copy] Copying 236 files to /var/lib/jenkins/jobs/d1_integration_DEV2_mn_sysmeta_mutability/workspace/target/classes
     [copy] Copying 3 files to /var/lib/jenkins/jobs/d1_integration_DEV2_mn_sysmeta_mutability/workspace/target/d1_integration-2.0-SNAPSHOT/org/dataone/integration/webTest
[INFO] Executed tasks
[INFO] 
[INFO] --- maven-dependency-plugin:2.3:unpack-dependencies (jetty-classpath) @ d1_integration ---
[INFO] Unpacking /var/lib/jenkins/.m2/repository/org/eclipse/jetty/orbit/org.apache.jasper.glassfish/2.2.2.v201112011158/org.apache.jasper.glassfish-2.2.2.v201112011158.jar to /var/lib/jenkins/jobs/d1_integration_DEV2_mn_sysmeta_mutability/workspace/target/d1_integration-2.0-SNAPSHOT with includes "" and excludes ""
[INFO] Unpacking /var/lib/jenkins/.m2/repository/org/slf4j/slf4j-simple/1.6.4/slf4j-simple-1.6.4.jar to /var/lib/jenkins/jobs/d1_integration_DEV2_mn_sysmeta_mutability/workspace/target/d1_integration-2.0-SNAPSHOT with includes "" and excludes ""
[INFO] Unpacking /var/lib/jenkins/.m2/repository/org/eclipse/jetty/jetty-websocket/8.1.15.v20140411/jetty-websocket-8.1.15.v20140411.jar to /var/lib/jenkins/jobs/d1_integration_DEV2_mn_sysmeta_mutability/workspace/target/d1_integration-2.0-SNAPSHOT with includes "" and excludes ""
[INFO] Unpacking /var/lib/jenkins/.m2/repository/org/eclipse/jetty/orbit/javax.security.auth.message/1.0.0.v201108011116/javax.security.auth.message-1.0.0.v201108011116.jar to /var/lib/jenkins/jobs/d1_integration_DEV2_mn_sysmeta_mutability/workspace/target/d1_integration-2.0-SNAPSHOT with includes "" and excludes ""
[INFO] Unpacking /var/lib/jenkins/.m2/repository/org/eclipse/jetty/orbit/javax.servlet.jsp.jstl/1.2.0.v201105211821/javax.servlet.jsp.jstl-1.2.0.v201105211821.jar to /var/lib/jenkins/jobs/d1_integration_DEV2_mn_sysmeta_mutability/workspace/target/d1_integration-2.0-SNAPSHOT with includes "" and excludes ""
[INFO] Unpacking /var/lib/jenkins/.m2/repository/org/eclipse/jetty/orbit/com.sun.el/2.2.0.v201108011116/com.sun.el-2.2.0.v201108011116.jar to /var/lib/jenkins/jobs/d1_integration_DEV2_mn_sysmeta_mutability/workspace/target/d1_integration-2.0-SNAPSHOT with includes "" and excludes ""
[INFO] Unpacking /var/lib/jenkins/.m2/repository/org/eclipse/jetty/orbit/javax.mail.glassfish/1.4.1.v201005082020/javax.mail.glassfish-1.4.1.v201005082020.jar to /var/lib/jenkins/jobs/d1_integration_DEV2_mn_sysmeta_mutability/workspace/target/d1_integration-2.0-SNAPSHOT with includes "" and excludes ""
[INFO] Unpacking /var/lib/jenkins/.m2/repository/org/slf4j/slf4j-api/1.6.4/slf4j-api-1.6.4.jar to /var/lib/jenkins/jobs/d1_integration_DEV2_mn_sysmeta_mutability/workspace/target/d1_integration-2.0-SNAPSHOT with includes "" and excludes ""
[INFO] Unpacking /var/lib/jenkins/.m2/repository/org/eclipse/jetty/jetty-io/8.1.15.v20140411/jetty-io-8.1.15.v20140411.jar to /var/lib/jenkins/jobs/d1_integration_DEV2_mn_sysmeta_mutability/workspace/target/d1_integration-2.0-SNAPSHOT with includes "" and excludes ""
[INFO] Unpacking /var/lib/jenkins/.m2/repository/org/eclipse/jetty/orbit/javax.servlet.jsp/2.2.0.v201112011158/javax.servlet.jsp-2.2.0.v201112011158.jar to /var/lib/jenkins/jobs/d1_integration_DEV2_mn_sysmeta_mutability/workspace/target/d1_integration-2.0-SNAPSHOT with includes "" and excludes ""
[INFO] Unpacking /var/lib/jenkins/.m2/repository/org/eclipse/jetty/aggregate/jetty-all-server/8.1.15.v20140411/jetty-all-server-8.1.15.v20140411.jar to /var/lib/jenkins/jobs/d1_integration_DEV2_mn_sysmeta_mutability/workspace/target/d1_integration-2.0-SNAPSHOT with includes "" and excludes ""
[INFO] Unpacking /var/lib/jenkins/.m2/repository/org/eclipse/jetty/jetty-jsp/8.1.15.v20140411/jetty-jsp-8.1.15.v20140411.jar to /var/lib/jenkins/jobs/d1_integration_DEV2_mn_sysmeta_mutability/workspace/target/d1_integration-2.0-SNAPSHOT with includes "" and excludes ""
[INFO] Unpacking /var/lib/jenkins/.m2/repository/org/eclipse/jetty/orbit/org.apache.taglibs.standard.glassfish/1.2.0.v201112081803/org.apache.taglibs.standard.glassfish-1.2.0.v201112081803.jar to /var/lib/jenkins/jobs/d1_integration_DEV2_mn_sysmeta_mutability/workspace/target/d1_integration-2.0-SNAPSHOT with includes "" and excludes ""
[INFO] Unpacking /var/lib/jenkins/.m2/repository/javax/servlet/servlet-api/2.5/servlet-api-2.5.jar to /var/lib/jenkins/jobs/d1_integration_DEV2_mn_sysmeta_mutability/workspace/target/d1_integration-2.0-SNAPSHOT with includes "" and excludes ""
[INFO] Unpacking /var/lib/jenkins/.m2/repository/org/eclipse/jetty/orbit/javax.activation/1.1.0.v201105071233/javax.activation-1.1.0.v201105071233.jar to /var/lib/jenkins/jobs/d1_integration_DEV2_mn_sysmeta_mutability/workspace/target/d1_integration-2.0-SNAPSHOT with includes "" and excludes ""
[INFO] Unpacking /var/lib/jenkins/.m2/repository/org/eclipse/jetty/orbit/javax.annotation/1.1.0.v201108011116/javax.annotation-1.1.0.v201108011116.jar to /var/lib/jenkins/jobs/d1_integration_DEV2_mn_sysmeta_mutability/workspace/target/d1_integration-2.0-SNAPSHOT with includes "" and excludes ""
[INFO] Unpacking /var/lib/jenkins/.m2/repository/org/eclipse/jetty/jetty-http/8.1.15.v20140411/jetty-http-8.1.15.v20140411.jar to /var/lib/jenkins/jobs/d1_integration_DEV2_mn_sysmeta_mutability/workspace/target/d1_integration-2.0-SNAPSHOT with includes "" and excludes ""
[INFO] Unpacking /var/lib/jenkins/.m2/repository/org/eclipse/jetty/jetty-util/8.1.15.v20140411/jetty-util-8.1.15.v20140411.jar to /var/lib/jenkins/jobs/d1_integration_DEV2_mn_sysmeta_mutability/workspace/target/d1_integration-2.0-SNAPSHOT with includes "" and excludes ""
[INFO] Unpacking /var/lib/jenkins/.m2/repository/org/eclipse/jetty/orbit/org.eclipse.jdt.core/3.7.1/org.eclipse.jdt.core-3.7.1.jar to /var/lib/jenkins/jobs/d1_integration_DEV2_mn_sysmeta_mutability/workspace/target/d1_integration-2.0-SNAPSHOT with includes "" and excludes ""
[INFO] Unpacking /var/lib/jenkins/.m2/repository/org/eclipse/jetty/orbit/javax.servlet/3.0.0.v201112011016/javax.servlet-3.0.0.v201112011016.jar to /var/lib/jenkins/jobs/d1_integration_DEV2_mn_sysmeta_mutability/workspace/target/d1_integration-2.0-SNAPSHOT with includes "" and excludes ""
[INFO] Unpacking /var/lib/jenkins/.m2/repository/org/eclipse/jetty/orbit/javax.el/2.2.0.v201108011116/javax.el-2.2.0.v201108011116.jar to /var/lib/jenkins/jobs/d1_integration_DEV2_mn_sysmeta_mutability/workspace/target/d1_integration-2.0-SNAPSHOT with includes "" and excludes ""
[INFO] 
[INFO] --- maven-war-plugin:2.1.1:war (default-war) @ d1_integration ---
[INFO] Packaging webapp
[INFO] Assembling webapp [d1_integration] in [/var/lib/jenkins/jobs/d1_integration_DEV2_mn_sysmeta_mutability/workspace/target/d1_integration-2.0-SNAPSHOT]
[INFO] Processing war project
[INFO] Copying webapp resources [/var/lib/jenkins/jobs/d1_integration_DEV2_mn_sysmeta_mutability/workspace/src/main/webapp]
[INFO] Webapp assembled in [398 msecs]
[INFO] Building war: /var/lib/jenkins/jobs/d1_integration_DEV2_mn_sysmeta_mutability/workspace/target/d1_integration-2.0-SNAPSHOT.war
[INFO] WEB-INF/web.xml already added, skipping
[INFO] 
[INFO] --- maven-antrun-plugin:1.3:run (execution2) @ d1_integration ---
[INFO] Executing tasks
     [move] Moving 1 file to /var/lib/jenkins/jobs/d1_integration_DEV2_mn_sysmeta_mutability/workspace/target
[INFO] Executed tasks
[INFO] 
[INFO] --- maven-failsafe-plugin:2.8.1:integration-test (integration-test) @ d1_integration ---
[INFO] Failsafe report directory: /var/lib/jenkins/jobs/d1_integration_DEV2_mn_sysmeta_mutability/workspace/target/failsafe-reports

-------------------------------------------------------
 T E S T S
-------------------------------------------------------
Running org.dataone.integration.it.apiTests.MNSystemMetadataMutabilityIt
20151114-05:09:43: [INFO]: **************************************************** [org.dataone.integration.ContextAwareTestCaseDataone]
20151114-05:09:43: [INFO]: ***  context label:   DEV2 [org.dataone.integration.ContextAwareTestCaseDataone]
20151114-05:09:43: [INFO]: **************************************************** [org.dataone.integration.ContextAwareTestCaseDataone]
~~~ Context is from d1client.properties: https://cn-dev-2.test.dataone.org/cn
20151114-05:09:44: [INFO]: rest call info: GET https://cn-dev-2.test.dataone.org/cn/v1/node [org.dataone.client.rest.RestClient]
20151114-05:09:44: [INFO]: isNodeAlive for Node: https://cn-dev-2.test.dataone.org/cn ... [org.dataone.integration.ContextAwareTestCaseDataone]
20151114-05:09:44: [INFO]: ... calling node ... [org.dataone.integration.ContextAwareTestCaseDataone]
20151114-05:09:44: [INFO]: rest call info: GET https://cn-dev-2.test.dataone.org/cn [org.dataone.client.rest.RestClient]
20151114-05:09:44: [INFO]: ... called node [org.dataone.integration.ContextAwareTestCaseDataone]
20151114-05:09:44: [INFO]: *** Adding CN to list: cn-dev-2 [ https://cn-dev-2.test.dataone.org/cn ] [org.dataone.integration.ContextAwareTestCaseDataone]
20151114-05:09:44: [INFO]: isNodeAlive for Node: https://cn-dev-ucsb-2.test.dataone.org/cn ... [org.dataone.integration.ContextAwareTestCaseDataone]
20151114-05:09:44: [INFO]: ... calling node ... [org.dataone.integration.ContextAwareTestCaseDataone]
20151114-05:09:45: [INFO]: rest call info: GET https://cn-dev-ucsb-2.test.dataone.org/cn [org.dataone.client.rest.RestClient]
20151114-05:09:45: [INFO]: ... called node [org.dataone.integration.ContextAwareTestCaseDataone]
20151114-05:09:45: [INFO]: *** Adding CN to list: cn-dev-ucsb-2 [ https://cn-dev-ucsb-2.test.dataone.org/cn ] [org.dataone.integration.ContextAwareTestCaseDataone]
20151114-05:09:45: [INFO]: isNodeAlive for Node: https://cn-dev-unm-2.test.dataone.org/cn ... [org.dataone.integration.ContextAwareTestCaseDataone]
20151114-05:09:45: [INFO]: ... calling node ... [org.dataone.integration.ContextAwareTestCaseDataone]
20151114-05:09:45: [INFO]: rest call info: GET https://cn-dev-unm-2.test.dataone.org/cn [org.dataone.client.rest.RestClient]
20151114-05:09:45: [INFO]: ... called node [org.dataone.integration.ContextAwareTestCaseDataone]
20151114-05:09:45: [INFO]: *** Adding CN to list: cn-dev-unm-2 [ https://cn-dev-unm-2.test.dataone.org/cn ] [org.dataone.integration.ContextAwareTestCaseDataone]
20151114-05:09:45: [INFO]: isNodeAlive for Node: https://mn-dev-ucsb-1.test.dataone.org/metacat/d1/mn ... [org.dataone.integration.ContextAwareTestCaseDataone]
20151114-05:09:45: [INFO]: ... calling node ... [org.dataone.integration.ContextAwareTestCaseDataone]
20151114-05:09:46: [INFO]: rest call info: GET https://mn-dev-ucsb-1.test.dataone.org/metacat/d1/mn [org.dataone.client.rest.RestClient]
20151114-05:09:46: [INFO]: ... called node [org.dataone.integration.ContextAwareTestCaseDataone]
20151114-05:09:46: [INFO]: *** Adding MN to list: mn-dev-ucsb-1 [ https://mn-dev-ucsb-1.test.dataone.org/metacat/d1/mn ] [org.dataone.integration.ContextAwareTestCaseDataone]
20151114-05:09:46: [INFO]: isNodeAlive for Node: https://mn-dev-ucsb-2.test.dataone.org/metacat/d1/mn ... [org.dataone.integration.ContextAwareTestCaseDataone]
20151114-05:09:46: [INFO]: ... calling node ... [org.dataone.integration.ContextAwareTestCaseDataone]
20151114-05:09:46: [INFO]: rest call info: GET https://mn-dev-ucsb-2.test.dataone.org/metacat/d1/mn [org.dataone.client.rest.RestClient]
20151114-05:09:46: [INFO]: ... called node [org.dataone.integration.ContextAwareTestCaseDataone]
20151114-05:09:46: [INFO]: *** Adding MN to list: mn-dev-ucsb-2 [ https://mn-dev-ucsb-2.test.dataone.org/metacat/d1/mn ] [org.dataone.integration.ContextAwareTestCaseDataone]
20151114-05:09:46: [INFO]: isNodeAlive for Node: https://mn-dev-unm-1.test.dataone.org/metacat/d1/mn ... [org.dataone.integration.ContextAwareTestCaseDataone]
20151114-05:09:46: [INFO]: ... calling node ... [org.dataone.integration.ContextAwareTestCaseDataone]
20151114-05:09:47: [INFO]: rest call info: GET https://mn-dev-unm-1.test.dataone.org/metacat/d1/mn [org.dataone.client.rest.RestClient]
20151114-05:09:47: [INFO]: ... called node [org.dataone.integration.ContextAwareTestCaseDataone]
20151114-05:09:47: [INFO]: *** Adding MN to list: mn-dev-unm-1 [ https://mn-dev-unm-1.test.dataone.org/metacat/d1/mn ] [org.dataone.integration.ContextAwareTestCaseDataone]
20151114-05:09:47: [INFO]: isNodeAlive for Node: https://mn-dev-unm-2.test.dataone.org/metacat/d1/mn ... [org.dataone.integration.ContextAwareTestCaseDataone]
20151114-05:09:47: [INFO]: ... calling node ... [org.dataone.integration.ContextAwareTestCaseDataone]
20151114-05:09:47: [INFO]: rest call info: GET https://mn-dev-unm-2.test.dataone.org/metacat/d1/mn [org.dataone.client.rest.RestClient]
20151114-05:09:47: [INFO]: ... called node [org.dataone.integration.ContextAwareTestCaseDataone]
20151114-05:09:47: [INFO]: *** Adding MN to list: mn-dev-unm-2 [ https://mn-dev-unm-2.test.dataone.org/metacat/d1/mn ] [org.dataone.integration.ContextAwareTestCaseDataone]
20151114-05:09:47: [INFO]: trying to filter CN list for the round robin CN... original size: 3, includes nodes: [org.dataone.integration.ContextAwareTestCaseDataone]
20151114-05:09:47: [INFO]:     CN: https://cn-dev-2.test.dataone.org/cn "Development 2 Round Robin Router Node" [org.dataone.integration.ContextAwareTestCaseDataone]
20151114-05:09:47: [INFO]:     CN: https://cn-dev-ucsb-2.test.dataone.org/cn "UCSB Development 2 Protocol Coordinating Node" [org.dataone.integration.ContextAwareTestCaseDataone]
20151114-05:09:47: [INFO]:     CN: https://cn-dev-unm-2.test.dataone.org/cn "UNM Development 2 Protocol Coordinating Node" [org.dataone.integration.ContextAwareTestCaseDataone]
20151114-05:09:47: [INFO]: excluding round robin CN: https://cn-dev-2.test.dataone.org/cn "Development 2 Round Robin Router Node" [org.dataone.integration.ContextAwareTestCaseDataone]
20151114-05:09:47: [INFO]: including CN: https://cn-dev-ucsb-2.test.dataone.org/cn "UCSB Development 2 Protocol Coordinating Node" [org.dataone.integration.ContextAwareTestCaseDataone]
20151114-05:09:47: [INFO]: including CN: https://cn-dev-unm-2.test.dataone.org/cn "UNM Development 2 Protocol Coordinating Node" [org.dataone.integration.ContextAwareTestCaseDataone]
20151114-05:09:47: [INFO]: filtered CN list without round robin CN. size: 2, including nodes: [org.dataone.integration.ContextAwareTestCaseDataone]
20151114-05:09:47: [INFO]:     CN: https://cn-dev-ucsb-2.test.dataone.org/cn "UCSB Development 2 Protocol Coordinating Node" [org.dataone.integration.ContextAwareTestCaseDataone]
20151114-05:09:47: [INFO]:     CN: https://cn-dev-unm-2.test.dataone.org/cn "UNM Development 2 Protocol Coordinating Node" [org.dataone.integration.ContextAwareTestCaseDataone]
20151114-05:09:47: [INFO]: **************************************************** [org.dataone.integration.ContextAwareTestCaseDataone]
20151114-05:09:47: [INFO]: certificate directory: /etc/dataone/client/testClientCerts/ [org.dataone.integration.ContextAwareTestCaseDataone]
20151114-05:09:47: [INFO]: certificate filename: cnDevUNM2 [org.dataone.integration.ContextAwareTestCaseDataone]
20151114-05:09:47: [INFO]: client setup as Subject: CN=urn:node:cnDevUNM2,DC=dataone,DC=org [org.dataone.integration.ContextAwareTestCaseDataone]
20151114-05:09:47: [INFO]: rest call info: GET https://cn-dev-ucsb-2.test.dataone.org/cn/v2/node [org.dataone.client.rest.RestClient]
20151114-05:09:47: [INFO]: **************************************************** [org.dataone.integration.ContextAwareTestCaseDataone]
20151114-05:09:47: [INFO]: ***  context label:   DEV2 [org.dataone.integration.ContextAwareTestCaseDataone]
20151114-05:09:47: [INFO]: **************************************************** [org.dataone.integration.ContextAwareTestCaseDataone]
20151114-05:09:47: [INFO]: **************************************************** [org.dataone.integration.ContextAwareTestCaseDataone]
20151114-05:09:47: [INFO]: rest call info: GET https://cn-dev-ucsb-2.test.dataone.org/cn/v2/node [org.dataone.client.rest.RestClient]
20151114-05:09:47: [INFO]: **************************************************** [org.dataone.integration.ContextAwareTestCaseDataone]
20151114-05:09:47: [INFO]: ***  context label:   DEV2 [org.dataone.integration.ContextAwareTestCaseDataone]
20151114-05:09:47: [INFO]: **************************************************** [org.dataone.integration.ContextAwareTestCaseDataone]
20151114-05:09:47: [INFO]: **************************************************** [org.dataone.integration.ContextAwareTestCaseDataone]
20151114-05:09:48: [INFO]: rest call info: GET https://cn-dev-ucsb-2.test.dataone.org/cn/v2/node [org.dataone.client.rest.RestClient]
20151114-05:09:48: [INFO]: **************************************************** [org.dataone.integration.ContextAwareTestCaseDataone]
20151114-05:09:48: [INFO]: ***  context label:   DEV2 [org.dataone.integration.ContextAwareTestCaseDataone]
20151114-05:09:48: [INFO]: **************************************************** [org.dataone.integration.ContextAwareTestCaseDataone]
20151114-05:09:48: [INFO]: **************************************************** [org.dataone.integration.ContextAwareTestCaseDataone]
20151114-05:09:48: [INFO]: rest call info: GET https://cn-dev-ucsb-2.test.dataone.org/cn/v2/node [org.dataone.client.rest.RestClient]
Tests run: 4, Failures: 4, Errors: 0, Skipped: 0, Time elapsed: 6.149 sec <<< FAILURE!
Running org.dataone.integration.it.apiTests.MNUpdateSystemMetadataIT
20151114-05:09:48: [INFO]: **************************************************** [org.dataone.integration.ContextAwareTestCaseDataone]
20151114-05:09:48: [INFO]: ***  context label:   DEV2 [org.dataone.integration.ContextAwareTestCaseDataone]
20151114-05:09:48: [INFO]: **************************************************** [org.dataone.integration.ContextAwareTestCaseDataone]
20151114-05:09:48: [INFO]: **************************************************** [org.dataone.integration.ContextAwareTestCaseDataone]
20151114-05:09:48: [INFO]: rest call info: GET https://mn-dev-ucsb-1.test.dataone.org/metacat/d1/mn/v2/monitor/ping [org.dataone.client.rest.RestClient]
20151114-05:09:48: [INFO]: MN excluded from test: https://mn-dev-ucsb-1.test.dataone.org/metacat/d1/mn [org.dataone.integration.ContextAwareTestCaseDataone]
20151114-05:09:49: [INFO]: rest call info: GET https://mn-dev-ucsb-2.test.dataone.org/metacat/d1/mn/v2/monitor/ping [org.dataone.client.rest.RestClient]
20151114-05:09:49: [INFO]: MN included in test: https://mn-dev-ucsb-2.test.dataone.org/metacat/d1/mn [org.dataone.integration.ContextAwareTestCaseDataone]
20151114-05:09:49: [INFO]: rest call info: GET https://mn-dev-unm-1.test.dataone.org/metacat/d1/mn/v2/monitor/ping [org.dataone.client.rest.RestClient]
20151114-05:09:49: [INFO]: MN excluded from test: https://mn-dev-unm-1.test.dataone.org/metacat/d1/mn [org.dataone.integration.ContextAwareTestCaseDataone]
20151114-05:09:49: [INFO]: rest call info: GET https://mn-dev-unm-2.test.dataone.org/metacat/d1/mn/v2/monitor/ping [org.dataone.client.rest.RestClient]
20151114-05:09:49: [INFO]: MN included in test: https://mn-dev-unm-2.test.dataone.org/metacat/d1/mn [org.dataone.integration.ContextAwareTestCaseDataone]
20151114-05:09:49: [INFO]: certificate directory: /etc/dataone/client/testClientCerts/ [org.dataone.integration.ContextAwareTestCaseDataone]
20151114-05:09:49: [INFO]: certificate filename: testRightsHolder [org.dataone.integration.ContextAwareTestCaseDataone]
20151114-05:09:49: [INFO]: client setup as Subject: CN=testRightsHolder,DC=dataone,DC=org [org.dataone.integration.ContextAwareTestCaseDataone]
20151114-05:09:49: [INFO]: 
***************** running test for testUpdateSystemMetadata_RightsHolder(...) vs. node: https://mn-dev-ucsb-2.test.dataone.org/metacat/d1/mn ***************** [org.dataone.integration.ContextAwareTestCaseDataone]
20151114-05:09:49: [INFO]: certificate directory: /etc/dataone/client/testClientCerts/ [org.dataone.integration.ContextAwareTestCaseDataone]
20151114-05:09:49: [INFO]: certificate filename: cnDevUNM2 [org.dataone.integration.ContextAwareTestCaseDataone]
20151114-05:09:49: [INFO]: client setup as Subject: CN=urn:node:cnDevUNM2,DC=dataone,DC=org [org.dataone.integration.ContextAwareTestCaseDataone]
20151114-05:09:49: [INFO]: refreshing objectFormatCache from cn: null [org.dataone.client.v2.formats.ObjectFormatCache]
20151114-05:09:49: [INFO]: rest call info: GET https://cn-dev-2.test.dataone.org/cn/v2/formats [org.dataone.client.rest.RestClient]
20151114-05:09:49: [INFO]: successful cache refresh from cn.listFormats() [org.dataone.client.v2.formats.ObjectFormatCache]
20151114-05:09:49: [INFO]: creating a test object.  pid = testUpdateSystemMetadata_RightsHolder_201531721949459 on https://mn-dev-ucsb-2.test.dataone.org/metacat/d1/mn/v2 [org.dataone.integration.ContextAwareTestCaseDataone]
20151114-05:09:49: [INFO]: SystemMetadata for pid: testUpdateSystemMetadata_RightsHolder_201531721949459
<?xml version="1.0" encoding="UTF-8"?><d1_v2.0:systemMetadata xmlns:d1_v2.0="http://ns.dataone.org/service/types/v2.0" xmlns:d1="http://ns.dataone.org/service/types/v1"><serialVersion>1</serialVersion><identifier>testUpdateSystemMetadata_RightsHolder_201531721949459</identifier><formatId>eml://ecoinformatics.org/eml-2.0.1</formatId><size>17181</size><checksum algorithm="MD5">03ce09c6b4c3efc1681f3023402998a2</checksum><submitter>CN=urn:node:cnDevUNM2,DC=dataone,DC=org</submitter><rightsHolder>CN=testRightsHolder,DC=dataone,DC=org</rightsHolder><accessPolicy><allow><subject>CN=testRightsHolder,DC=dataone,DC=org</subject><permission>changePermission</permission></allow></accessPolicy><dateUploaded>2015-11-14T05:09:49.869+00:00</dateUploaded><dateSysMetadataModified>2015-11-14T05:09:49.869+00:00</dateSysMetadataModified><originMemberNode>urn:node:mnDevUCSB2</originMemberNode><authoritativeMemberNode>urn:node:mnDevUCSB2</authoritativeMemberNode></d1_v2.0:systemMetadata> [org.dataone.integration.ContextAwareTestCaseDataone]
20151114-05:09:51: [INFO]: rest call info: POST https://mn-dev-ucsb-2.test.dataone.org/metacat/d1/mn/v2/object; MMP message has: ParamPart:pid = testUpdateSystemMetadata_RightsHolder_201531721949459; FilePart:object = /tmp/mmp.output.5689516954184720123.tmp (17181 bytes); FilePart:sysmeta = /tmp/mmp.output.1155907761929719141.tmp (979 bytes);  [org.dataone.client.rest.RestClient]
20151114-05:09:51: [INFO]: object created.  pid = testUpdateSystemMetadata_RightsHolder_201531721949459 [org.dataone.integration.ContextAwareTestCaseDataone]
20151114-05:09:52: [INFO]: rest call info: GET https://mn-dev-ucsb-2.test.dataone.org/metacat/d1/mn/v2/meta/testUpdateSystemMetadata_RightsHolder_201531721949459 [org.dataone.client.rest.RestClient]
20151114-05:09:57: [INFO]: rest call info: PUT https://mn-dev-ucsb-2.test.dataone.org/metacat/d1/mn/v2/meta; MMP message has: ParamPart:pid = testUpdateSystemMetadata_RightsHolder_201531721949459; FilePart:sysmeta = /tmp/mmp.output.3910559433377184912.tmp (1003 bytes);  [org.dataone.client.rest.RestClient]
20151114-05:10:08: [INFO]: rest call info: GET https://mn-dev-ucsb-2.test.dataone.org/metacat/d1/mn/v2/meta/testUpdateSystemMetadata_RightsHolder_201531721949459 [org.dataone.client.rest.RestClient]
20151114-05:10:08: [INFO]: 
***************** running test for testUpdateSystemMetadata_RightsHolder(...) vs. node: https://mn-dev-unm-2.test.dataone.org/metacat/d1/mn ***************** [org.dataone.integration.ContextAwareTestCaseDataone]
20151114-05:10:08: [INFO]: certificate directory: /etc/dataone/client/testClientCerts/ [org.dataone.integration.ContextAwareTestCaseDataone]
20151114-05:10:08: [INFO]: certificate filename: cnDevUNM2 [org.dataone.integration.ContextAwareTestCaseDataone]
20151114-05:10:08: [INFO]: client setup as Subject: CN=urn:node:cnDevUNM2,DC=dataone,DC=org [org.dataone.integration.ContextAwareTestCaseDataone]
20151114-05:10:08: [INFO]: creating a test object.  pid = testUpdateSystemMetadata_RightsHolder_201531721108534 on https://mn-dev-unm-2.test.dataone.org/metacat/d1/mn/v2 [org.dataone.integration.ContextAwareTestCaseDataone]
20151114-05:10:08: [INFO]: SystemMetadata for pid: testUpdateSystemMetadata_RightsHolder_201531721108534
<?xml version="1.0" encoding="UTF-8"?><d1_v2.0:systemMetadata xmlns:d1_v2.0="http://ns.dataone.org/service/types/v2.0" xmlns:d1="http://ns.dataone.org/service/types/v1"><serialVersion>1</serialVersion><identifier>testUpdateSystemMetadata_RightsHolder_201531721108534</identifier><formatId>eml://ecoinformatics.org/eml-2.0.1</formatId><size>17181</size><checksum algorithm="MD5">03ce09c6b4c3efc1681f3023402998a2</checksum><submitter>CN=urn:node:cnDevUNM2,DC=dataone,DC=org</submitter><rightsHolder>CN=testRightsHolder,DC=dataone,DC=org</rightsHolder><accessPolicy><allow><subject>CN=testRightsHolder,DC=dataone,DC=org</subject><permission>changePermission</permission></allow></accessPolicy><dateUploaded>2015-11-14T05:10:08.556+00:00</dateUploaded><dateSysMetadataModified>2015-11-14T05:10:08.556+00:00</dateSysMetadataModified><originMemberNode>urn:node:mnDevUNM2</originMemberNode><authoritativeMemberNode>urn:node:mnDevUNM2</authoritativeMemberNode></d1_v2.0:systemMetadata> [org.dataone.integration.ContextAwareTestCaseDataone]
20151114-05:10:09: [INFO]: rest call info: POST https://mn-dev-unm-2.test.dataone.org/metacat/d1/mn/v2/object; MMP message has: ParamPart:pid = testUpdateSystemMetadata_RightsHolder_201531721108534; FilePart:object = /tmp/mmp.output.5880014433389510150.tmp (17181 bytes); FilePart:sysmeta = /tmp/mmp.output.5115195122687000461.tmp (977 bytes);  [org.dataone.client.rest.RestClient]
20151114-05:10:09: [INFO]: object created.  pid = testUpdateSystemMetadata_RightsHolder_201531721108534 [org.dataone.integration.ContextAwareTestCaseDataone]
20151114-05:10:10: [INFO]: rest call info: GET https://mn-dev-unm-2.test.dataone.org/metacat/d1/mn/v2/meta/testUpdateSystemMetadata_RightsHolder_201531721108534 [org.dataone.client.rest.RestClient]
20151114-05:10:15: [INFO]: rest call info: PUT https://mn-dev-unm-2.test.dataone.org/metacat/d1/mn/v2/meta; MMP message has: ParamPart:pid = testUpdateSystemMetadata_RightsHolder_201531721108534; FilePart:sysmeta = /tmp/mmp.output.2314287121841222636.tmp (1001 bytes);  [org.dataone.client.rest.RestClient]
20151114-05:10:25: [INFO]: rest call info: GET https://mn-dev-unm-2.test.dataone.org/metacat/d1/mn/v2/meta/testUpdateSystemMetadata_RightsHolder_201531721108534 [org.dataone.client.rest.RestClient]
20151114-05:10:25: [INFO]: **************************************************** [org.dataone.integration.ContextAwareTestCaseDataone]
20151114-05:10:25: [INFO]: ***  context label:   DEV2 [org.dataone.integration.ContextAwareTestCaseDataone]
20151114-05:10:25: [INFO]: **************************************************** [org.dataone.integration.ContextAwareTestCaseDataone]
20151114-05:10:25: [INFO]: **************************************************** [org.dataone.integration.ContextAwareTestCaseDataone]
20151114-05:10:26: [INFO]: rest call info: GET https://mn-dev-ucsb-1.test.dataone.org/metacat/d1/mn/v2/monitor/ping [org.dataone.client.rest.RestClient]
20151114-05:10:26: [INFO]: MN excluded from test: https://mn-dev-ucsb-1.test.dataone.org/metacat/d1/mn [org.dataone.integration.ContextAwareTestCaseDataone]
20151114-05:10:26: [INFO]: rest call info: GET https://mn-dev-ucsb-2.test.dataone.org/metacat/d1/mn/v2/monitor/ping [org.dataone.client.rest.RestClient]
20151114-05:10:26: [INFO]: MN included in test: https://mn-dev-ucsb-2.test.dataone.org/metacat/d1/mn [org.dataone.integration.ContextAwareTestCaseDataone]
20151114-05:10:26: [INFO]: rest call info: GET https://mn-dev-unm-1.test.dataone.org/metacat/d1/mn/v2/monitor/ping [org.dataone.client.rest.RestClient]
20151114-05:10:26: [INFO]: MN excluded from test: https://mn-dev-unm-1.test.dataone.org/metacat/d1/mn [org.dataone.integration.ContextAwareTestCaseDataone]
20151114-05:10:26: [INFO]: rest call info: GET https://mn-dev-unm-2.test.dataone.org/metacat/d1/mn/v2/monitor/ping [org.dataone.client.rest.RestClient]
20151114-05:10:26: [INFO]: MN included in test: https://mn-dev-unm-2.test.dataone.org/metacat/d1/mn [org.dataone.integration.ContextAwareTestCaseDataone]
20151114-05:10:26: [INFO]: 
***************** running test for testUpdateSystemMetadata_MutableRightsHolder(...) vs. node: https://mn-dev-ucsb-2.test.dataone.org/metacat/d1/mn ***************** [org.dataone.integration.ContextAwareTestCaseDataone]
20151114-05:10:26: [INFO]: certificate directory: /etc/dataone/client/testClientCerts/ [org.dataone.integration.ContextAwareTestCaseDataone]
20151114-05:10:26: [INFO]: certificate filename: cnDevUNM2 [org.dataone.integration.ContextAwareTestCaseDataone]
20151114-05:10:26: [INFO]: client setup as Subject: CN=urn:node:cnDevUNM2,DC=dataone,DC=org [org.dataone.integration.ContextAwareTestCaseDataone]
20151114-05:10:26: [INFO]: creating a test object.  pid = testUpdateSystemMetadata_MutableRightsHolder_2015317211026799 on https://mn-dev-ucsb-2.test.dataone.org/metacat/d1/mn/v2 [org.dataone.integration.ContextAwareTestCaseDataone]
20151114-05:10:26: [INFO]: SystemMetadata for pid: testUpdateSystemMetadata_MutableRightsHolder_2015317211026799
<?xml version="1.0" encoding="UTF-8"?><d1_v2.0:systemMetadata xmlns:d1_v2.0="http://ns.dataone.org/service/types/v2.0" xmlns:d1="http://ns.dataone.org/service/types/v1"><serialVersion>1</serialVersion><identifier>testUpdateSystemMetadata_MutableRightsHolder_2015317211026799</identifier><formatId>eml://ecoinformatics.org/eml-2.0.1</formatId><size>17181</size><checksum algorithm="MD5">03ce09c6b4c3efc1681f3023402998a2</checksum><submitter>CN=urn:node:cnDevUNM2,DC=dataone,DC=org</submitter><rightsHolder>CN=testRightsHolder,DC=dataone,DC=org</rightsHolder><accessPolicy><allow><subject>CN=testRightsHolder,DC=dataone,DC=org</subject><permission>changePermission</permission></allow></accessPolicy><dateUploaded>2015-11-14T05:10:26.822+00:00</dateUploaded><dateSysMetadataModified>2015-11-14T05:10:26.822+00:00</dateSysMetadataModified><originMemberNode>urn:node:mnDevUCSB2</originMemberNode><authoritativeMemberNode>urn:node:mnDevUCSB2</authoritativeMemberNode></d1_v2.0:systemMetadata> [org.dataone.integration.ContextAwareTestCaseDataone]
20151114-05:10:28: [INFO]: rest call info: POST https://mn-dev-ucsb-2.test.dataone.org/metacat/d1/mn/v2/object; MMP message has: ParamPart:pid = testUpdateSystemMetadata_MutableRightsHolder_2015317211026799; FilePart:object = /tmp/mmp.output.5196148811828271311.tmp (17181 bytes); FilePart:sysmeta = /tmp/mmp.output.881254384600124920.tmp (987 bytes);  [org.dataone.client.rest.RestClient]
20151114-05:10:28: [INFO]: object created.  pid = testUpdateSystemMetadata_MutableRightsHolder_2015317211026799 [org.dataone.integration.ContextAwareTestCaseDataone]
20151114-05:10:29: [INFO]: rest call info: GET https://mn-dev-ucsb-2.test.dataone.org/metacat/d1/mn/v2/meta/testUpdateSystemMetadata_MutableRightsHolder_2015317211026799 [org.dataone.client.rest.RestClient]
20151114-05:10:29: [INFO]: certificate directory: /etc/dataone/client/testClientCerts/ [org.dataone.integration.ContextAwareTestCaseDataone]
20151114-05:10:29: [INFO]: certificate filename: testPerson [org.dataone.integration.ContextAwareTestCaseDataone]
20151114-05:10:29: [INFO]: client setup as Subject: CN=testPerson,DC=dataone,DC=org [org.dataone.integration.ContextAwareTestCaseDataone]
20151114-05:10:34: [INFO]: rest call info: PUT https://mn-dev-ucsb-2.test.dataone.org/metacat/d1/mn/v2/meta; MMP message has: ParamPart:pid = testUpdateSystemMetadata_MutableRightsHolder_2015317211026799; FilePart:sysmeta = /tmp/mmp.output.4580925633595699323.tmp (1005 bytes);  [org.dataone.client.rest.RestClient]
20151114-05:10:45: [INFO]: rest call info: GET https://mn-dev-ucsb-2.test.dataone.org/metacat/d1/mn/v2/meta/testUpdateSystemMetadata_MutableRightsHolder_2015317211026799 [org.dataone.client.rest.RestClient]
20151114-05:10:45: [INFO]: 
***************** running test for testUpdateSystemMetadata_MutableRightsHolder(...) vs. node: https://mn-dev-unm-2.test.dataone.org/metacat/d1/mn ***************** [org.dataone.integration.ContextAwareTestCaseDataone]
20151114-05:10:45: [INFO]: certificate directory: /etc/dataone/client/testClientCerts/ [org.dataone.integration.ContextAwareTestCaseDataone]
20151114-05:10:45: [INFO]: certificate filename: cnDevUNM2 [org.dataone.integration.ContextAwareTestCaseDataone]
20151114-05:10:45: [INFO]: client setup as Subject: CN=urn:node:cnDevUNM2,DC=dataone,DC=org [org.dataone.integration.ContextAwareTestCaseDataone]
20151114-05:10:45: [INFO]: creating a test object.  pid = testUpdateSystemMetadata_MutableRightsHolder_2015317211045631 on https://mn-dev-unm-2.test.dataone.org/metacat/d1/mn/v2 [org.dataone.integration.ContextAwareTestCaseDataone]
20151114-05:10:45: [INFO]: SystemMetadata for pid: testUpdateSystemMetadata_MutableRightsHolder_2015317211045631
<?xml version="1.0" encoding="UTF-8"?><d1_v2.0:systemMetadata xmlns:d1_v2.0="http://ns.dataone.org/service/types/v2.0" xmlns:d1="http://ns.dataone.org/service/types/v1"><serialVersion>1</serialVersion><identifier>testUpdateSystemMetadata_MutableRightsHolder_2015317211045631</identifier><formatId>eml://ecoinformatics.org/eml-2.0.1</formatId><size>17181</size><checksum algorithm="MD5">03ce09c6b4c3efc1681f3023402998a2</checksum><submitter>CN=urn:node:cnDevUNM2,DC=dataone,DC=org</submitter><rightsHolder>CN=testRightsHolder,DC=dataone,DC=org</rightsHolder><accessPolicy><allow><subject>CN=testRightsHolder,DC=dataone,DC=org</subject><permission>changePermission</permission></allow></accessPolicy><dateUploaded>2015-11-14T05:10:45.651+00:00</dateUploaded><dateSysMetadataModified>2015-11-14T05:10:45.651+00:00</dateSysMetadataModified><originMemberNode>urn:node:mnDevUNM2</originMemberNode><authoritativeMemberNode>urn:node:mnDevUNM2</authoritativeMemberNode></d1_v2.0:systemMetadata> [org.dataone.integration.ContextAwareTestCaseDataone]
20151114-05:10:46: [INFO]: rest call info: POST https://mn-dev-unm-2.test.dataone.org/metacat/d1/mn/v2/object; MMP message has: ParamPart:pid = testUpdateSystemMetadata_MutableRightsHolder_2015317211045631; FilePart:object = /tmp/mmp.output.2229841704115935706.tmp (17181 bytes); FilePart:sysmeta = /tmp/mmp.output.8550113395529904816.tmp (985 bytes);  [org.dataone.client.rest.RestClient]
20151114-05:10:46: [INFO]: object created.  pid = testUpdateSystemMetadata_MutableRightsHolder_2015317211045631 [org.dataone.integration.ContextAwareTestCaseDataone]
20151114-05:10:46: [INFO]: rest call info: GET https://mn-dev-unm-2.test.dataone.org/metacat/d1/mn/v2/meta/testUpdateSystemMetadata_MutableRightsHolder_2015317211045631 [org.dataone.client.rest.RestClient]
20151114-05:10:52: [INFO]: rest call info: PUT https://mn-dev-unm-2.test.dataone.org/metacat/d1/mn/v2/meta; MMP message has: ParamPart:pid = testUpdateSystemMetadata_MutableRightsHolder_2015317211045631; FilePart:sysmeta = /tmp/mmp.output.4084891335180215998.tmp (1003 bytes);  [org.dataone.client.rest.RestClient]
20151114-05:11:02: [INFO]: rest call info: GET https://mn-dev-unm-2.test.dataone.org/metacat/d1/mn/v2/meta/testUpdateSystemMetadata_MutableRightsHolder_2015317211045631 [org.dataone.client.rest.RestClient]
20151114-05:11:02: [INFO]: **************************************************** [org.dataone.integration.ContextAwareTestCaseDataone]
20151114-05:11:02: [INFO]: ***  context label:   DEV2 [org.dataone.integration.ContextAwareTestCaseDataone]
20151114-05:11:02: [INFO]: **************************************************** [org.dataone.integration.ContextAwareTestCaseDataone]
20151114-05:11:02: [INFO]: **************************************************** [org.dataone.integration.ContextAwareTestCaseDataone]
20151114-05:11:03: [INFO]: rest call info: GET https://mn-dev-ucsb-1.test.dataone.org/metacat/d1/mn/v2/monitor/ping [org.dataone.client.rest.RestClient]
20151114-05:11:03: [INFO]: MN excluded from test: https://mn-dev-ucsb-1.test.dataone.org/metacat/d1/mn [org.dataone.integration.ContextAwareTestCaseDataone]
20151114-05:11:03: [INFO]: rest call info: GET https://mn-dev-ucsb-2.test.dataone.org/metacat/d1/mn/v2/monitor/ping [org.dataone.client.rest.RestClient]
20151114-05:11:03: [INFO]: MN included in test: https://mn-dev-ucsb-2.test.dataone.org/metacat/d1/mn [org.dataone.integration.ContextAwareTestCaseDataone]
20151114-05:11:03: [INFO]: rest call info: GET https://mn-dev-unm-1.test.dataone.org/metacat/d1/mn/v2/monitor/ping [org.dataone.client.rest.RestClient]
20151114-05:11:03: [INFO]: MN excluded from test: https://mn-dev-unm-1.test.dataone.org/metacat/d1/mn [org.dataone.integration.ContextAwareTestCaseDataone]
20151114-05:11:03: [INFO]: rest call info: GET https://mn-dev-unm-2.test.dataone.org/metacat/d1/mn/v2/monitor/ping [org.dataone.client.rest.RestClient]
20151114-05:11:03: [INFO]: MN included in test: https://mn-dev-unm-2.test.dataone.org/metacat/d1/mn [org.dataone.integration.ContextAwareTestCaseDataone]
20151114-05:11:03: [INFO]: 
***************** running test for testUpdateSystemMetadata_MutableFormat(...) vs. node: https://mn-dev-ucsb-2.test.dataone.org/metacat/d1/mn ***************** [org.dataone.integration.ContextAwareTestCaseDataone]
20151114-05:11:03: [INFO]: certificate directory: /etc/dataone/client/testClientCerts/ [org.dataone.integration.ContextAwareTestCaseDataone]
20151114-05:11:03: [INFO]: certificate filename: cnDevUNM2 [org.dataone.integration.ContextAwareTestCaseDataone]
20151114-05:11:03: [INFO]: client setup as Subject: CN=urn:node:cnDevUNM2,DC=dataone,DC=org [org.dataone.integration.ContextAwareTestCaseDataone]
20151114-05:11:03: [INFO]: creating a test object.  pid = testUpdateSystemMetadata_MutableFormat_201531721113719 on https://mn-dev-ucsb-2.test.dataone.org/metacat/d1/mn/v2 [org.dataone.integration.ContextAwareTestCaseDataone]
20151114-05:11:03: [INFO]: SystemMetadata for pid: testUpdateSystemMetadata_MutableFormat_201531721113719
<?xml version="1.0" encoding="UTF-8"?><d1_v2.0:systemMetadata xmlns:d1_v2.0="http://ns.dataone.org/service/types/v2.0" xmlns:d1="http://ns.dataone.org/service/types/v1"><serialVersion>1</serialVersion><identifier>testUpdateSystemMetadata_MutableFormat_201531721113719</identifier><formatId>eml://ecoinformatics.org/eml-2.0.1</formatId><size>17181</size><checksum algorithm="MD5">03ce09c6b4c3efc1681f3023402998a2</checksum><submitter>CN=urn:node:cnDevUNM2,DC=dataone,DC=org</submitter><rightsHolder>CN=testRightsHolder,DC=dataone,DC=org</rightsHolder><accessPolicy><allow><subject>CN=testRightsHolder,DC=dataone,DC=org</subject><permission>changePermission</permission></allow></accessPolicy><dateUploaded>2015-11-14T05:11:03.736+00:00</dateUploaded><dateSysMetadataModified>2015-11-14T05:11:03.736+00:00</dateSysMetadataModified><originMemberNode>urn:node:mnDevUCSB2</originMemberNode><authoritativeMemberNode>urn:node:mnDevUCSB2</authoritativeMemberNode></d1_v2.0:systemMetadata> [org.dataone.integration.ContextAwareTestCaseDataone]
20151114-05:11:05: [INFO]: rest call info: POST https://mn-dev-ucsb-2.test.dataone.org/metacat/d1/mn/v2/object; MMP message has: ParamPart:pid = testUpdateSystemMetadata_MutableFormat_201531721113719; FilePart:object = /tmp/mmp.output.7287217528053283416.tmp (17181 bytes); FilePart:sysmeta = /tmp/mmp.output.7358595023112863791.tmp (980 bytes);  [org.dataone.client.rest.RestClient]
20151114-05:11:05: [INFO]: object created.  pid = testUpdateSystemMetadata_MutableFormat_201531721113719 [org.dataone.integration.ContextAwareTestCaseDataone]
20151114-05:11:05: [INFO]: rest call info: GET https://mn-dev-ucsb-2.test.dataone.org/metacat/d1/mn/v2/meta/testUpdateSystemMetadata_MutableFormat_201531721113719 [org.dataone.client.rest.RestClient]
20151114-05:11:11: [INFO]: rest call info: PUT https://mn-dev-ucsb-2.test.dataone.org/metacat/d1/mn/v2/meta; MMP message has: ParamPart:pid = testUpdateSystemMetadata_MutableFormat_201531721113719; FilePart:sysmeta = /tmp/mmp.output.6108177558036451783.tmp (979 bytes);  [org.dataone.client.rest.RestClient]
20151114-05:11:22: [INFO]: rest call info: GET https://mn-dev-ucsb-2.test.dataone.org/metacat/d1/mn/v2/meta/testUpdateSystemMetadata_MutableFormat_201531721113719 [org.dataone.client.rest.RestClient]
20151114-05:11:22: [INFO]: 
***************** running test for testUpdateSystemMetadata_MutableFormat(...) vs. node: https://mn-dev-unm-2.test.dataone.org/metacat/d1/mn ***************** [org.dataone.integration.ContextAwareTestCaseDataone]
20151114-05:11:22: [INFO]: certificate directory: /etc/dataone/client/testClientCerts/ [org.dataone.integration.ContextAwareTestCaseDataone]
20151114-05:11:22: [INFO]: certificate filename: cnDevUNM2 [org.dataone.integration.ContextAwareTestCaseDataone]
20151114-05:11:22: [INFO]: client setup as Subject: CN=urn:node:cnDevUNM2,DC=dataone,DC=org [org.dataone.integration.ContextAwareTestCaseDataone]
20151114-05:11:22: [INFO]: creating a test object.  pid = testUpdateSystemMetadata_MutableFormat_201531721112249 on https://mn-dev-unm-2.test.dataone.org/metacat/d1/mn/v2 [org.dataone.integration.ContextAwareTestCaseDataone]
20151114-05:11:22: [INFO]: SystemMetadata for pid: testUpdateSystemMetadata_MutableFormat_201531721112249
<?xml version="1.0" encoding="UTF-8"?><d1_v2.0:systemMetadata xmlns:d1_v2.0="http://ns.dataone.org/service/types/v2.0" xmlns:d1="http://ns.dataone.org/service/types/v1"><serialVersion>1</serialVersion><identifier>testUpdateSystemMetadata_MutableFormat_201531721112249</identifier><formatId>eml://ecoinformatics.org/eml-2.0.1</formatId><size>17181</size><checksum algorithm="MD5">03ce09c6b4c3efc1681f3023402998a2</checksum><submitter>CN=urn:node:cnDevUNM2,DC=dataone,DC=org</submitter><rightsHolder>CN=testRightsHolder,DC=dataone,DC=org</rightsHolder><accessPolicy><allow><subject>CN=testRightsHolder,DC=dataone,DC=org</subject><permission>changePermission</permission></allow></accessPolicy><dateUploaded>2015-11-14T05:11:22.067+00:00</dateUploaded><dateSysMetadataModified>2015-11-14T05:11:22.067+00:00</dateSysMetadataModified><originMemberNode>urn:node:mnDevUNM2</originMemberNode><authoritativeMemberNode>urn:node:mnDevUNM2</authoritativeMemberNode></d1_v2.0:systemMetadata> [org.dataone.integration.ContextAwareTestCaseDataone]
20151114-05:11:23: [INFO]: rest call info: POST https://mn-dev-unm-2.test.dataone.org/metacat/d1/mn/v2/object; MMP message has: ParamPart:pid = testUpdateSystemMetadata_MutableFormat_201531721112249; FilePart:object = /tmp/mmp.output.6909361982498695056.tmp (17181 bytes); FilePart:sysmeta = /tmp/mmp.output.5296487733256686039.tmp (978 bytes);  [org.dataone.client.rest.RestClient]
20151114-05:11:23: [INFO]: object created.  pid = testUpdateSystemMetadata_MutableFormat_201531721112249 [org.dataone.integration.ContextAwareTestCaseDataone]
20151114-05:11:23: [INFO]: rest call info: GET https://mn-dev-unm-2.test.dataone.org/metacat/d1/mn/v2/meta/testUpdateSystemMetadata_MutableFormat_201531721112249 [org.dataone.client.rest.RestClient]
20151114-05:11:28: [INFO]: rest call info: PUT https://mn-dev-unm-2.test.dataone.org/metacat/d1/mn/v2/meta; MMP message has: ParamPart:pid = testUpdateSystemMetadata_MutableFormat_201531721112249; FilePart:sysmeta = /tmp/mmp.output.3624079446128656317.tmp (977 bytes);  [org.dataone.client.rest.RestClient]
20151114-05:11:38: [INFO]: rest call info: GET https://mn-dev-unm-2.test.dataone.org/metacat/d1/mn/v2/meta/testUpdateSystemMetadata_MutableFormat_201531721112249 [org.dataone.client.rest.RestClient]
20151114-05:11:38: [INFO]: **************************************************** [org.dataone.integration.ContextAwareTestCaseDataone]
20151114-05:11:38: [INFO]: ***  context label:   DEV2 [org.dataone.integration.ContextAwareTestCaseDataone]
20151114-05:11:38: [INFO]: **************************************************** [org.dataone.integration.ContextAwareTestCaseDataone]
20151114-05:11:38: [INFO]: **************************************************** [org.dataone.integration.ContextAwareTestCaseDataone]
20151114-05:11:39: [INFO]: rest call info: GET https://mn-dev-ucsb-1.test.dataone.org/metacat/d1/mn/v2/monitor/ping [org.dataone.client.rest.RestClient]
20151114-05:11:39: [INFO]: MN excluded from test: https://mn-dev-ucsb-1.test.dataone.org/metacat/d1/mn [org.dataone.integration.ContextAwareTestCaseDataone]
20151114-05:11:39: [INFO]: rest call info: GET https://mn-dev-ucsb-2.test.dataone.org/metacat/d1/mn/v2/monitor/ping [org.dataone.client.rest.RestClient]
20151114-05:11:39: [INFO]: MN included in test: https://mn-dev-ucsb-2.test.dataone.org/metacat/d1/mn [org.dataone.integration.ContextAwareTestCaseDataone]
20151114-05:11:39: [INFO]: rest call info: GET https://mn-dev-unm-1.test.dataone.org/metacat/d1/mn/v2/monitor/ping [org.dataone.client.rest.RestClient]
20151114-05:11:39: [INFO]: MN excluded from test: https://mn-dev-unm-1.test.dataone.org/metacat/d1/mn [org.dataone.integration.ContextAwareTestCaseDataone]
20151114-05:11:39: [INFO]: rest call info: GET https://mn-dev-unm-2.test.dataone.org/metacat/d1/mn/v2/monitor/ping [org.dataone.client.rest.RestClient]
20151114-05:11:39: [INFO]: MN included in test: https://mn-dev-unm-2.test.dataone.org/metacat/d1/mn [org.dataone.integration.ContextAwareTestCaseDataone]
20151114-05:11:39: [INFO]: 
***************** running test for testUpdateSystemMetadata_MutableAccessPolicy(...) vs. node: https://mn-dev-ucsb-2.test.dataone.org/metacat/d1/mn ***************** [org.dataone.integration.ContextAwareTestCaseDataone]
20151114-05:11:39: [INFO]: certificate directory: /etc/dataone/client/testClientCerts/ [org.dataone.integration.ContextAwareTestCaseDataone]
20151114-05:11:39: [INFO]: certificate filename: cnDevUNM2 [org.dataone.integration.ContextAwareTestCaseDataone]
20151114-05:11:39: [INFO]: client setup as Subject: CN=urn:node:cnDevUNM2,DC=dataone,DC=org [org.dataone.integration.ContextAwareTestCaseDataone]
20151114-05:11:39: [INFO]: creating a test object.  pid = testUpdateSystemMetadata_MutableAccessPolicy_2015317211139728 on https://mn-dev-ucsb-2.test.dataone.org/metacat/d1/mn/v2 [org.dataone.integration.ContextAwareTestCaseDataone]
20151114-05:11:39: [INFO]: SystemMetadata for pid: testUpdateSystemMetadata_MutableAccessPolicy_2015317211139728
<?xml version="1.0" encoding="UTF-8"?><d1_v2.0:systemMetadata xmlns:d1_v2.0="http://ns.dataone.org/service/types/v2.0" xmlns:d1="http://ns.dataone.org/service/types/v1"><serialVersion>1</serialVersion><identifier>testUpdateSystemMetadata_MutableAccessPolicy_2015317211139728</identifier><formatId>eml://ecoinformatics.org/eml-2.0.1</formatId><size>17181</size><checksum algorithm="MD5">03ce09c6b4c3efc1681f3023402998a2</checksum><submitter>CN=urn:node:cnDevUNM2,DC=dataone,DC=org</submitter><rightsHolder>CN=testRightsHolder,DC=dataone,DC=org</rightsHolder><accessPolicy><allow><subject>CN=testRightsHolder,DC=dataone,DC=org</subject><permission>changePermission</permission></allow></accessPolicy><dateUploaded>2015-11-14T05:11:39.745+00:00</dateUploaded><dateSysMetadataModified>2015-11-14T05:11:39.745+00:00</dateSysMetadataModified><originMemberNode>urn:node:mnDevUCSB2</originMemberNode><authoritativeMemberNode>urn:node:mnDevUCSB2</authoritativeMemberNode></d1_v2.0:systemMetadata> [org.dataone.integration.ContextAwareTestCaseDataone]
20151114-05:11:41: [INFO]: rest call info: POST https://mn-dev-ucsb-2.test.dataone.org/metacat/d1/mn/v2/object; MMP message has: ParamPart:pid = testUpdateSystemMetadata_MutableAccessPolicy_2015317211139728; FilePart:object = /tmp/mmp.output.2588205908709014025.tmp (17181 bytes); FilePart:sysmeta = /tmp/mmp.output.991545481773228775.tmp (987 bytes);  [org.dataone.client.rest.RestClient]
20151114-05:11:41: [INFO]: object created.  pid = testUpdateSystemMetadata_MutableAccessPolicy_2015317211139728 [org.dataone.integration.ContextAwareTestCaseDataone]
20151114-05:11:42: [INFO]: rest call info: GET https://mn-dev-ucsb-2.test.dataone.org/metacat/d1/mn/v2/meta/testUpdateSystemMetadata_MutableAccessPolicy_2015317211139728 [org.dataone.client.rest.RestClient]
20151114-05:11:42: [INFO]: certificate directory: /etc/dataone/client/testClientCerts/ [org.dataone.integration.ContextAwareTestCaseDataone]
20151114-05:11:42: [INFO]: certificate filename: testGroup [org.dataone.integration.ContextAwareTestCaseDataone]
20151114-05:11:42: [INFO]: client setup as Subject: public [org.dataone.integration.ContextAwareTestCaseDataone]
20151114-05:11:47: [INFO]: rest call info: PUT https://mn-dev-ucsb-2.test.dataone.org/metacat/d1/mn/v2/meta; MMP message has: ParamPart:pid = testUpdateSystemMetadata_MutableAccessPolicy_2015317211139728; FilePart:sysmeta = /tmp/mmp.output.6485924171884629891.tmp (980 bytes);  [org.dataone.client.rest.RestClient]
20151114-05:11:58: [INFO]: rest call info: GET https://mn-dev-ucsb-2.test.dataone.org/metacat/d1/mn/v2/meta/testUpdateSystemMetadata_MutableAccessPolicy_2015317211139728 [org.dataone.client.rest.RestClient]
20151114-05:11:58: [INFO]: 
***************** running test for testUpdateSystemMetadata_MutableAccessPolicy(...) vs. node: https://mn-dev-unm-2.test.dataone.org/metacat/d1/mn ***************** [org.dataone.integration.ContextAwareTestCaseDataone]
20151114-05:11:58: [INFO]: certificate directory: /etc/dataone/client/testClientCerts/ [org.dataone.integration.ContextAwareTestCaseDataone]
20151114-05:11:58: [INFO]: certificate filename: cnDevUNM2 [org.dataone.integration.ContextAwareTestCaseDataone]
20151114-05:11:58: [INFO]: client setup as Subject: CN=urn:node:cnDevUNM2,DC=dataone,DC=org [org.dataone.integration.ContextAwareTestCaseDataone]
20151114-05:11:58: [INFO]: creating a test object.  pid = testUpdateSystemMetadata_MutableAccessPolicy_2015317211158342 on https://mn-dev-unm-2.test.dataone.org/metacat/d1/mn/v2 [org.dataone.integration.ContextAwareTestCaseDataone]
20151114-05:11:58: [INFO]: SystemMetadata for pid: testUpdateSystemMetadata_MutableAccessPolicy_2015317211158342
<?xml version="1.0" encoding="UTF-8"?><d1_v2.0:systemMetadata xmlns:d1_v2.0="http://ns.dataone.org/service/types/v2.0" xmlns:d1="http://ns.dataone.org/service/types/v1"><serialVersion>1</serialVersion><identifier>testUpdateSystemMetadata_MutableAccessPolicy_2015317211158342</identifier><formatId>eml://ecoinformatics.org/eml-2.0.1</formatId><size>17181</size><checksum algorithm="MD5">03ce09c6b4c3efc1681f3023402998a2</checksum><submitter>CN=urn:node:cnDevUNM2,DC=dataone,DC=org</submitter><rightsHolder>CN=testRightsHolder,DC=dataone,DC=org</rightsHolder><accessPolicy><allow><subject>CN=testRightsHolder,DC=dataone,DC=org</subject><permission>changePermission</permission></allow></accessPolicy><dateUploaded>2015-11-14T05:11:58.358+00:00</dateUploaded><dateSysMetadataModified>2015-11-14T05:11:58.358+00:00</dateSysMetadataModified><originMemberNode>urn:node:mnDevUNM2</originMemberNode><authoritativeMemberNode>urn:node:mnDevUNM2</authoritativeMemberNode></d1_v2.0:systemMetadata> [org.dataone.integration.ContextAwareTestCaseDataone]
20151114-05:11:59: [INFO]: rest call info: POST https://mn-dev-unm-2.test.dataone.org/metacat/d1/mn/v2/object; MMP message has: ParamPart:pid = testUpdateSystemMetadata_MutableAccessPolicy_2015317211158342; FilePart:object = /tmp/mmp.output.3567916805218772722.tmp (17181 bytes); FilePart:sysmeta = /tmp/mmp.output.1435772794966284411.tmp (985 bytes);  [org.dataone.client.rest.RestClient]
20151114-05:11:59: [INFO]: object created.  pid = testUpdateSystemMetadata_MutableAccessPolicy_2015317211158342 [org.dataone.integration.ContextAwareTestCaseDataone]
20151114-05:11:59: [INFO]: rest call info: GET https://mn-dev-unm-2.test.dataone.org/metacat/d1/mn/v2/meta/testUpdateSystemMetadata_MutableAccessPolicy_2015317211158342 [org.dataone.client.rest.RestClient]
20151114-05:12:04: [INFO]: rest call info: PUT https://mn-dev-unm-2.test.dataone.org/metacat/d1/mn/v2/meta; MMP message has: ParamPart:pid = testUpdateSystemMetadata_MutableAccessPolicy_2015317211158342; FilePart:sysmeta = /tmp/mmp.output.7888806282493297609.tmp (978 bytes);  [org.dataone.client.rest.RestClient]
20151114-05:12:15: [INFO]: rest call info: GET https://mn-dev-unm-2.test.dataone.org/metacat/d1/mn/v2/meta/testUpdateSystemMetadata_MutableAccessPolicy_2015317211158342 [org.dataone.client.rest.RestClient]
20151114-05:12:15: [INFO]: **************************************************** [org.dataone.integration.ContextAwareTestCaseDataone]
20151114-05:12:15: [INFO]: ***  context label:   DEV2 [org.dataone.integration.ContextAwareTestCaseDataone]
20151114-05:12:15: [INFO]: **************************************************** [org.dataone.integration.ContextAwareTestCaseDataone]
20151114-05:12:15: [INFO]: **************************************************** [org.dataone.integration.ContextAwareTestCaseDataone]
20151114-05:12:15: [INFO]: rest call info: GET https://mn-dev-ucsb-1.test.dataone.org/metacat/d1/mn/v2/monitor/ping [org.dataone.client.rest.RestClient]
20151114-05:12:15: [INFO]: MN excluded from test: https://mn-dev-ucsb-1.test.dataone.org/metacat/d1/mn [org.dataone.integration.ContextAwareTestCaseDataone]
20151114-05:12:15: [INFO]: rest call info: GET https://mn-dev-ucsb-2.test.dataone.org/metacat/d1/mn/v2/monitor/ping [org.dataone.client.rest.RestClient]
20151114-05:12:15: [INFO]: MN included in test: https://mn-dev-ucsb-2.test.dataone.org/metacat/d1/mn [org.dataone.integration.ContextAwareTestCaseDataone]
20151114-05:12:15: [INFO]: rest call info: GET https://mn-dev-unm-1.test.dataone.org/metacat/d1/mn/v2/monitor/ping [org.dataone.client.rest.RestClient]
20151114-05:12:15: [INFO]: MN excluded from test: https://mn-dev-unm-1.test.dataone.org/metacat/d1/mn [org.dataone.integration.ContextAwareTestCaseDataone]
20151114-05:12:15: [INFO]: rest call info: GET https://mn-dev-unm-2.test.dataone.org/metacat/d1/mn/v2/monitor/ping [org.dataone.client.rest.RestClient]
20151114-05:12:15: [INFO]: MN included in test: https://mn-dev-unm-2.test.dataone.org/metacat/d1/mn [org.dataone.integration.ContextAwareTestCaseDataone]
20151114-05:12:15: [INFO]: 
***************** running test for testUpdateSystemMetadata_MutableReplPolicy(...) vs. node: https://mn-dev-ucsb-2.test.dataone.org/metacat/d1/mn ***************** [org.dataone.integration.ContextAwareTestCaseDataone]
20151114-05:12:15: [INFO]: certificate directory: /etc/dataone/client/testClientCerts/ [org.dataone.integration.ContextAwareTestCaseDataone]
20151114-05:12:15: [INFO]: certificate filename: cnDevUNM2 [org.dataone.integration.ContextAwareTestCaseDataone]
20151114-05:12:15: [INFO]: client setup as Subject: CN=urn:node:cnDevUNM2,DC=dataone,DC=org [org.dataone.integration.ContextAwareTestCaseDataone]
20151114-05:12:15: [INFO]: creating a test object.  pid = testUpdateSystemMetadata_MutableReplPolicy_2015317211215960 on https://mn-dev-ucsb-2.test.dataone.org/metacat/d1/mn/v2 [org.dataone.integration.ContextAwareTestCaseDataone]
20151114-05:12:15: [INFO]: SystemMetadata for pid: testUpdateSystemMetadata_MutableReplPolicy_2015317211215960
<?xml version="1.0" encoding="UTF-8"?><d1_v2.0:systemMetadata xmlns:d1_v2.0="http://ns.dataone.org/service/types/v2.0" xmlns:d1="http://ns.dataone.org/service/types/v1"><serialVersion>1</serialVersion><identifier>testUpdateSystemMetadata_MutableReplPolicy_2015317211215960</identifier><formatId>eml://ecoinformatics.org/eml-2.0.1</formatId><size>17181</size><checksum algorithm="MD5">03ce09c6b4c3efc1681f3023402998a2</checksum><submitter>CN=urn:node:cnDevUNM2,DC=dataone,DC=org</submitter><rightsHolder>CN=testRightsHolder,DC=dataone,DC=org</rightsHolder><accessPolicy><allow><subject>CN=testRightsHolder,DC=dataone,DC=org</subject><permission>changePermission</permission></allow></accessPolicy><dateUploaded>2015-11-14T05:12:15.975+00:00</dateUploaded><dateSysMetadataModified>2015-11-14T05:12:15.975+00:00</dateSysMetadataModified><originMemberNode>urn:node:mnDevUCSB2</originMemberNode><authoritativeMemberNode>urn:node:mnDevUCSB2</authoritativeMemberNode></d1_v2.0:systemMetadata> [org.dataone.integration.ContextAwareTestCaseDataone]
20151114-05:12:17: [INFO]: rest call info: POST https://mn-dev-ucsb-2.test.dataone.org/metacat/d1/mn/v2/object; MMP message has: ParamPart:pid = testUpdateSystemMetadata_MutableReplPolicy_2015317211215960; FilePart:object = /tmp/mmp.output.8727829807973292467.tmp (17181 bytes); FilePart:sysmeta = /tmp/mmp.output.482761239316598612.tmp (985 bytes);  [org.dataone.client.rest.RestClient]
20151114-05:12:17: [INFO]: object created.  pid = testUpdateSystemMetadata_MutableReplPolicy_2015317211215960 [org.dataone.integration.ContextAwareTestCaseDataone]
20151114-05:12:17: [INFO]: rest call info: GET https://mn-dev-ucsb-2.test.dataone.org/metacat/d1/mn/v2/meta/testUpdateSystemMetadata_MutableReplPolicy_2015317211215960 [org.dataone.client.rest.RestClient]
20151114-05:12:23: [INFO]: rest call info: PUT https://mn-dev-ucsb-2.test.dataone.org/metacat/d1/mn/v2/meta; MMP message has: ParamPart:pid = testUpdateSystemMetadata_MutableReplPolicy_2015317211215960; FilePart:sysmeta = /tmp/mmp.output.1900944069816542170.tmp (1076 bytes);  [org.dataone.client.rest.RestClient]
20151114-05:12:52: [INFO]: rest call info: GET https://mn-dev-ucsb-2.test.dataone.org/metacat/d1/mn/v2/meta/testUpdateSystemMetadata_MutableReplPolicy_2015317211215960 [org.dataone.client.rest.RestClient]
20151114-05:12:52: [INFO]: 
***************** running test for testUpdateSystemMetadata_MutableReplPolicy(...) vs. node: https://mn-dev-unm-2.test.dataone.org/metacat/d1/mn ***************** [org.dataone.integration.ContextAwareTestCaseDataone]
20151114-05:12:52: [INFO]: certificate directory: /etc/dataone/client/testClientCerts/ [org.dataone.integration.ContextAwareTestCaseDataone]
20151114-05:12:52: [INFO]: certificate filename: cnDevUNM2 [org.dataone.integration.ContextAwareTestCaseDataone]
20151114-05:12:52: [INFO]: client setup as Subject: CN=urn:node:cnDevUNM2,DC=dataone,DC=org [org.dataone.integration.ContextAwareTestCaseDataone]
20151114-05:12:52: [INFO]: creating a test object.  pid = testUpdateSystemMetadata_MutableReplPolicy_201531721125268 on https://mn-dev-unm-2.test.dataone.org/metacat/d1/mn/v2 [org.dataone.integration.ContextAwareTestCaseDataone]
20151114-05:12:52: [INFO]: SystemMetadata for pid: testUpdateSystemMetadata_MutableReplPolicy_201531721125268
<?xml version="1.0" encoding="UTF-8"?><d1_v2.0:systemMetadata xmlns:d1_v2.0="http://ns.dataone.org/service/types/v2.0" xmlns:d1="http://ns.dataone.org/service/types/v1"><serialVersion>1</serialVersion><identifier>testUpdateSystemMetadata_MutableReplPolicy_201531721125268</identifier><formatId>eml://ecoinformatics.org/eml-2.0.1</formatId><size>17181</size><checksum algorithm="MD5">03ce09c6b4c3efc1681f3023402998a2</checksum><submitter>CN=urn:node:cnDevUNM2,DC=dataone,DC=org</submitter><rightsHolder>CN=testRightsHolder,DC=dataone,DC=org</rightsHolder><accessPolicy><allow><subject>CN=testRightsHolder,DC=dataone,DC=org</subject><permission>changePermission</permission></allow></accessPolicy><dateUploaded>2015-11-14T05:12:52.083+00:00</dateUploaded><dateSysMetadataModified>2015-11-14T05:12:52.083+00:00</dateSysMetadataModified><originMemberNode>urn:node:mnDevUNM2</originMemberNode><authoritativeMemberNode>urn:node:mnDevUNM2</authoritativeMemberNode></d1_v2.0:systemMetadata> [org.dataone.integration.ContextAwareTestCaseDataone]
20151114-05:12:53: [INFO]: rest call info: POST https://mn-dev-unm-2.test.dataone.org/metacat/d1/mn/v2/object; MMP message has: ParamPart:pid = testUpdateSystemMetadata_MutableReplPolicy_201531721125268; FilePart:object = /tmp/mmp.output.7683567238944641443.tmp (17181 bytes); FilePart:sysmeta = /tmp/mmp.output.2480567988232017135.tmp (982 bytes);  [org.dataone.client.rest.RestClient]
20151114-05:12:53: [INFO]: object created.  pid = testUpdateSystemMetadata_MutableReplPolicy_201531721125268 [org.dataone.integration.ContextAwareTestCaseDataone]
20151114-05:12:53: [INFO]: rest call info: GET https://mn-dev-unm-2.test.dataone.org/metacat/d1/mn/v2/meta/testUpdateSystemMetadata_MutableReplPolicy_201531721125268 [org.dataone.client.rest.RestClient]
20151114-05:12:58: [INFO]: rest call info: PUT https://mn-dev-unm-2.test.dataone.org/metacat/d1/mn/v2/meta; MMP message has: ParamPart:pid = testUpdateSystemMetadata_MutableReplPolicy_201531721125268; FilePart:sysmeta = /tmp/mmp.output.5594209914696149600.tmp (1073 bytes);  [org.dataone.client.rest.RestClient]
20151114-05:13:09: [INFO]: rest call info: GET https://mn-dev-unm-2.test.dataone.org/metacat/d1/mn/v2/meta/testUpdateSystemMetadata_MutableReplPolicy_201531721125268 [org.dataone.client.rest.RestClient]
20151114-05:13:09: [INFO]: **************************************************** [org.dataone.integration.ContextAwareTestCaseDataone]
20151114-05:13:09: [INFO]: ***  context label:   DEV2 [org.dataone.integration.ContextAwareTestCaseDataone]
20151114-05:13:09: [INFO]: **************************************************** [org.dataone.integration.ContextAwareTestCaseDataone]
20151114-05:13:09: [INFO]: **************************************************** [org.dataone.integration.ContextAwareTestCaseDataone]
20151114-05:13:09: [INFO]: rest call info: GET https://mn-dev-ucsb-1.test.dataone.org/metacat/d1/mn/v2/monitor/ping [org.dataone.client.rest.RestClient]
20151114-05:13:09: [INFO]: MN excluded from test: https://mn-dev-ucsb-1.test.dataone.org/metacat/d1/mn [org.dataone.integration.ContextAwareTestCaseDataone]
20151114-05:13:09: [INFO]: rest call info: GET https://mn-dev-ucsb-2.test.dataone.org/metacat/d1/mn/v2/monitor/ping [org.dataone.client.rest.RestClient]
20151114-05:13:09: [INFO]: MN included in test: https://mn-dev-ucsb-2.test.dataone.org/metacat/d1/mn [org.dataone.integration.ContextAwareTestCaseDataone]
20151114-05:13:09: [INFO]: rest call info: GET https://mn-dev-unm-1.test.dataone.org/metacat/d1/mn/v2/monitor/ping [org.dataone.client.rest.RestClient]
20151114-05:13:09: [INFO]: MN excluded from test: https://mn-dev-unm-1.test.dataone.org/metacat/d1/mn [org.dataone.integration.ContextAwareTestCaseDataone]
20151114-05:13:09: [INFO]: rest call info: GET https://mn-dev-unm-2.test.dataone.org/metacat/d1/mn/v2/monitor/ping [org.dataone.client.rest.RestClient]
20151114-05:13:09: [INFO]: MN included in test: https://mn-dev-unm-2.test.dataone.org/metacat/d1/mn [org.dataone.integration.ContextAwareTestCaseDataone]
20151114-05:13:09: [INFO]: 
***************** running test for testUpdateSystemMetadata_MutableAuthMN(...) vs. node: https://mn-dev-ucsb-2.test.dataone.org/metacat/d1/mn ***************** [org.dataone.integration.ContextAwareTestCaseDataone]
20151114-05:13:09: [INFO]: certificate directory: /etc/dataone/client/testClientCerts/ [org.dataone.integration.ContextAwareTestCaseDataone]
20151114-05:13:09: [INFO]: certificate filename: cnDevUNM2 [org.dataone.integration.ContextAwareTestCaseDataone]
20151114-05:13:09: [INFO]: client setup as Subject: CN=urn:node:cnDevUNM2,DC=dataone,DC=org [org.dataone.integration.ContextAwareTestCaseDataone]
20151114-05:13:09: [INFO]: creating a test object.  pid = testUpdateSystemMetadata_MutableAuthMN_201531721139835 on https://mn-dev-ucsb-2.test.dataone.org/metacat/d1/mn/v2 [org.dataone.integration.ContextAwareTestCaseDataone]
20151114-05:13:09: [INFO]: SystemMetadata for pid: testUpdateSystemMetadata_MutableAuthMN_201531721139835
<?xml version="1.0" encoding="UTF-8"?><d1_v2.0:systemMetadata xmlns:d1_v2.0="http://ns.dataone.org/service/types/v2.0" xmlns:d1="http://ns.dataone.org/service/types/v1"><serialVersion>1</serialVersion><identifier>testUpdateSystemMetadata_MutableAuthMN_201531721139835</identifier><formatId>eml://ecoinformatics.org/eml-2.0.1</formatId><size>17181</size><checksum algorithm="MD5">03ce09c6b4c3efc1681f3023402998a2</checksum><submitter>CN=urn:node:cnDevUNM2,DC=dataone,DC=org</submitter><rightsHolder>CN=testRightsHolder,DC=dataone,DC=org</rightsHolder><accessPolicy><allow><subject>CN=testRightsHolder,DC=dataone,DC=org</subject><permission>changePermission</permission></allow></accessPolicy><dateUploaded>2015-11-14T05:13:09.850+00:00</dateUploaded><dateSysMetadataModified>2015-11-14T05:13:09.850+00:00</dateSysMetadataModified><originMemberNode>urn:node:mnDevUCSB2</originMemberNode><authoritativeMemberNode>urn:node:mnDevUCSB2</authoritativeMemberNode></d1_v2.0:systemMetadata> [org.dataone.integration.ContextAwareTestCaseDataone]
20151114-05:13:11: [INFO]: rest call info: POST https://mn-dev-ucsb-2.test.dataone.org/metacat/d1/mn/v2/object; MMP message has: ParamPart:pid = testUpdateSystemMetadata_MutableAuthMN_201531721139835; FilePart:object = /tmp/mmp.output.5843884871076406869.tmp (17181 bytes); FilePart:sysmeta = /tmp/mmp.output.5427283868476346345.tmp (980 bytes);  [org.dataone.client.rest.RestClient]
20151114-05:13:11: [INFO]: object created.  pid = testUpdateSystemMetadata_MutableAuthMN_201531721139835 [org.dataone.integration.ContextAwareTestCaseDataone]
20151114-05:13:12: [INFO]: rest call info: GET https://mn-dev-ucsb-2.test.dataone.org/metacat/d1/mn/v2/meta/testUpdateSystemMetadata_MutableAuthMN_201531721139835 [org.dataone.client.rest.RestClient]
20151114-05:13:12: [INFO]: rest call info: GET https://cn-dev-ucsb-2.test.dataone.org/cn/v2/node [org.dataone.client.rest.RestClient]
20151114-05:13:12: [WARN]: MN.updateSystemMetadata() returned a ServiceFailure. [org.dataone.integration.it.ContextAwareAdapter]
20151114-05:13:12: [INFO]: 
***************** running test for testUpdateSystemMetadata_MutableAuthMN(...) vs. node: https://mn-dev-unm-2.test.dataone.org/metacat/d1/mn ***************** [org.dataone.integration.ContextAwareTestCaseDataone]
20151114-05:13:12: [INFO]: certificate directory: /etc/dataone/client/testClientCerts/ [org.dataone.integration.ContextAwareTestCaseDataone]
20151114-05:13:12: [INFO]: certificate filename: cnDevUNM2 [org.dataone.integration.ContextAwareTestCaseDataone]
20151114-05:13:12: [INFO]: client setup as Subject: CN=urn:node:cnDevUNM2,DC=dataone,DC=org [org.dataone.integration.ContextAwareTestCaseDataone]
20151114-05:13:12: [INFO]: creating a test object.  pid = testUpdateSystemMetadata_MutableAuthMN_2015317211312435 on https://mn-dev-unm-2.test.dataone.org/metacat/d1/mn/v2 [org.dataone.integration.ContextAwareTestCaseDataone]
20151114-05:13:12: [INFO]: SystemMetadata for pid: testUpdateSystemMetadata_MutableAuthMN_2015317211312435
<?xml version="1.0" encoding="UTF-8"?><d1_v2.0:systemMetadata xmlns:d1_v2.0="http://ns.dataone.org/service/types/v2.0" xmlns:d1="http://ns.dataone.org/service/types/v1"><serialVersion>1</serialVersion><identifier>testUpdateSystemMetadata_MutableAuthMN_2015317211312435</identifier><formatId>eml://ecoinformatics.org/eml-2.0.1</formatId><size>17181</size><checksum algorithm="MD5">03ce09c6b4c3efc1681f3023402998a2</checksum><submitter>CN=urn:node:cnDevUNM2,DC=dataone,DC=org</submitter><rightsHolder>CN=testRightsHolder,DC=dataone,DC=org</rightsHolder><accessPolicy><allow><subject>CN=testRightsHolder,DC=dataone,DC=org</subject><permission>changePermission</permission></allow></accessPolicy><dateUploaded>2015-11-14T05:13:12.450+00:00</dateUploaded><dateSysMetadataModified>2015-11-14T05:13:12.450+00:00</dateSysMetadataModified><originMemberNode>urn:node:mnDevUNM2</originMemberNode><authoritativeMemberNode>urn:node:mnDevUNM2</authoritativeMemberNode></d1_v2.0:systemMetadata> [org.dataone.integration.ContextAwareTestCaseDataone]
20151114-05:13:13: [INFO]: rest call info: POST https://mn-dev-unm-2.test.dataone.org/metacat/d1/mn/v2/object; MMP message has: ParamPart:pid = testUpdateSystemMetadata_MutableAuthMN_2015317211312435; FilePart:object = /tmp/mmp.output.4785427870040790978.tmp (17181 bytes); FilePart:sysmeta = /tmp/mmp.output.1922043054273107721.tmp (979 bytes);  [org.dataone.client.rest.RestClient]
20151114-05:13:13: [INFO]: object created.  pid = testUpdateSystemMetadata_MutableAuthMN_2015317211312435 [org.dataone.integration.ContextAwareTestCaseDataone]
20151114-05:13:13: [INFO]: rest call info: GET https://mn-dev-unm-2.test.dataone.org/metacat/d1/mn/v2/meta/testUpdateSystemMetadata_MutableAuthMN_2015317211312435 [org.dataone.client.rest.RestClient]
20151114-05:13:13: [INFO]: rest call info: GET https://cn-dev-ucsb-2.test.dataone.org/cn/v2/node [org.dataone.client.rest.RestClient]
20151114-05:13:13: [WARN]: MN.updateSystemMetadata() returned a ServiceFailure. [org.dataone.integration.it.ContextAwareAdapter]
20151114-05:13:13: [INFO]: **************************************************** [org.dataone.integration.ContextAwareTestCaseDataone]
20151114-05:13:13: [INFO]: ***  context label:   DEV2 [org.dataone.integration.ContextAwareTestCaseDataone]
20151114-05:13:13: [INFO]: **************************************************** [org.dataone.integration.ContextAwareTestCaseDataone]
20151114-05:13:13: [INFO]: **************************************************** [org.dataone.integration.ContextAwareTestCaseDataone]
20151114-05:13:13: [INFO]: rest call info: GET https://mn-dev-ucsb-1.test.dataone.org/metacat/d1/mn/v2/monitor/ping [org.dataone.client.rest.RestClient]
20151114-05:13:13: [INFO]: MN excluded from test: https://mn-dev-ucsb-1.test.dataone.org/metacat/d1/mn [org.dataone.integration.ContextAwareTestCaseDataone]
20151114-05:13:14: [INFO]: rest call info: GET https://mn-dev-ucsb-2.test.dataone.org/metacat/d1/mn/v2/monitor/ping [org.dataone.client.rest.RestClient]
20151114-05:13:14: [INFO]: MN included in test: https://mn-dev-ucsb-2.test.dataone.org/metacat/d1/mn [org.dataone.integration.ContextAwareTestCaseDataone]
20151114-05:13:14: [INFO]: rest call info: GET https://mn-dev-unm-1.test.dataone.org/metacat/d1/mn/v2/monitor/ping [org.dataone.client.rest.RestClient]
20151114-05:13:14: [INFO]: MN excluded from test: https://mn-dev-unm-1.test.dataone.org/metacat/d1/mn [org.dataone.integration.ContextAwareTestCaseDataone]
20151114-05:13:14: [INFO]: rest call info: GET https://mn-dev-unm-2.test.dataone.org/metacat/d1/mn/v2/monitor/ping [org.dataone.client.rest.RestClient]
20151114-05:13:14: [INFO]: MN included in test: https://mn-dev-unm-2.test.dataone.org/metacat/d1/mn [org.dataone.integration.ContextAwareTestCaseDataone]
20151114-05:13:14: [INFO]: 
***************** running test for testUpdateSystemMetadata_MutableArchived(...) vs. node: https://mn-dev-ucsb-2.test.dataone.org/metacat/d1/mn ***************** [org.dataone.integration.ContextAwareTestCaseDataone]
20151114-05:13:14: [INFO]: certificate directory: /etc/dataone/client/testClientCerts/ [org.dataone.integration.ContextAwareTestCaseDataone]
20151114-05:13:14: [INFO]: certificate filename: cnDevUNM2 [org.dataone.integration.ContextAwareTestCaseDataone]
20151114-05:13:14: [INFO]: client setup as Subject: CN=urn:node:cnDevUNM2,DC=dataone,DC=org [org.dataone.integration.ContextAwareTestCaseDataone]
20151114-05:13:14: [INFO]: creating a test object.  pid = testUpdateSystemMetadata_MutableArchived_2015317211314129 on https://mn-dev-ucsb-2.test.dataone.org/metacat/d1/mn/v2 [org.dataone.integration.ContextAwareTestCaseDataone]
20151114-05:13:14: [INFO]: SystemMetadata for pid: testUpdateSystemMetadata_MutableArchived_2015317211314129
<?xml version="1.0" encoding="UTF-8"?><d1_v2.0:systemMetadata xmlns:d1_v2.0="http://ns.dataone.org/service/types/v2.0" xmlns:d1="http://ns.dataone.org/service/types/v1"><serialVersion>1</serialVersion><identifier>testUpdateSystemMetadata_MutableArchived_2015317211314129</identifier><formatId>eml://ecoinformatics.org/eml-2.0.1</formatId><size>17181</size><checksum algorithm="MD5">03ce09c6b4c3efc1681f3023402998a2</checksum><submitter>CN=urn:node:cnDevUNM2,DC=dataone,DC=org</submitter><rightsHolder>CN=testRightsHolder,DC=dataone,DC=org</rightsHolder><accessPolicy><allow><subject>CN=testRightsHolder,DC=dataone,DC=org</subject><permission>changePermission</permission></allow></accessPolicy><dateUploaded>2015-11-14T05:13:14.143+00:00</dateUploaded><dateSysMetadataModified>2015-11-14T05:13:14.143+00:00</dateSysMetadataModified><originMemberNode>urn:node:mnDevUCSB2</originMemberNode><authoritativeMemberNode>urn:node:mnDevUCSB2</authoritativeMemberNode></d1_v2.0:systemMetadata> [org.dataone.integration.ContextAwareTestCaseDataone]
20151114-05:13:15: [INFO]: rest call info: POST https://mn-dev-ucsb-2.test.dataone.org/metacat/d1/mn/v2/object; MMP message has: ParamPart:pid = testUpdateSystemMetadata_MutableArchived_2015317211314129; FilePart:object = /tmp/mmp.output.3903539490865769385.tmp (17181 bytes); FilePart:sysmeta = /tmp/mmp.output.3543055147474349425.tmp (983 bytes);  [org.dataone.client.rest.RestClient]
20151114-05:13:15: [INFO]: object created.  pid = testUpdateSystemMetadata_MutableArchived_2015317211314129 [org.dataone.integration.ContextAwareTestCaseDataone]
20151114-05:13:16: [INFO]: rest call info: GET https://mn-dev-ucsb-2.test.dataone.org/metacat/d1/mn/v2/meta/testUpdateSystemMetadata_MutableArchived_2015317211314129 [org.dataone.client.rest.RestClient]
20151114-05:13:22: [INFO]: rest call info: PUT https://mn-dev-ucsb-2.test.dataone.org/metacat/d1/mn/v2/meta; MMP message has: ParamPart:pid = testUpdateSystemMetadata_MutableArchived_2015317211314129; FilePart:sysmeta = /tmp/mmp.output.7511647577850945082.tmp (1006 bytes);  [org.dataone.client.rest.RestClient]
20151114-05:13:33: [INFO]: rest call info: GET https://mn-dev-ucsb-2.test.dataone.org/metacat/d1/mn/v2/meta/testUpdateSystemMetadata_MutableArchived_2015317211314129 [org.dataone.client.rest.RestClient]
20151114-05:13:33: [INFO]: 
***************** running test for testUpdateSystemMetadata_MutableArchived(...) vs. node: https://mn-dev-unm-2.test.dataone.org/metacat/d1/mn ***************** [org.dataone.integration.ContextAwareTestCaseDataone]
20151114-05:13:33: [INFO]: certificate directory: /etc/dataone/client/testClientCerts/ [org.dataone.integration.ContextAwareTestCaseDataone]
20151114-05:13:33: [INFO]: certificate filename: cnDevUNM2 [org.dataone.integration.ContextAwareTestCaseDataone]
20151114-05:13:33: [INFO]: client setup as Subject: CN=urn:node:cnDevUNM2,DC=dataone,DC=org [org.dataone.integration.ContextAwareTestCaseDataone]
20151114-05:13:33: [INFO]: creating a test object.  pid = testUpdateSystemMetadata_MutableArchived_201531721133353 on https://mn-dev-unm-2.test.dataone.org/metacat/d1/mn/v2 [org.dataone.integration.ContextAwareTestCaseDataone]
20151114-05:13:33: [INFO]: SystemMetadata for pid: testUpdateSystemMetadata_MutableArchived_201531721133353
<?xml version="1.0" encoding="UTF-8"?><d1_v2.0:systemMetadata xmlns:d1_v2.0="http://ns.dataone.org/service/types/v2.0" xmlns:d1="http://ns.dataone.org/service/types/v1"><serialVersion>1</serialVersion><identifier>testUpdateSystemMetadata_MutableArchived_201531721133353</identifier><formatId>eml://ecoinformatics.org/eml-2.0.1</formatId><size>17181</size><checksum algorithm="MD5">03ce09c6b4c3efc1681f3023402998a2</checksum><submitter>CN=urn:node:cnDevUNM2,DC=dataone,DC=org</submitter><rightsHolder>CN=testRightsHolder,DC=dataone,DC=org</rightsHolder><accessPolicy><allow><subject>CN=testRightsHolder,DC=dataone,DC=org</subject><permission>changePermission</permission></allow></accessPolicy><dateUploaded>2015-11-14T05:13:33.070+00:00</dateUploaded><dateSysMetadataModified>2015-11-14T05:13:33.070+00:00</dateSysMetadataModified><originMemberNode>urn:node:mnDevUNM2</originMemberNode><authoritativeMemberNode>urn:node:mnDevUNM2</authoritativeMemberNode></d1_v2.0:systemMetadata> [org.dataone.integration.ContextAwareTestCaseDataone]
20151114-05:13:34: [INFO]: rest call info: POST https://mn-dev-unm-2.test.dataone.org/metacat/d1/mn/v2/object; MMP message has: ParamPart:pid = testUpdateSystemMetadata_MutableArchived_201531721133353; FilePart:object = /tmp/mmp.output.3151675315102281737.tmp (17181 bytes); FilePart:sysmeta = /tmp/mmp.output.7089916128784462079.tmp (980 bytes);  [org.dataone.client.rest.RestClient]
20151114-05:13:34: [INFO]: object created.  pid = testUpdateSystemMetadata_MutableArchived_201531721133353 [org.dataone.integration.ContextAwareTestCaseDataone]
20151114-05:13:34: [INFO]: rest call info: GET https://mn-dev-unm-2.test.dataone.org/metacat/d1/mn/v2/meta/testUpdateSystemMetadata_MutableArchived_201531721133353 [org.dataone.client.rest.RestClient]
20151114-05:13:35: [INFO]: rest call info: PUT https://mn-dev-unm-2.test.dataone.org/metacat/d1/mn/v2/meta; MMP message has: ParamPart:pid = testUpdateSystemMetadata_MutableArchived_201531721133353; FilePart:sysmeta = /tmp/mmp.output.2453323929468609913.tmp (1003 bytes);  [org.dataone.client.rest.RestClient]
20151114-05:13:35: [WARN]: MN.updateSystemMetadata() returned a ServiceFailure. [org.dataone.integration.it.ContextAwareAdapter]
20151114-05:13:35: [INFO]: **************************************************** [org.dataone.integration.ContextAwareTestCaseDataone]
20151114-05:13:35: [INFO]: ***  context label:   DEV2 [org.dataone.integration.ContextAwareTestCaseDataone]
20151114-05:13:35: [INFO]: **************************************************** [org.dataone.integration.ContextAwareTestCaseDataone]
20151114-05:13:35: [INFO]: **************************************************** [org.dataone.integration.ContextAwareTestCaseDataone]
20151114-05:13:35: [INFO]: rest call info: GET https://mn-dev-ucsb-1.test.dataone.org/metacat/d1/mn/v2/monitor/ping [org.dataone.client.rest.RestClient]
20151114-05:13:35: [INFO]: MN excluded from test: https://mn-dev-ucsb-1.test.dataone.org/metacat/d1/mn [org.dataone.integration.ContextAwareTestCaseDataone]
20151114-05:13:35: [INFO]: rest call info: GET https://mn-dev-ucsb-2.test.dataone.org/metacat/d1/mn/v2/monitor/ping [org.dataone.client.rest.RestClient]
20151114-05:13:35: [INFO]: MN included in test: https://mn-dev-ucsb-2.test.dataone.org/metacat/d1/mn [org.dataone.integration.ContextAwareTestCaseDataone]
20151114-05:13:35: [INFO]: rest call info: GET https://mn-dev-unm-1.test.dataone.org/metacat/d1/mn/v2/monitor/ping [org.dataone.client.rest.RestClient]
20151114-05:13:35: [INFO]: MN excluded from test: https://mn-dev-unm-1.test.dataone.org/metacat/d1/mn [org.dataone.integration.ContextAwareTestCaseDataone]
20151114-05:13:35: [INFO]: rest call info: GET https://mn-dev-unm-2.test.dataone.org/metacat/d1/mn/v2/monitor/ping [org.dataone.client.rest.RestClient]
20151114-05:13:35: [INFO]: MN included in test: https://mn-dev-unm-2.test.dataone.org/metacat/d1/mn [org.dataone.integration.ContextAwareTestCaseDataone]
20151114-05:13:35: [INFO]: 
***************** running test for testUpdateSystemMetadata_MutableAuthMN(...) vs. node: https://mn-dev-ucsb-2.test.dataone.org/metacat/d1/mn ***************** [org.dataone.integration.ContextAwareTestCaseDataone]
20151114-05:13:35: [INFO]: certificate directory: /etc/dataone/client/testClientCerts/ [org.dataone.integration.ContextAwareTestCaseDataone]
20151114-05:13:35: [INFO]: certificate filename: cnDevUNM2 [org.dataone.integration.ContextAwareTestCaseDataone]
20151114-05:13:35: [INFO]: client setup as Subject: CN=urn:node:cnDevUNM2,DC=dataone,DC=org [org.dataone.integration.ContextAwareTestCaseDataone]
20151114-05:13:35: [INFO]: creating a test object.  pid = testUpdateSystemMetadata_MutableAuthMN_2015317211335413 on https://mn-dev-ucsb-2.test.dataone.org/metacat/d1/mn/v2 [org.dataone.integration.ContextAwareTestCaseDataone]
20151114-05:13:35: [INFO]: SystemMetadata for pid: testUpdateSystemMetadata_MutableAuthMN_2015317211335413
<?xml version="1.0" encoding="UTF-8"?><d1_v2.0:systemMetadata xmlns:d1_v2.0="http://ns.dataone.org/service/types/v2.0" xmlns:d1="http://ns.dataone.org/service/types/v1"><serialVersion>1</serialVersion><identifier>testUpdateSystemMetadata_MutableAuthMN_2015317211335413</identifier><formatId>eml://ecoinformatics.org/eml-2.0.1</formatId><size>17181</size><checksum algorithm="MD5">03ce09c6b4c3efc1681f3023402998a2</checksum><submitter>CN=urn:node:cnDevUNM2,DC=dataone,DC=org</submitter><rightsHolder>CN=testRightsHolder,DC=dataone,DC=org</rightsHolder><accessPolicy><allow><subject>CN=testRightsHolder,DC=dataone,DC=org</subject><permission>changePermission</permission></allow></accessPolicy><dateUploaded>2015-11-14T05:13:35.430+00:00</dateUploaded><dateSysMetadataModified>2015-11-14T05:13:35.430+00:00</dateSysMetadataModified><originMemberNode>urn:node:mnDevUCSB2</originMemberNode><authoritativeMemberNode>urn:node:mnDevUCSB2</authoritativeMemberNode></d1_v2.0:systemMetadata> [org.dataone.integration.ContextAwareTestCaseDataone]
20151114-05:13:36: [INFO]: rest call info: POST https://mn-dev-ucsb-2.test.dataone.org/metacat/d1/mn/v2/object; MMP message has: ParamPart:pid = testUpdateSystemMetadata_MutableAuthMN_2015317211335413; FilePart:object = /tmp/mmp.output.1067714007421984453.tmp (17181 bytes); FilePart:sysmeta = /tmp/mmp.output.6309478417311755925.tmp (981 bytes);  [org.dataone.client.rest.RestClient]
20151114-05:13:36: [INFO]: object created.  pid = testUpdateSystemMetadata_MutableAuthMN_2015317211335413 [org.dataone.integration.ContextAwareTestCaseDataone]
20151114-05:13:37: [INFO]: rest call info: GET https://mn-dev-ucsb-2.test.dataone.org/metacat/d1/mn/v2/meta/testUpdateSystemMetadata_MutableAuthMN_2015317211335413 [org.dataone.client.rest.RestClient]
20151114-05:13:37: [INFO]: rest call info: GET https://cn-dev-ucsb-2.test.dataone.org/cn/v2/node [org.dataone.client.rest.RestClient]
20151114-05:13:37: [WARN]: MN.updateSystemMetadata() returned a ServiceFailure, was expecting an InvalidRequest or NotAuthorized. [org.dataone.integration.it.ContextAwareAdapter]
20151114-05:13:37: [INFO]: 
***************** running test for testUpdateSystemMetadata_MutableAuthMN(...) vs. node: https://mn-dev-unm-2.test.dataone.org/metacat/d1/mn ***************** [org.dataone.integration.ContextAwareTestCaseDataone]
20151114-05:13:37: [INFO]: certificate directory: /etc/dataone/client/testClientCerts/ [org.dataone.integration.ContextAwareTestCaseDataone]
20151114-05:13:37: [INFO]: certificate filename: cnDevUNM2 [org.dataone.integration.ContextAwareTestCaseDataone]
20151114-05:13:37: [INFO]: client setup as Subject: CN=urn:node:cnDevUNM2,DC=dataone,DC=org [org.dataone.integration.ContextAwareTestCaseDataone]
20151114-05:13:37: [INFO]: creating a test object.  pid = testUpdateSystemMetadata_MutableAuthMN_2015317211337376 on https://mn-dev-unm-2.test.dataone.org/metacat/d1/mn/v2 [org.dataone.integration.ContextAwareTestCaseDataone]
20151114-05:13:37: [INFO]: SystemMetadata for pid: testUpdateSystemMetadata_MutableAuthMN_2015317211337376
<?xml version="1.0" encoding="UTF-8"?><d1_v2.0:systemMetadata xmlns:d1_v2.0="http://ns.dataone.org/service/types/v2.0" xmlns:d1="http://ns.dataone.org/service/types/v1"><serialVersion>1</serialVersion><identifier>testUpdateSystemMetadata_MutableAuthMN_2015317211337376</identifier><formatId>eml://ecoinformatics.org/eml-2.0.1</formatId><size>17181</size><checksum algorithm="MD5">03ce09c6b4c3efc1681f3023402998a2</checksum><submitter>CN=urn:node:cnDevUNM2,DC=dataone,DC=org</submitter><rightsHolder>CN=testRightsHolder,DC=dataone,DC=org</rightsHolder><accessPolicy><allow><subject>CN=testRightsHolder,DC=dataone,DC=org</subject><permission>changePermission</permission></allow></accessPolicy><dateUploaded>2015-11-14T05:13:37.392+00:00</dateUploaded><dateSysMetadataModified>2015-11-14T05:13:37.392+00:00</dateSysMetadataModified><originMemberNode>urn:node:mnDevUNM2</originMemberNode><authoritativeMemberNode>urn:node:mnDevUNM2</authoritativeMemberNode></d1_v2.0:systemMetadata> [org.dataone.integration.ContextAwareTestCaseDataone]
20151114-05:13:38: [INFO]: rest call info: POST https://mn-dev-unm-2.test.dataone.org/metacat/d1/mn/v2/object; MMP message has: ParamPart:pid = testUpdateSystemMetadata_MutableAuthMN_2015317211337376; FilePart:object = /tmp/mmp.output.5969245253571876135.tmp (17181 bytes); FilePart:sysmeta = /tmp/mmp.output.5888858993225477802.tmp (979 bytes);  [org.dataone.client.rest.RestClient]
20151114-05:13:38: [INFO]: object created.  pid = testUpdateSystemMetadata_MutableAuthMN_2015317211337376 [org.dataone.integration.ContextAwareTestCaseDataone]
20151114-05:13:38: [INFO]: rest call info: GET https://mn-dev-unm-2.test.dataone.org/metacat/d1/mn/v2/meta/testUpdateSystemMetadata_MutableAuthMN_2015317211337376 [org.dataone.client.rest.RestClient]
20151114-05:13:38: [INFO]: rest call info: GET https://cn-dev-ucsb-2.test.dataone.org/cn/v2/node [org.dataone.client.rest.RestClient]
20151114-05:13:38: [WARN]: MN.updateSystemMetadata() returned a ServiceFailure, was expecting an InvalidRequest or NotAuthorized. [org.dataone.integration.it.ContextAwareAdapter]
20151114-05:13:38: [INFO]: **************************************************** [org.dataone.integration.ContextAwareTestCaseDataone]
20151114-05:13:38: [INFO]: ***  context label:   DEV2 [org.dataone.integration.ContextAwareTestCaseDataone]
20151114-05:13:38: [INFO]: **************************************************** [org.dataone.integration.ContextAwareTestCaseDataone]
20151114-05:13:38: [INFO]: **************************************************** [org.dataone.integration.ContextAwareTestCaseDataone]
20151114-05:13:38: [INFO]: rest call info: GET https://mn-dev-ucsb-1.test.dataone.org/metacat/d1/mn/v2/monitor/ping [org.dataone.client.rest.RestClient]
20151114-05:13:38: [INFO]: MN excluded from test: https://mn-dev-ucsb-1.test.dataone.org/metacat/d1/mn [org.dataone.integration.ContextAwareTestCaseDataone]
20151114-05:13:39: [INFO]: rest call info: GET https://mn-dev-ucsb-2.test.dataone.org/metacat/d1/mn/v2/monitor/ping [org.dataone.client.rest.RestClient]
20151114-05:13:39: [INFO]: MN included in test: https://mn-dev-ucsb-2.test.dataone.org/metacat/d1/mn [org.dataone.integration.ContextAwareTestCaseDataone]
20151114-05:13:39: [INFO]: rest call info: GET https://mn-dev-unm-1.test.dataone.org/metacat/d1/mn/v2/monitor/ping [org.dataone.client.rest.RestClient]
20151114-05:13:39: [INFO]: MN excluded from test: https://mn-dev-unm-1.test.dataone.org/metacat/d1/mn [org.dataone.integration.ContextAwareTestCaseDataone]
20151114-05:13:39: [INFO]: rest call info: GET https://mn-dev-unm-2.test.dataone.org/metacat/d1/mn/v2/monitor/ping [org.dataone.client.rest.RestClient]
20151114-05:13:39: [INFO]: MN included in test: https://mn-dev-unm-2.test.dataone.org/metacat/d1/mn [org.dataone.integration.ContextAwareTestCaseDataone]
20151114-05:13:39: [INFO]: 
***************** running test for testUpdateSystemMetadata_ObsoletesFail(...) vs. node: https://mn-dev-ucsb-2.test.dataone.org/metacat/d1/mn ***************** [org.dataone.integration.ContextAwareTestCaseDataone]
20151114-05:13:39: [INFO]: certificate directory: /etc/dataone/client/testClientCerts/ [org.dataone.integration.ContextAwareTestCaseDataone]
20151114-05:13:39: [INFO]: certificate filename: cnDevUNM2 [org.dataone.integration.ContextAwareTestCaseDataone]
20151114-05:13:39: [INFO]: client setup as Subject: CN=urn:node:cnDevUNM2,DC=dataone,DC=org [org.dataone.integration.ContextAwareTestCaseDataone]
20151114-05:13:39: [INFO]: creating a test object.  pid = testUpdateSystemMetadata_ObsoletesFail_201531721133963 on https://mn-dev-ucsb-2.test.dataone.org/metacat/d1/mn/v2 [org.dataone.integration.ContextAwareTestCaseDataone]
20151114-05:13:39: [INFO]: SystemMetadata for pid: testUpdateSystemMetadata_ObsoletesFail_201531721133963
<?xml version="1.0" encoding="UTF-8"?><d1_v2.0:systemMetadata xmlns:d1_v2.0="http://ns.dataone.org/service/types/v2.0" xmlns:d1="http://ns.dataone.org/service/types/v1"><serialVersion>1</serialVersion><identifier>testUpdateSystemMetadata_ObsoletesFail_201531721133963</identifier><formatId>eml://ecoinformatics.org/eml-2.0.1</formatId><size>17181</size><checksum algorithm="MD5">03ce09c6b4c3efc1681f3023402998a2</checksum><submitter>CN=urn:node:cnDevUNM2,DC=dataone,DC=org</submitter><rightsHolder>CN=testRightsHolder,DC=dataone,DC=org</rightsHolder><accessPolicy><allow><subject>CN=testRightsHolder,DC=dataone,DC=org</subject><permission>changePermission</permission></allow></accessPolicy><dateUploaded>2015-11-14T05:13:39.082+00:00</dateUploaded><dateSysMetadataModified>2015-11-14T05:13:39.082+00:00</dateSysMetadataModified><originMemberNode>urn:node:mnDevUCSB2</originMemberNode><authoritativeMemberNode>urn:node:mnDevUCSB2</authoritativeMemberNode></d1_v2.0:systemMetadata> [org.dataone.integration.ContextAwareTestCaseDataone]
20151114-05:13:40: [INFO]: rest call info: POST https://mn-dev-ucsb-2.test.dataone.org/metacat/d1/mn/v2/object; MMP message has: ParamPart:pid = testUpdateSystemMetadata_ObsoletesFail_201531721133963; FilePart:object = /tmp/mmp.output.8911707357942842739.tmp (17181 bytes); FilePart:sysmeta = /tmp/mmp.output.876787320528249762.tmp (980 bytes);  [org.dataone.client.rest.RestClient]
20151114-05:13:40: [INFO]: object created.  pid = testUpdateSystemMetadata_ObsoletesFail_201531721133963 [org.dataone.integration.ContextAwareTestCaseDataone]
20151114-05:13:52: [INFO]: rest call info: PUT https://mn-dev-ucsb-2.test.dataone.org/metacat/d1/mn/v2/object/testUpdateSystemMetadata_ObsoletesFail_201531721133963; MMP message has: ParamPart:newPid = testUpdateSystemMetadata_ObsoletesFail_201531721133964; FilePart:object = /tmp/mmp.output.2229019179280967505.tmp (17181 bytes); FilePart:sysmeta = /tmp/mmp.output.2017882741311309746.tmp (780 bytes);  [org.dataone.client.rest.RestClient]
20151114-05:13:52: [INFO]: certificate directory: /etc/dataone/client/testClientCerts/ [org.dataone.integration.ContextAwareTestCaseDataone]
20151114-05:13:52: [INFO]: certificate filename: cnDevUNM2 [org.dataone.integration.ContextAwareTestCaseDataone]
20151114-05:13:52: [INFO]: client setup as Subject: CN=urn:node:cnDevUNM2,DC=dataone,DC=org [org.dataone.integration.ContextAwareTestCaseDataone]
20151114-05:13:52: [INFO]: creating a test object.  pid = testUpdateSystemMetadata_ObsoletesFail_201531721133966 on https://mn-dev-ucsb-2.test.dataone.org/metacat/d1/mn/v2 [org.dataone.integration.ContextAwareTestCaseDataone]
20151114-05:13:52: [INFO]: SystemMetadata for pid: testUpdateSystemMetadata_ObsoletesFail_201531721133966
<?xml version="1.0" encoding="UTF-8"?><d1_v2.0:systemMetadata xmlns:d1_v2.0="http://ns.dataone.org/service/types/v2.0" xmlns:d1="http://ns.dataone.org/service/types/v1"><serialVersion>1</serialVersion><identifier>testUpdateSystemMetadata_ObsoletesFail_201531721133966</identifier><formatId>eml://ecoinformatics.org/eml-2.0.1</formatId><size>17181</size><checksum algorithm="MD5">03ce09c6b4c3efc1681f3023402998a2</checksum><submitter>CN=urn:node:cnDevUNM2,DC=dataone,DC=org</submitter><rightsHolder>CN=testRightsHolder,DC=dataone,DC=org</rightsHolder><accessPolicy><allow><subject>CN=testRightsHolder,DC=dataone,DC=org</subject><permission>changePermission</permission></allow></accessPolicy><dateUploaded>2015-11-14T05:13:52.428+00:00</dateUploaded><dateSysMetadataModified>2015-11-14T05:13:52.428+00:00</dateSysMetadataModified><originMemberNode>urn:node:mnDevUCSB2</originMemberNode><authoritativeMemberNode>urn:node:mnDevUCSB2</authoritativeMemberNode></d1_v2.0:systemMetadata> [org.dataone.integration.ContextAwareTestCaseDataone]
20151114-05:13:53: [INFO]: rest call info: POST https://mn-dev-ucsb-2.test.dataone.org/metacat/d1/mn/v2/object; MMP message has: ParamPart:pid = testUpdateSystemMetadata_ObsoletesFail_201531721133966; FilePart:object = /tmp/mmp.output.6016970663130121773.tmp (17181 bytes); FilePart:sysmeta = /tmp/mmp.output.5826802336944223360.tmp (980 bytes);  [org.dataone.client.rest.RestClient]
20151114-05:13:53: [INFO]: object created.  pid = testUpdateSystemMetadata_ObsoletesFail_201531721133966 [org.dataone.integration.ContextAwareTestCaseDataone]
20151114-05:14:04: [INFO]: rest call info: GET https://mn-dev-ucsb-2.test.dataone.org/metacat/d1/mn/v2/meta/testUpdateSystemMetadata_ObsoletesFail_201531721133964 [org.dataone.client.rest.RestClient]
20151114-05:14:04: [INFO]: rest call info: PUT https://mn-dev-ucsb-2.test.dataone.org/metacat/d1/mn/v2/meta; MMP message has: ParamPart:pid = testUpdateSystemMetadata_ObsoletesFail_201531721133964; FilePart:sysmeta = /tmp/mmp.output.1247393935910798598.tmp (914 bytes);  [org.dataone.client.rest.RestClient]
20151114-05:14:04: [INFO]: 
***************** running test for testUpdateSystemMetadata_ObsoletesFail(...) vs. node: https://mn-dev-unm-2.test.dataone.org/metacat/d1/mn ***************** [org.dataone.integration.ContextAwareTestCaseDataone]
20151114-05:14:04: [INFO]: certificate directory: /etc/dataone/client/testClientCerts/ [org.dataone.integration.ContextAwareTestCaseDataone]
20151114-05:14:04: [INFO]: certificate filename: cnDevUNM2 [org.dataone.integration.ContextAwareTestCaseDataone]
20151114-05:14:04: [INFO]: client setup as Subject: CN=urn:node:cnDevUNM2,DC=dataone,DC=org [org.dataone.integration.ContextAwareTestCaseDataone]
20151114-05:14:04: [INFO]: creating a test object.  pid = testUpdateSystemMetadata_ObsoletesFail_201531721144831 on https://mn-dev-unm-2.test.dataone.org/metacat/d1/mn/v2 [org.dataone.integration.ContextAwareTestCaseDataone]
20151114-05:14:04: [INFO]: SystemMetadata for pid: testUpdateSystemMetadata_ObsoletesFail_201531721144831
<?xml version="1.0" encoding="UTF-8"?><d1_v2.0:systemMetadata xmlns:d1_v2.0="http://ns.dataone.org/service/types/v2.0" xmlns:d1="http://ns.dataone.org/service/types/v1"><serialVersion>1</serialVersion><identifier>testUpdateSystemMetadata_ObsoletesFail_201531721144831</identifier><formatId>eml://ecoinformatics.org/eml-2.0.1</formatId><size>17181</size><checksum algorithm="MD5">03ce09c6b4c3efc1681f3023402998a2</checksum><submitter>CN=urn:node:cnDevUNM2,DC=dataone,DC=org</submitter><rightsHolder>CN=testRightsHolder,DC=dataone,DC=org</rightsHolder><accessPolicy><allow><subject>CN=testRightsHolder,DC=dataone,DC=org</subject><permission>changePermission</permission></allow></accessPolicy><dateUploaded>2015-11-14T05:14:04.849+00:00</dateUploaded><dateSysMetadataModified>2015-11-14T05:14:04.849+00:00</dateSysMetadataModified><originMemberNode>urn:node:mnDevUNM2</originMemberNode><authoritativeMemberNode>urn:node:mnDevUNM2</authoritativeMemberNode></d1_v2.0:systemMetadata> [org.dataone.integration.ContextAwareTestCaseDataone]
20151114-05:14:06: [INFO]: rest call info: POST https://mn-dev-unm-2.test.dataone.org/metacat/d1/mn/v2/object; MMP message has: ParamPart:pid = testUpdateSystemMetadata_ObsoletesFail_201531721144831; FilePart:object = /tmp/mmp.output.8139866995034547951.tmp (17181 bytes); FilePart:sysmeta = /tmp/mmp.output.2333315206845640199.tmp (978 bytes);  [org.dataone.client.rest.RestClient]
20151114-05:14:06: [INFO]: object created.  pid = testUpdateSystemMetadata_ObsoletesFail_201531721144831 [org.dataone.integration.ContextAwareTestCaseDataone]
20151114-05:14:17: [INFO]: rest call info: PUT https://mn-dev-unm-2.test.dataone.org/metacat/d1/mn/v2/object/testUpdateSystemMetadata_ObsoletesFail_201531721144831; MMP message has: ParamPart:newPid = testUpdateSystemMetadata_ObsoletesFail_201531721144832; FilePart:object = /tmp/mmp.output.1964218051373213520.tmp (17181 bytes); FilePart:sysmeta = /tmp/mmp.output.5504614774337020960.tmp (779 bytes);  [org.dataone.client.rest.RestClient]
20151114-05:14:17: [INFO]: certificate directory: /etc/dataone/client/testClientCerts/ [org.dataone.integration.ContextAwareTestCaseDataone]
20151114-05:14:17: [INFO]: certificate filename: cnDevUNM2 [org.dataone.integration.ContextAwareTestCaseDataone]
20151114-05:14:17: [INFO]: client setup as Subject: CN=urn:node:cnDevUNM2,DC=dataone,DC=org [org.dataone.integration.ContextAwareTestCaseDataone]
20151114-05:14:17: [INFO]: creating a test object.  pid = testUpdateSystemMetadata_ObsoletesFail_201531721144833 on https://mn-dev-unm-2.test.dataone.org/metacat/d1/mn/v2 [org.dataone.integration.ContextAwareTestCaseDataone]
20151114-05:14:17: [INFO]: SystemMetadata for pid: testUpdateSystemMetadata_ObsoletesFail_201531721144833
<?xml version="1.0" encoding="UTF-8"?><d1_v2.0:systemMetadata xmlns:d1_v2.0="http://ns.dataone.org/service/types/v2.0" xmlns:d1="http://ns.dataone.org/service/types/v1"><serialVersion>1</serialVersion><identifier>testUpdateSystemMetadata_ObsoletesFail_201531721144833</identifier><formatId>eml://ecoinformatics.org/eml-2.0.1</formatId><size>17181</size><checksum algorithm="MD5">03ce09c6b4c3efc1681f3023402998a2</checksum><submitter>CN=urn:node:cnDevUNM2,DC=dataone,DC=org</submitter><rightsHolder>CN=testRightsHolder,DC=dataone,DC=org</rightsHolder><accessPolicy><allow><subject>CN=testRightsHolder,DC=dataone,DC=org</subject><permission>changePermission</permission></allow></accessPolicy><dateUploaded>2015-11-14T05:14:17.368+00:00</dateUploaded><dateSysMetadataModified>2015-11-14T05:14:17.368+00:00</dateSysMetadataModified><originMemberNode>urn:node:mnDevUNM2</originMemberNode><authoritativeMemberNode>urn:node:mnDevUNM2</authoritativeMemberNode></d1_v2.0:systemMetadata> [org.dataone.integration.ContextAwareTestCaseDataone]
20151114-05:14:18: [INFO]: rest call info: POST https://mn-dev-unm-2.test.dataone.org/metacat/d1/mn/v2/object; MMP message has: ParamPart:pid = testUpdateSystemMetadata_ObsoletesFail_201531721144833; FilePart:object = /tmp/mmp.output.4459320545423704643.tmp (17181 bytes); FilePart:sysmeta = /tmp/mmp.output.3753189657492243400.tmp (978 bytes);  [org.dataone.client.rest.RestClient]
20151114-05:14:18: [INFO]: object created.  pid = testUpdateSystemMetadata_ObsoletesFail_201531721144833 [org.dataone.integration.ContextAwareTestCaseDataone]
20151114-05:14:28: [INFO]: rest call info: GET https://mn-dev-unm-2.test.dataone.org/metacat/d1/mn/v2/meta/testUpdateSystemMetadata_ObsoletesFail_201531721144832 [org.dataone.client.rest.RestClient]
20151114-05:14:28: [INFO]: rest call info: PUT https://mn-dev-unm-2.test.dataone.org/metacat/d1/mn/v2/meta; MMP message has: ParamPart:pid = testUpdateSystemMetadata_ObsoletesFail_201531721144832; FilePart:sysmeta = /tmp/mmp.output.1253632938755227298.tmp (912 bytes);  [org.dataone.client.rest.RestClient]
20151114-05:14:28: [INFO]: **************************************************** [org.dataone.integration.ContextAwareTestCaseDataone]
20151114-05:14:28: [INFO]: ***  context label:   DEV2 [org.dataone.integration.ContextAwareTestCaseDataone]
20151114-05:14:28: [INFO]: **************************************************** [org.dataone.integration.ContextAwareTestCaseDataone]
20151114-05:14:28: [INFO]: **************************************************** [org.dataone.integration.ContextAwareTestCaseDataone]
20151114-05:14:29: [INFO]: rest call info: GET https://mn-dev-ucsb-1.test.dataone.org/metacat/d1/mn/v2/monitor/ping [org.dataone.client.rest.RestClient]
20151114-05:14:29: [INFO]: MN excluded from test: https://mn-dev-ucsb-1.test.dataone.org/metacat/d1/mn [org.dataone.integration.ContextAwareTestCaseDataone]
20151114-05:14:29: [INFO]: rest call info: GET https://mn-dev-ucsb-2.test.dataone.org/metacat/d1/mn/v2/monitor/ping [org.dataone.client.rest.RestClient]
20151114-05:14:29: [INFO]: MN included in test: https://mn-dev-ucsb-2.test.dataone.org/metacat/d1/mn [org.dataone.integration.ContextAwareTestCaseDataone]
20151114-05:14:29: [INFO]: rest call info: GET https://mn-dev-unm-1.test.dataone.org/metacat/d1/mn/v2/monitor/ping [org.dataone.client.rest.RestClient]
20151114-05:14:29: [INFO]: MN excluded from test: https://mn-dev-unm-1.test.dataone.org/metacat/d1/mn [org.dataone.integration.ContextAwareTestCaseDataone]
20151114-05:14:29: [INFO]: rest call info: GET https://mn-dev-unm-2.test.dataone.org/metacat/d1/mn/v2/monitor/ping [org.dataone.client.rest.RestClient]
20151114-05:14:29: [INFO]: MN included in test: https://mn-dev-unm-2.test.dataone.org/metacat/d1/mn [org.dataone.integration.ContextAwareTestCaseDataone]
20151114-05:14:29: [INFO]: 
***************** running test for testUpdateSystemMetadata_ObsoletedByFail(...) vs. node: https://mn-dev-ucsb-2.test.dataone.org/metacat/d1/mn ***************** [org.dataone.integration.ContextAwareTestCaseDataone]
20151114-05:14:29: [INFO]: certificate directory: /etc/dataone/client/testClientCerts/ [org.dataone.integration.ContextAwareTestCaseDataone]
20151114-05:14:29: [INFO]: certificate filename: cnDevUNM2 [org.dataone.integration.ContextAwareTestCaseDataone]
20151114-05:14:29: [INFO]: client setup as Subject: CN=urn:node:cnDevUNM2,DC=dataone,DC=org [org.dataone.integration.ContextAwareTestCaseDataone]
20151114-05:14:29: [INFO]: creating a test object.  pid = testUpdateSystemMetadata_ObsoletedByFail_2015317211429685 on https://mn-dev-ucsb-2.test.dataone.org/metacat/d1/mn/v2 [org.dataone.integration.ContextAwareTestCaseDataone]
20151114-05:14:29: [INFO]: SystemMetadata for pid: testUpdateSystemMetadata_ObsoletedByFail_2015317211429685
<?xml version="1.0" encoding="UTF-8"?><d1_v2.0:systemMetadata xmlns:d1_v2.0="http://ns.dataone.org/service/types/v2.0" xmlns:d1="http://ns.dataone.org/service/types/v1"><serialVersion>1</serialVersion><identifier>testUpdateSystemMetadata_ObsoletedByFail_2015317211429685</identifier><formatId>eml://ecoinformatics.org/eml-2.0.1</formatId><size>17181</size><checksum algorithm="MD5">03ce09c6b4c3efc1681f3023402998a2</checksum><submitter>CN=urn:node:cnDevUNM2,DC=dataone,DC=org</submitter><rightsHolder>CN=testRightsHolder,DC=dataone,DC=org</rightsHolder><accessPolicy><allow><subject>CN=testRightsHolder,DC=dataone,DC=org</subject><permission>changePermission</permission></allow></accessPolicy><dateUploaded>2015-11-14T05:14:29.703+00:00</dateUploaded><dateSysMetadataModified>2015-11-14T05:14:29.703+00:00</dateSysMetadataModified><originMemberNode>urn:node:mnDevUCSB2</originMemberNode><authoritativeMemberNode>urn:node:mnDevUCSB2</authoritativeMemberNode></d1_v2.0:systemMetadata> [org.dataone.integration.ContextAwareTestCaseDataone]
20151114-05:14:31: [INFO]: rest call info: POST https://mn-dev-ucsb-2.test.dataone.org/metacat/d1/mn/v2/object; MMP message has: ParamPart:pid = testUpdateSystemMetadata_ObsoletedByFail_2015317211429685; FilePart:object = /tmp/mmp.output.2889790106324528295.tmp (17181 bytes); FilePart:sysmeta = /tmp/mmp.output.32213266777613743.tmp (983 bytes);  [org.dataone.client.rest.RestClient]
20151114-05:14:31: [INFO]: object created.  pid = testUpdateSystemMetadata_ObsoletedByFail_2015317211429685 [org.dataone.integration.ContextAwareTestCaseDataone]
20151114-05:14:42: [INFO]: rest call info: PUT https://mn-dev-ucsb-2.test.dataone.org/metacat/d1/mn/v2/object/testUpdateSystemMetadata_ObsoletedByFail_2015317211429685; MMP message has: ParamPart:newPid = testUpdateSystemMetadata_ObsoletedByFail_2015317211429686; FilePart:object = /tmp/mmp.output.895315156123218360.tmp (17181 bytes); FilePart:sysmeta = /tmp/mmp.output.3344501095903682893.tmp (786 bytes);  [org.dataone.client.rest.RestClient]
20151114-05:14:42: [INFO]: certificate directory: /etc/dataone/client/testClientCerts/ [org.dataone.integration.ContextAwareTestCaseDataone]
20151114-05:14:42: [INFO]: certificate filename: cnDevUNM2 [org.dataone.integration.ContextAwareTestCaseDataone]
20151114-05:14:42: [INFO]: client setup as Subject: CN=urn:node:cnDevUNM2,DC=dataone,DC=org [org.dataone.integration.ContextAwareTestCaseDataone]
20151114-05:14:42: [INFO]: creating a test object.  pid = testUpdateSystemMetadata_ObsoletedByFail_2015317211429688 on https://mn-dev-ucsb-2.test.dataone.org/metacat/d1/mn/v2 [org.dataone.integration.ContextAwareTestCaseDataone]
20151114-05:14:42: [INFO]: SystemMetadata for pid: testUpdateSystemMetadata_ObsoletedByFail_2015317211429688
<?xml version="1.0" encoding="UTF-8"?><d1_v2.0:systemMetadata xmlns:d1_v2.0="http://ns.dataone.org/service/types/v2.0" xmlns:d1="http://ns.dataone.org/service/types/v1"><serialVersion>1</serialVersion><identifier>testUpdateSystemMetadata_ObsoletedByFail_2015317211429688</identifier><formatId>eml://ecoinformatics.org/eml-2.0.1</formatId><size>17181</size><checksum algorithm="MD5">03ce09c6b4c3efc1681f3023402998a2</checksum><submitter>CN=urn:node:cnDevUNM2,DC=dataone,DC=org</submitter><rightsHolder>CN=testRightsHolder,DC=dataone,DC=org</rightsHolder><accessPolicy><allow><subject>CN=testRightsHolder,DC=dataone,DC=org</subject><permission>changePermission</permission></allow></accessPolicy><dateUploaded>2015-11-14T05:14:42.983+00:00</dateUploaded><dateSysMetadataModified>2015-11-14T05:14:42.983+00:00</dateSysMetadataModified><originMemberNode>urn:node:mnDevUCSB2</originMemberNode><authoritativeMemberNode>urn:node:mnDevUCSB2</authoritativeMemberNode></d1_v2.0:systemMetadata> [org.dataone.integration.ContextAwareTestCaseDataone]
20151114-05:14:44: [INFO]: rest call info: POST https://mn-dev-ucsb-2.test.dataone.org/metacat/d1/mn/v2/object; MMP message has: ParamPart:pid = testUpdateSystemMetadata_ObsoletedByFail_2015317211429688; FilePart:object = /tmp/mmp.output.5323367649042689037.tmp (17181 bytes); FilePart:sysmeta = /tmp/mmp.output.6100146747774951271.tmp (983 bytes);  [org.dataone.client.rest.RestClient]
20151114-05:14:44: [INFO]: object created.  pid = testUpdateSystemMetadata_ObsoletedByFail_2015317211429688 [org.dataone.integration.ContextAwareTestCaseDataone]
20151114-05:14:55: [INFO]: rest call info: GET https://mn-dev-ucsb-2.test.dataone.org/metacat/d1/mn/v2/meta/testUpdateSystemMetadata_ObsoletedByFail_2015317211429685 [org.dataone.client.rest.RestClient]
20151114-05:14:55: [INFO]: rest call info: PUT https://mn-dev-ucsb-2.test.dataone.org/metacat/d1/mn/v2/meta; MMP message has: ParamPart:pid = testUpdateSystemMetadata_ObsoletedByFail_2015317211429685; FilePart:sysmeta = /tmp/mmp.output.4833653925635616547.tmp (1091 bytes);  [org.dataone.client.rest.RestClient]
20151114-05:14:55: [INFO]: 
***************** running test for testUpdateSystemMetadata_ObsoletedByFail(...) vs. node: https://mn-dev-unm-2.test.dataone.org/metacat/d1/mn ***************** [org.dataone.integration.ContextAwareTestCaseDataone]
20151114-05:14:55: [INFO]: certificate directory: /etc/dataone/client/testClientCerts/ [org.dataone.integration.ContextAwareTestCaseDataone]
20151114-05:14:55: [INFO]: certificate filename: cnDevUNM2 [org.dataone.integration.ContextAwareTestCaseDataone]
20151114-05:14:55: [INFO]: client setup as Subject: CN=urn:node:cnDevUNM2,DC=dataone,DC=org [org.dataone.integration.ContextAwareTestCaseDataone]
20151114-05:14:55: [INFO]: creating a test object.  pid = testUpdateSystemMetadata_ObsoletedByFail_2015317211455475 on https://mn-dev-unm-2.test.dataone.org/metacat/d1/mn/v2 [org.dataone.integration.ContextAwareTestCaseDataone]
20151114-05:14:55: [INFO]: SystemMetadata for pid: testUpdateSystemMetadata_ObsoletedByFail_2015317211455475
<?xml version="1.0" encoding="UTF-8"?><d1_v2.0:systemMetadata xmlns:d1_v2.0="http://ns.dataone.org/service/types/v2.0" xmlns:d1="http://ns.dataone.org/service/types/v1"><serialVersion>1</serialVersion><identifier>testUpdateSystemMetadata_ObsoletedByFail_2015317211455475</identifier><formatId>eml://ecoinformatics.org/eml-2.0.1</formatId><size>17181</size><checksum algorithm="MD5">03ce09c6b4c3efc1681f3023402998a2</checksum><submitter>CN=urn:node:cnDevUNM2,DC=dataone,DC=org</submitter><rightsHolder>CN=testRightsHolder,DC=dataone,DC=org</rightsHolder><accessPolicy><allow><subject>CN=testRightsHolder,DC=dataone,DC=org</subject><permission>changePermission</permission></allow></accessPolicy><dateUploaded>2015-11-14T05:14:55.492+00:00</dateUploaded><dateSysMetadataModified>2015-11-14T05:14:55.492+00:00</dateSysMetadataModified><originMemberNode>urn:node:mnDevUNM2</originMemberNode><authoritativeMemberNode>urn:node:mnDevUNM2</authoritativeMemberNode></d1_v2.0:systemMetadata> [org.dataone.integration.ContextAwareTestCaseDataone]
20151114-05:14:56: [INFO]: rest call info: POST https://mn-dev-unm-2.test.dataone.org/metacat/d1/mn/v2/object; MMP message has: ParamPart:pid = testUpdateSystemMetadata_ObsoletedByFail_2015317211455475; FilePart:object = /tmp/mmp.output.776055738267667078.tmp (17181 bytes); FilePart:sysmeta = /tmp/mmp.output.4543331399597960112.tmp (981 bytes);  [org.dataone.client.rest.RestClient]
20151114-05:14:56: [INFO]: object created.  pid = testUpdateSystemMetadata_ObsoletedByFail_2015317211455475 [org.dataone.integration.ContextAwareTestCaseDataone]
20151114-05:15:08: [INFO]: rest call info: PUT https://mn-dev-unm-2.test.dataone.org/metacat/d1/mn/v2/object/testUpdateSystemMetadata_ObsoletedByFail_2015317211455475; MMP message has: ParamPart:newPid = testUpdateSystemMetadata_ObsoletedByFail_2015317211455477; FilePart:object = /tmp/mmp.output.1623022323165822347.tmp (17181 bytes); FilePart:sysmeta = /tmp/mmp.output.6313257620099283706.tmp (786 bytes);  [org.dataone.client.rest.RestClient]
20151114-05:15:08: [INFO]: certificate directory: /etc/dataone/client/testClientCerts/ [org.dataone.integration.ContextAwareTestCaseDataone]
20151114-05:15:08: [INFO]: certificate filename: cnDevUNM2 [org.dataone.integration.ContextAwareTestCaseDataone]
20151114-05:15:08: [INFO]: client setup as Subject: CN=urn:node:cnDevUNM2,DC=dataone,DC=org [org.dataone.integration.ContextAwareTestCaseDataone]
20151114-05:15:08: [INFO]: creating a test object.  pid = testUpdateSystemMetadata_ObsoletedByFail_2015317211455478 on https://mn-dev-unm-2.test.dataone.org/metacat/d1/mn/v2 [org.dataone.integration.ContextAwareTestCaseDataone]
20151114-05:15:08: [INFO]: SystemMetadata for pid: testUpdateSystemMetadata_ObsoletedByFail_2015317211455478
<?xml version="1.0" encoding="UTF-8"?><d1_v2.0:systemMetadata xmlns:d1_v2.0="http://ns.dataone.org/service/types/v2.0" xmlns:d1="http://ns.dataone.org/service/types/v1"><serialVersion>1</serialVersion><identifier>testUpdateSystemMetadata_ObsoletedByFail_2015317211455478</identifier><formatId>eml://ecoinformatics.org/eml-2.0.1</formatId><size>17181</size><checksum algorithm="MD5">03ce09c6b4c3efc1681f3023402998a2</checksum><submitter>CN=urn:node:cnDevUNM2,DC=dataone,DC=org</submitter><rightsHolder>CN=testRightsHolder,DC=dataone,DC=org</rightsHolder><accessPolicy><allow><subject>CN=testRightsHolder,DC=dataone,DC=org</subject><permission>changePermission</permission></allow></accessPolicy><dateUploaded>2015-11-14T05:15:08.058+00:00</dateUploaded><dateSysMetadataModified>2015-11-14T05:15:08.058+00:00</dateSysMetadataModified><originMemberNode>urn:node:mnDevUNM2</originMemberNode><authoritativeMemberNode>urn:node:mnDevUNM2</authoritativeMemberNode></d1_v2.0:systemMetadata> [org.dataone.integration.ContextAwareTestCaseDataone]
20151114-05:15:08: [INFO]: rest call info: POST https://mn-dev-unm-2.test.dataone.org/metacat/d1/mn/v2/object; MMP message has: ParamPart:pid = testUpdateSystemMetadata_ObsoletedByFail_2015317211455478; FilePart:object = /tmp/mmp.output.6384280082103137861.tmp (17181 bytes); FilePart:sysmeta = /tmp/mmp.output.6562544989095277148.tmp (981 bytes);  [org.dataone.client.rest.RestClient]
20151114-05:15:08: [INFO]: object created.  pid = testUpdateSystemMetadata_ObsoletedByFail_2015317211455478 [org.dataone.integration.ContextAwareTestCaseDataone]
20151114-05:15:19: [INFO]: rest call info: GET https://mn-dev-unm-2.test.dataone.org/metacat/d1/mn/v2/meta/testUpdateSystemMetadata_ObsoletedByFail_2015317211455475 [org.dataone.client.rest.RestClient]
20151114-05:15:19: [INFO]: rest call info: PUT https://mn-dev-unm-2.test.dataone.org/metacat/d1/mn/v2/meta; MMP message has: ParamPart:pid = testUpdateSystemMetadata_ObsoletedByFail_2015317211455475; FilePart:sysmeta = /tmp/mmp.output.7842029537528494256.tmp (1089 bytes);  [org.dataone.client.rest.RestClient]
20151114-05:15:19: [INFO]: **************************************************** [org.dataone.integration.ContextAwareTestCaseDataone]
20151114-05:15:19: [INFO]: ***  context label:   DEV2 [org.dataone.integration.ContextAwareTestCaseDataone]
20151114-05:15:19: [INFO]: **************************************************** [org.dataone.integration.ContextAwareTestCaseDataone]
20151114-05:15:19: [INFO]: **************************************************** [org.dataone.integration.ContextAwareTestCaseDataone]
20151114-05:15:20: [INFO]: rest call info: GET https://mn-dev-ucsb-1.test.dataone.org/metacat/d1/mn/v2/monitor/ping [org.dataone.client.rest.RestClient]
20151114-05:15:20: [INFO]: MN excluded from test: https://mn-dev-ucsb-1.test.dataone.org/metacat/d1/mn [org.dataone.integration.ContextAwareTestCaseDataone]
20151114-05:15:20: [INFO]: rest call info: GET https://mn-dev-ucsb-2.test.dataone.org/metacat/d1/mn/v2/monitor/ping [org.dataone.client.rest.RestClient]
20151114-05:15:20: [INFO]: MN included in test: https://mn-dev-ucsb-2.test.dataone.org/metacat/d1/mn [org.dataone.integration.ContextAwareTestCaseDataone]
20151114-05:15:20: [INFO]: rest call info: GET https://mn-dev-unm-1.test.dataone.org/metacat/d1/mn/v2/monitor/ping [org.dataone.client.rest.RestClient]
20151114-05:15:20: [INFO]: MN excluded from test: https://mn-dev-unm-1.test.dataone.org/metacat/d1/mn [org.dataone.integration.ContextAwareTestCaseDataone]
20151114-05:15:21: [INFO]: rest call info: GET https://mn-dev-unm-2.test.dataone.org/metacat/d1/mn/v2/monitor/ping [org.dataone.client.rest.RestClient]
20151114-05:15:21: [INFO]: MN included in test: https://mn-dev-unm-2.test.dataone.org/metacat/d1/mn [org.dataone.integration.ContextAwareTestCaseDataone]
20151114-05:15:21: [INFO]: 
***************** running test for testUpdateSystemMetadata_MutableObsoletedBy(...) vs. node: https://mn-dev-ucsb-2.test.dataone.org/metacat/d1/mn ***************** [org.dataone.integration.ContextAwareTestCaseDataone]
20151114-05:15:21: [INFO]: certificate directory: /etc/dataone/client/testClientCerts/ [org.dataone.integration.ContextAwareTestCaseDataone]
20151114-05:15:21: [INFO]: certificate filename: cnDevUNM2 [org.dataone.integration.ContextAwareTestCaseDataone]
20151114-05:15:21: [INFO]: client setup as Subject: CN=urn:node:cnDevUNM2,DC=dataone,DC=org [org.dataone.integration.ContextAwareTestCaseDataone]
20151114-05:15:21: [INFO]: creating a test object.  pid = testUpdateSystemMetadata_MutableObsoletedBy_201531721152150 on https://mn-dev-ucsb-2.test.dataone.org/metacat/d1/mn/v2 [org.dataone.integration.ContextAwareTestCaseDataone]
20151114-05:15:21: [INFO]: SystemMetadata for pid: testUpdateSystemMetadata_MutableObsoletedBy_201531721152150
<?xml version="1.0" encoding="UTF-8"?><d1_v2.0:systemMetadata xmlns:d1_v2.0="http://ns.dataone.org/service/types/v2.0" xmlns:d1="http://ns.dataone.org/service/types/v1"><serialVersion>1</serialVersion><identifier>testUpdateSystemMetadata_MutableObsoletedBy_201531721152150</identifier><formatId>eml://ecoinformatics.org/eml-2.0.1</formatId><size>17181</size><checksum algorithm="MD5">03ce09c6b4c3efc1681f3023402998a2</checksum><submitter>CN=urn:node:cnDevUNM2,DC=dataone,DC=org</submitter><rightsHolder>CN=testRightsHolder,DC=dataone,DC=org</rightsHolder><accessPolicy><allow><subject>CN=testRightsHolder,DC=dataone,DC=org</subject><permission>changePermission</permission></allow></accessPolicy><dateUploaded>2015-11-14T05:15:21.066+00:00</dateUploaded><dateSysMetadataModified>2015-11-14T05:15:21.066+00:00</dateSysMetadataModified><originMemberNode>urn:node:mnDevUCSB2</originMemberNode><authoritativeMemberNode>urn:node:mnDevUCSB2</authoritativeMemberNode></d1_v2.0:systemMetadata> [org.dataone.integration.ContextAwareTestCaseDataone]
20151114-05:15:22: [INFO]: rest call info: POST https://mn-dev-ucsb-2.test.dataone.org/metacat/d1/mn/v2/object; MMP message has: ParamPart:pid = testUpdateSystemMetadata_MutableObsoletedBy_201531721152150; FilePart:object = /tmp/mmp.output.394140873447158630.tmp (17181 bytes); FilePart:sysmeta = /tmp/mmp.output.3210831691458186154.tmp (985 bytes);  [org.dataone.client.rest.RestClient]
20151114-05:15:22: [INFO]: object created.  pid = testUpdateSystemMetadata_MutableObsoletedBy_201531721152150 [org.dataone.integration.ContextAwareTestCaseDataone]
20151114-05:15:22: [INFO]: certificate directory: /etc/dataone/client/testClientCerts/ [org.dataone.integration.ContextAwareTestCaseDataone]
20151114-05:15:22: [INFO]: certificate filename: cnDevUNM2 [org.dataone.integration.ContextAwareTestCaseDataone]
20151114-05:15:22: [INFO]: client setup as Subject: CN=urn:node:cnDevUNM2,DC=dataone,DC=org [org.dataone.integration.ContextAwareTestCaseDataone]
20151114-05:15:22: [INFO]: creating a test object.  pid = testUpdateSystemMetadata_MutableObsoletedBy_201531721152151 on https://mn-dev-ucsb-2.test.dataone.org/metacat/d1/mn/v2 [org.dataone.integration.ContextAwareTestCaseDataone]
20151114-05:15:22: [INFO]: SystemMetadata for pid: testUpdateSystemMetadata_MutableObsoletedBy_201531721152151
<?xml version="1.0" encoding="UTF-8"?><d1_v2.0:systemMetadata xmlns:d1_v2.0="http://ns.dataone.org/service/types/v2.0" xmlns:d1="http://ns.dataone.org/service/types/v1"><serialVersion>1</serialVersion><identifier>testUpdateSystemMetadata_MutableObsoletedBy_201531721152151</identifier><formatId>eml://ecoinformatics.org/eml-2.0.1</formatId><size>17181</size><checksum algorithm="MD5">03ce09c6b4c3efc1681f3023402998a2</checksum><submitter>CN=urn:node:cnDevUNM2,DC=dataone,DC=org</submitter><rightsHolder>CN=testRightsHolder,DC=dataone,DC=org</rightsHolder><accessPolicy><allow><subject>CN=testRightsHolder,DC=dataone,DC=org</subject><permission>changePermission</permission></allow></accessPolicy><dateUploaded>2015-11-14T05:15:22.686+00:00</dateUploaded><dateSysMetadataModified>2015-11-14T05:15:22.686+00:00</dateSysMetadataModified><originMemberNode>urn:node:mnDevUCSB2</originMemberNode><authoritativeMemberNode>urn:node:mnDevUCSB2</authoritativeMemberNode></d1_v2.0:systemMetadata> [org.dataone.integration.ContextAwareTestCaseDataone]
20151114-05:15:23: [INFO]: rest call info: POST https://mn-dev-ucsb-2.test.dataone.org/metacat/d1/mn/v2/object; MMP message has: ParamPart:pid = testUpdateSystemMetadata_MutableObsoletedBy_201531721152151; FilePart:object = /tmp/mmp.output.7014748811100953786.tmp (17181 bytes); FilePart:sysmeta = /tmp/mmp.output.2245517297574434039.tmp (985 bytes);  [org.dataone.client.rest.RestClient]
20151114-05:15:23: [INFO]: object created.  pid = testUpdateSystemMetadata_MutableObsoletedBy_201531721152151 [org.dataone.integration.ContextAwareTestCaseDataone]
20151114-05:15:34: [INFO]: rest call info: GET https://mn-dev-ucsb-2.test.dataone.org/metacat/d1/mn/v2/meta/testUpdateSystemMetadata_MutableObsoletedBy_201531721152150 [org.dataone.client.rest.RestClient]
20151114-05:15:40: [INFO]: rest call info: PUT https://mn-dev-ucsb-2.test.dataone.org/metacat/d1/mn/v2/meta; MMP message has: ParamPart:pid = testUpdateSystemMetadata_MutableObsoletedBy_201531721152150; FilePart:sysmeta = /tmp/mmp.output.4265008867200374399.tmp (1095 bytes);  [org.dataone.client.rest.RestClient]
20151114-05:15:40: [INFO]: 
***************** running test for testUpdateSystemMetadata_MutableObsoletedBy(...) vs. node: https://mn-dev-unm-2.test.dataone.org/metacat/d1/mn ***************** [org.dataone.integration.ContextAwareTestCaseDataone]
20151114-05:15:40: [INFO]: certificate directory: /etc/dataone/client/testClientCerts/ [org.dataone.integration.ContextAwareTestCaseDataone]
20151114-05:15:40: [INFO]: certificate filename: cnDevUNM2 [org.dataone.integration.ContextAwareTestCaseDataone]
20151114-05:15:40: [INFO]: client setup as Subject: CN=urn:node:cnDevUNM2,DC=dataone,DC=org [org.dataone.integration.ContextAwareTestCaseDataone]
20151114-05:15:40: [INFO]: creating a test object.  pid = testUpdateSystemMetadata_MutableObsoletedBy_2015317211540268 on https://mn-dev-unm-2.test.dataone.org/metacat/d1/mn/v2 [org.dataone.integration.ContextAwareTestCaseDataone]
20151114-05:15:40: [INFO]: SystemMetadata for pid: testUpdateSystemMetadata_MutableObsoletedBy_2015317211540268
<?xml version="1.0" encoding="UTF-8"?><d1_v2.0:systemMetadata xmlns:d1_v2.0="http://ns.dataone.org/service/types/v2.0" xmlns:d1="http://ns.dataone.org/service/types/v1"><serialVersion>1</serialVersion><identifier>testUpdateSystemMetadata_MutableObsoletedBy_2015317211540268</identifier><formatId>eml://ecoinformatics.org/eml-2.0.1</formatId><size>17181</size><checksum algorithm="MD5">03ce09c6b4c3efc1681f3023402998a2</checksum><submitter>CN=urn:node:cnDevUNM2,DC=dataone,DC=org</submitter><rightsHolder>CN=testRightsHolder,DC=dataone,DC=org</rightsHolder><accessPolicy><allow><subject>CN=testRightsHolder,DC=dataone,DC=org</subject><permission>changePermission</permission></allow></accessPolicy><dateUploaded>2015-11-14T05:15:40.281+00:00</dateUploaded><dateSysMetadataModified>2015-11-14T05:15:40.281+00:00</dateSysMetadataModified><originMemberNode>urn:node:mnDevUNM2</originMemberNode><authoritativeMemberNode>urn:node:mnDevUNM2</authoritativeMemberNode></d1_v2.0:systemMetadata> [org.dataone.integration.ContextAwareTestCaseDataone]
20151114-05:15:41: [INFO]: rest call info: POST https://mn-dev-unm-2.test.dataone.org/metacat/d1/mn/v2/object; MMP message has: ParamPart:pid = testUpdateSystemMetadata_MutableObsoletedBy_2015317211540268; FilePart:object = /tmp/mmp.output.452412808122747324.tmp (17181 bytes); FilePart:sysmeta = /tmp/mmp.output.7772962569424723918.tmp (984 bytes);  [org.dataone.client.rest.RestClient]
20151114-05:15:41: [INFO]: object created.  pid = testUpdateSystemMetadata_MutableObsoletedBy_2015317211540268 [org.dataone.integration.ContextAwareTestCaseDataone]
20151114-05:15:41: [INFO]: certificate directory: /etc/dataone/client/testClientCerts/ [org.dataone.integration.ContextAwareTestCaseDataone]
20151114-05:15:41: [INFO]: certificate filename: cnDevUNM2 [org.dataone.integration.ContextAwareTestCaseDataone]
20151114-05:15:41: [INFO]: client setup as Subject: CN=urn:node:cnDevUNM2,DC=dataone,DC=org [org.dataone.integration.ContextAwareTestCaseDataone]
20151114-05:15:41: [INFO]: creating a test object.  pid = testUpdateSystemMetadata_MutableObsoletedBy_2015317211540269 on https://mn-dev-unm-2.test.dataone.org/metacat/d1/mn/v2 [org.dataone.integration.ContextAwareTestCaseDataone]
20151114-05:15:41: [INFO]: SystemMetadata for pid: testUpdateSystemMetadata_MutableObsoletedBy_2015317211540269
<?xml version="1.0" encoding="UTF-8"?><d1_v2.0:systemMetadata xmlns:d1_v2.0="http://ns.dataone.org/service/types/v2.0" xmlns:d1="http://ns.dataone.org/service/types/v1"><serialVersion>1</serialVersion><identifier>testUpdateSystemMetadata_MutableObsoletedBy_2015317211540269</identifier><formatId>eml://ecoinformatics.org/eml-2.0.1</formatId><size>17181</size><checksum algorithm="MD5">03ce09c6b4c3efc1681f3023402998a2</checksum><submitter>CN=urn:node:cnDevUNM2,DC=dataone,DC=org</submitter><rightsHolder>CN=testRightsHolder,DC=dataone,DC=org</rightsHolder><accessPolicy><allow><subject>CN=testRightsHolder,DC=dataone,DC=org</subject><permission>changePermission</permission></allow></accessPolicy><dateUploaded>2015-11-14T05:15:41.446+00:00</dateUploaded><dateSysMetadataModified>2015-11-14T05:15:41.446+00:00</dateSysMetadataModified><originMemberNode>urn:node:mnDevUNM2</originMemberNode><authoritativeMemberNode>urn:node:mnDevUNM2</authoritativeMemberNode></d1_v2.0:systemMetadata> [org.dataone.integration.ContextAwareTestCaseDataone]
20151114-05:15:42: [INFO]: rest call info: POST https://mn-dev-unm-2.test.dataone.org/metacat/d1/mn/v2/object; MMP message has: ParamPart:pid = testUpdateSystemMetadata_MutableObsoletedBy_2015317211540269; FilePart:object = /tmp/mmp.output.8274336142677584662.tmp (17181 bytes); FilePart:sysmeta = /tmp/mmp.output.3504652786339216635.tmp (984 bytes);  [org.dataone.client.rest.RestClient]
20151114-05:15:42: [INFO]: object created.  pid = testUpdateSystemMetadata_MutableObsoletedBy_2015317211540269 [org.dataone.integration.ContextAwareTestCaseDataone]
20151114-05:15:52: [INFO]: rest call info: GET https://mn-dev-unm-2.test.dataone.org/metacat/d1/mn/v2/meta/testUpdateSystemMetadata_MutableObsoletedBy_2015317211540268 [org.dataone.client.rest.RestClient]
20151114-05:15:57: [INFO]: rest call info: PUT https://mn-dev-unm-2.test.dataone.org/metacat/d1/mn/v2/meta; MMP message has: ParamPart:pid = testUpdateSystemMetadata_MutableObsoletedBy_2015317211540268; FilePart:sysmeta = /tmp/mmp.output.4022614679243175740.tmp (1095 bytes);  [org.dataone.client.rest.RestClient]
20151114-05:15:57: [INFO]: **************************************************** [org.dataone.integration.ContextAwareTestCaseDataone]
20151114-05:15:57: [INFO]: ***  context label:   DEV2 [org.dataone.integration.ContextAwareTestCaseDataone]
20151114-05:15:57: [INFO]: **************************************************** [org.dataone.integration.ContextAwareTestCaseDataone]
20151114-05:15:57: [INFO]: **************************************************** [org.dataone.integration.ContextAwareTestCaseDataone]
20151114-05:15:58: [INFO]: rest call info: GET https://mn-dev-ucsb-1.test.dataone.org/metacat/d1/mn/v2/monitor/ping [org.dataone.client.rest.RestClient]
20151114-05:15:58: [INFO]: MN excluded from test: https://mn-dev-ucsb-1.test.dataone.org/metacat/d1/mn [org.dataone.integration.ContextAwareTestCaseDataone]
20151114-05:15:58: [INFO]: rest call info: GET https://mn-dev-ucsb-2.test.dataone.org/metacat/d1/mn/v2/monitor/ping [org.dataone.client.rest.RestClient]
20151114-05:15:58: [INFO]: MN included in test: https://mn-dev-ucsb-2.test.dataone.org/metacat/d1/mn [org.dataone.integration.ContextAwareTestCaseDataone]
20151114-05:15:58: [INFO]: rest call info: GET https://mn-dev-unm-1.test.dataone.org/metacat/d1/mn/v2/monitor/ping [org.dataone.client.rest.RestClient]
20151114-05:15:58: [INFO]: MN excluded from test: https://mn-dev-unm-1.test.dataone.org/metacat/d1/mn [org.dataone.integration.ContextAwareTestCaseDataone]
20151114-05:15:58: [INFO]: rest call info: GET https://mn-dev-unm-2.test.dataone.org/metacat/d1/mn/v2/monitor/ping [org.dataone.client.rest.RestClient]
20151114-05:15:58: [INFO]: MN included in test: https://mn-dev-unm-2.test.dataone.org/metacat/d1/mn [org.dataone.integration.ContextAwareTestCaseDataone]
20151114-05:15:58: [INFO]: 
***************** running test for testUpdateSystemMetadata_MutableObsoletes(...) vs. node: https://mn-dev-ucsb-2.test.dataone.org/metacat/d1/mn ***************** [org.dataone.integration.ContextAwareTestCaseDataone]
20151114-05:15:58: [INFO]: certificate directory: /etc/dataone/client/testClientCerts/ [org.dataone.integration.ContextAwareTestCaseDataone]
20151114-05:15:58: [INFO]: certificate filename: cnDevUNM2 [org.dataone.integration.ContextAwareTestCaseDataone]
20151114-05:15:58: [INFO]: client setup as Subject: CN=urn:node:cnDevUNM2,DC=dataone,DC=org [org.dataone.integration.ContextAwareTestCaseDataone]
20151114-05:15:58: [INFO]: creating a test object.  pid = testUpdateSystemMetadata_MutableObsoletes_2015317211558697 on https://mn-dev-ucsb-2.test.dataone.org/metacat/d1/mn/v2 [org.dataone.integration.ContextAwareTestCaseDataone]
20151114-05:15:58: [INFO]: SystemMetadata for pid: testUpdateSystemMetadata_MutableObsoletes_2015317211558697
<?xml version="1.0" encoding="UTF-8"?><d1_v2.0:systemMetadata xmlns:d1_v2.0="http://ns.dataone.org/service/types/v2.0" xmlns:d1="http://ns.dataone.org/service/types/v1"><serialVersion>1</serialVersion><identifier>testUpdateSystemMetadata_MutableObsoletes_2015317211558697</identifier><formatId>eml://ecoinformatics.org/eml-2.0.1</formatId><size>17181</size><checksum algorithm="MD5">03ce09c6b4c3efc1681f3023402998a2</checksum><submitter>CN=urn:node:cnDevUNM2,DC=dataone,DC=org</submitter><rightsHolder>CN=testRightsHolder,DC=dataone,DC=org</rightsHolder><accessPolicy><allow><subject>CN=testRightsHolder,DC=dataone,DC=org</subject><permission>changePermission</permission></allow></accessPolicy><dateUploaded>2015-11-14T05:15:58.711+00:00</dateUploaded><dateSysMetadataModified>2015-11-14T05:15:58.711+00:00</dateSysMetadataModified><originMemberNode>urn:node:mnDevUCSB2</originMemberNode><authoritativeMemberNode>urn:node:mnDevUCSB2</authoritativeMemberNode></d1_v2.0:systemMetadata> [org.dataone.integration.ContextAwareTestCaseDataone]
20151114-05:16:00: [INFO]: rest call info: POST https://mn-dev-ucsb-2.test.dataone.org/metacat/d1/mn/v2/object; MMP message has: ParamPart:pid = testUpdateSystemMetadata_MutableObsoletes_2015317211558697; FilePart:object = /tmp/mmp.output.4818922431872578500.tmp (17181 bytes); FilePart:sysmeta = /tmp/mmp.output.1496947205738320195.tmp (984 bytes);  [org.dataone.client.rest.RestClient]
20151114-05:16:00: [INFO]: object created.  pid = testUpdateSystemMetadata_MutableObsoletes_2015317211558697 [org.dataone.integration.ContextAwareTestCaseDataone]
20151114-05:16:00: [INFO]: certificate directory: /etc/dataone/client/testClientCerts/ [org.dataone.integration.ContextAwareTestCaseDataone]
20151114-05:16:00: [INFO]: certificate filename: cnDevUNM2 [org.dataone.integration.ContextAwareTestCaseDataone]
20151114-05:16:00: [INFO]: client setup as Subject: CN=urn:node:cnDevUNM2,DC=dataone,DC=org [org.dataone.integration.ContextAwareTestCaseDataone]
20151114-05:16:00: [INFO]: creating a test object.  pid = testUpdateSystemMetadata_MutableObsoletes_2015317211558699 on https://mn-dev-ucsb-2.test.dataone.org/metacat/d1/mn/v2 [org.dataone.integration.ContextAwareTestCaseDataone]
20151114-05:16:00: [INFO]: SystemMetadata for pid: testUpdateSystemMetadata_MutableObsoletes_2015317211558699
<?xml version="1.0" encoding="UTF-8"?><d1_v2.0:systemMetadata xmlns:d1_v2.0="http://ns.dataone.org/service/types/v2.0" xmlns:d1="http://ns.dataone.org/service/types/v1"><serialVersion>1</serialVersion><identifier>testUpdateSystemMetadata_MutableObsoletes_2015317211558699</identifier><formatId>eml://ecoinformatics.org/eml-2.0.1</formatId><size>17181</size><checksum algorithm="MD5">03ce09c6b4c3efc1681f3023402998a2</checksum><submitter>CN=urn:node:cnDevUNM2,DC=dataone,DC=org</submitter><rightsHolder>CN=testRightsHolder,DC=dataone,DC=org</rightsHolder><accessPolicy><allow><subject>CN=testRightsHolder,DC=dataone,DC=org</subject><permission>changePermission</permission></allow></accessPolicy><dateUploaded>2015-11-14T05:16:00.627+00:00</dateUploaded><dateSysMetadataModified>2015-11-14T05:16:00.627+00:00</dateSysMetadataModified><originMemberNode>urn:node:mnDevUCSB2</originMemberNode><authoritativeMemberNode>urn:node:mnDevUCSB2</authoritativeMemberNode></d1_v2.0:systemMetadata> [org.dataone.integration.ContextAwareTestCaseDataone]
20151114-05:16:01: [INFO]: rest call info: POST https://mn-dev-ucsb-2.test.dataone.org/metacat/d1/mn/v2/object; MMP message has: ParamPart:pid = testUpdateSystemMetadata_MutableObsoletes_2015317211558699; FilePart:object = /tmp/mmp.output.2782377697888236244.tmp (17181 bytes); FilePart:sysmeta = /tmp/mmp.output.3489389369400598514.tmp (984 bytes);  [org.dataone.client.rest.RestClient]
20151114-05:16:01: [INFO]: object created.  pid = testUpdateSystemMetadata_MutableObsoletes_2015317211558699 [org.dataone.integration.ContextAwareTestCaseDataone]
20151114-05:16:12: [INFO]: rest call info: GET https://mn-dev-ucsb-2.test.dataone.org/metacat/d1/mn/v2/meta/testUpdateSystemMetadata_MutableObsoletes_2015317211558699 [org.dataone.client.rest.RestClient]
20151114-05:16:18: [INFO]: rest call info: PUT https://mn-dev-ucsb-2.test.dataone.org/metacat/d1/mn/v2/meta; MMP message has: ParamPart:pid = testUpdateSystemMetadata_MutableObsoletes_2015317211558699; FilePart:sysmeta = /tmp/mmp.output.6270723791029175636.tmp (1089 bytes);  [org.dataone.client.rest.RestClient]
20151114-05:16:18: [INFO]: 
***************** running test for testUpdateSystemMetadata_MutableObsoletes(...) vs. node: https://mn-dev-unm-2.test.dataone.org/metacat/d1/mn ***************** [org.dataone.integration.ContextAwareTestCaseDataone]
20151114-05:16:18: [INFO]: certificate directory: /etc/dataone/client/testClientCerts/ [org.dataone.integration.ContextAwareTestCaseDataone]
20151114-05:16:18: [INFO]: certificate filename: cnDevUNM2 [org.dataone.integration.ContextAwareTestCaseDataone]
20151114-05:16:18: [INFO]: client setup as Subject: CN=urn:node:cnDevUNM2,DC=dataone,DC=org [org.dataone.integration.ContextAwareTestCaseDataone]
20151114-05:16:18: [INFO]: creating a test object.  pid = testUpdateSystemMetadata_MutableObsoletes_2015317211618346 on https://mn-dev-unm-2.test.dataone.org/metacat/d1/mn/v2 [org.dataone.integration.ContextAwareTestCaseDataone]
20151114-05:16:18: [INFO]: SystemMetadata for pid: testUpdateSystemMetadata_MutableObsoletes_2015317211618346
<?xml version="1.0" encoding="UTF-8"?><d1_v2.0:systemMetadata xmlns:d1_v2.0="http://ns.dataone.org/service/types/v2.0" xmlns:d1="http://ns.dataone.org/service/types/v1"><serialVersion>1</serialVersion><identifier>testUpdateSystemMetadata_MutableObsoletes_2015317211618346</identifier><formatId>eml://ecoinformatics.org/eml-2.0.1</formatId><size>17181</size><checksum algorithm="MD5">03ce09c6b4c3efc1681f3023402998a2</checksum><submitter>CN=urn:node:cnDevUNM2,DC=dataone,DC=org</submitter><rightsHolder>CN=testRightsHolder,DC=dataone,DC=org</rightsHolder><accessPolicy><allow><subject>CN=testRightsHolder,DC=dataone,DC=org</subject><permission>changePermission</permission></allow></accessPolicy><dateUploaded>2015-11-14T05:16:18.359+00:00</dateUploaded><dateSysMetadataModified>2015-11-14T05:16:18.359+00:00</dateSysMetadataModified><originMemberNode>urn:node:mnDevUNM2</originMemberNode><authoritativeMemberNode>urn:node:mnDevUNM2</authoritativeMemberNode></d1_v2.0:systemMetadata> [org.dataone.integration.ContextAwareTestCaseDataone]
20151114-05:16:19: [INFO]: rest call info: POST https://mn-dev-unm-2.test.dataone.org/metacat/d1/mn/v2/object; MMP message has: ParamPart:pid = testUpdateSystemMetadata_MutableObsoletes_2015317211618346; FilePart:object = /tmp/mmp.output.1651537478415698624.tmp (17181 bytes); FilePart:sysmeta = /tmp/mmp.output.5251709511489064867.tmp (982 bytes);  [org.dataone.client.rest.RestClient]
20151114-05:16:19: [INFO]: object created.  pid = testUpdateSystemMetadata_MutableObsoletes_2015317211618346 [org.dataone.integration.ContextAwareTestCaseDataone]
20151114-05:16:19: [INFO]: certificate directory: /etc/dataone/client/testClientCerts/ [org.dataone.integration.ContextAwareTestCaseDataone]
20151114-05:16:19: [INFO]: certificate filename: cnDevUNM2 [org.dataone.integration.ContextAwareTestCaseDataone]
20151114-05:16:19: [INFO]: client setup as Subject: CN=urn:node:cnDevUNM2,DC=dataone,DC=org [org.dataone.integration.ContextAwareTestCaseDataone]
20151114-05:16:19: [INFO]: creating a test object.  pid = testUpdateSystemMetadata_MutableObsoletes_2015317211618347 on https://mn-dev-unm-2.test.dataone.org/metacat/d1/mn/v2 [org.dataone.integration.ContextAwareTestCaseDataone]
20151114-05:16:19: [INFO]: SystemMetadata for pid: testUpdateSystemMetadata_MutableObsoletes_2015317211618347
<?xml version="1.0" encoding="UTF-8"?><d1_v2.0:systemMetadata xmlns:d1_v2.0="http://ns.dataone.org/service/types/v2.0" xmlns:d1="http://ns.dataone.org/service/types/v1"><serialVersion>1</serialVersion><identifier>testUpdateSystemMetadata_MutableObsoletes_2015317211618347</identifier><formatId>eml://ecoinformatics.org/eml-2.0.1</formatId><size>17181</size><checksum algorithm="MD5">03ce09c6b4c3efc1681f3023402998a2</checksum><submitter>CN=urn:node:cnDevUNM2,DC=dataone,DC=org</submitter><rightsHolder>CN=testRightsHolder,DC=dataone,DC=org</rightsHolder><accessPolicy><allow><subject>CN=testRightsHolder,DC=dataone,DC=org</subject><permission>changePermission</permission></allow></accessPolicy><dateUploaded>2015-11-14T05:16:19.596+00:00</dateUploaded><dateSysMetadataModified>2015-11-14T05:16:19.596+00:00</dateSysMetadataModified><originMemberNode>urn:node:mnDevUNM2</originMemberNode><authoritativeMemberNode>urn:node:mnDevUNM2</authoritativeMemberNode></d1_v2.0:systemMetadata> [org.dataone.integration.ContextAwareTestCaseDataone]
20151114-05:16:20: [INFO]: rest call info: POST https://mn-dev-unm-2.test.dataone.org/metacat/d1/mn/v2/object; MMP message has: ParamPart:pid = testUpdateSystemMetadata_MutableObsoletes_2015317211618347; FilePart:object = /tmp/mmp.output.8797595513904935372.tmp (17181 bytes); FilePart:sysmeta = /tmp/mmp.output.2891940184223667639.tmp (982 bytes);  [org.dataone.client.rest.RestClient]
20151114-05:16:20: [INFO]: object created.  pid = testUpdateSystemMetadata_MutableObsoletes_2015317211618347 [org.dataone.integration.ContextAwareTestCaseDataone]
20151114-05:16:30: [INFO]: rest call info: GET https://mn-dev-unm-2.test.dataone.org/metacat/d1/mn/v2/meta/testUpdateSystemMetadata_MutableObsoletes_2015317211618347 [org.dataone.client.rest.RestClient]
20151114-05:16:36: [INFO]: rest call info: PUT https://mn-dev-unm-2.test.dataone.org/metacat/d1/mn/v2/meta; MMP message has: ParamPart:pid = testUpdateSystemMetadata_MutableObsoletes_2015317211618347; FilePart:sysmeta = /tmp/mmp.output.8188953991148406512.tmp (1087 bytes);  [org.dataone.client.rest.RestClient]
20151114-05:16:36: [INFO]: **************************************************** [org.dataone.integration.ContextAwareTestCaseDataone]
20151114-05:16:36: [INFO]: ***  context label:   DEV2 [org.dataone.integration.ContextAwareTestCaseDataone]
20151114-05:16:36: [INFO]: **************************************************** [org.dataone.integration.ContextAwareTestCaseDataone]
20151114-05:16:36: [INFO]: **************************************************** [org.dataone.integration.ContextAwareTestCaseDataone]
20151114-05:16:36: [INFO]: rest call info: GET https://mn-dev-ucsb-1.test.dataone.org/metacat/d1/mn/v2/monitor/ping [org.dataone.client.rest.RestClient]
20151114-05:16:36: [INFO]: MN excluded from test: https://mn-dev-ucsb-1.test.dataone.org/metacat/d1/mn [org.dataone.integration.ContextAwareTestCaseDataone]
20151114-05:16:36: [INFO]: rest call info: GET https://mn-dev-ucsb-2.test.dataone.org/metacat/d1/mn/v2/monitor/ping [org.dataone.client.rest.RestClient]
20151114-05:16:36: [INFO]: MN included in test: https://mn-dev-ucsb-2.test.dataone.org/metacat/d1/mn [org.dataone.integration.ContextAwareTestCaseDataone]
20151114-05:16:36: [INFO]: rest call info: GET https://mn-dev-unm-1.test.dataone.org/metacat/d1/mn/v2/monitor/ping [org.dataone.client.rest.RestClient]
20151114-05:16:36: [INFO]: MN excluded from test: https://mn-dev-unm-1.test.dataone.org/metacat/d1/mn [org.dataone.integration.ContextAwareTestCaseDataone]
20151114-05:16:36: [INFO]: rest call info: GET https://mn-dev-unm-2.test.dataone.org/metacat/d1/mn/v2/monitor/ping [org.dataone.client.rest.RestClient]
20151114-05:16:36: [INFO]: MN included in test: https://mn-dev-unm-2.test.dataone.org/metacat/d1/mn [org.dataone.integration.ContextAwareTestCaseDataone]
20151114-05:16:36: [INFO]: 
***************** running test for testUpdateSystemMetadata_CNCertNonAuthMN(...) vs. node: https://mn-dev-ucsb-2.test.dataone.org/metacat/d1/mn ***************** [org.dataone.integration.ContextAwareTestCaseDataone]
20151114-05:16:37: [INFO]: rest call info: GET https://cn-dev-ucsb-2.test.dataone.org/cn/v2/node [org.dataone.client.rest.RestClient]
Tests run: 14, Failures: 1, Errors: 0, Skipped: 1, Time elapsed: 409.105 sec <<< FAILURE!

Results :

Failed tests: 
  testRegisterSystemMetadata_dateModified(org.dataone.integration.it.apiTests.MNSystemMetadataMutabilityIt): Unable to fetch node list from CN: https://cn-dev-ucsb-2.test.dataone.org/cn/v2
  testSetReplicationStatus_dateModified(org.dataone.integration.it.apiTests.MNSystemMetadataMutabilityIt): Unable to fetch node list from CN: https://cn-dev-ucsb-2.test.dataone.org/cn/v2
  testSetReplicationMetadata_dateModified(org.dataone.integration.it.apiTests.MNSystemMetadataMutabilityIt): Unable to fetch node list from CN: https://cn-dev-ucsb-2.test.dataone.org/cn/v2
  testDeleteReplicationMetadata_dateModified(org.dataone.integration.it.apiTests.MNSystemMetadataMutabilityIt): Unable to fetch node list from CN: https://cn-dev-ucsb-2.test.dataone.org/cn/v2
  testUpdateSystemMetadata_CNCertNonAuthMN(org.dataone.integration.it.apiTests.MNUpdateSystemMetadataIT): Test setup failed. Couldn't create object: GET https://cn-dev-ucsb-2.test.dataone.org/cn/v2/node : ServiceFailure: -1: 500: Internal Server Error: Deserializing Text/Plain: Just providing message body:

Tests run: 18, Failures: 5, Errors: 0, Skipped: 1

[WARNING] File encoding has not been set, using platform encoding UTF-8, i.e. build is platform dependent!
[JENKINS] Recording test results
[INFO] 
[INFO] --- maven-failsafe-plugin:2.8.1:verify (verify) @ d1_integration ---
[INFO] Failsafe report directory: /var/lib/jenkins/jobs/d1_integration_DEV2_mn_sysmeta_mutability/workspace/target/failsafe-reports
[WARNING] File encoding has not been set, using platform encoding UTF-8, i.e. build is platform dependent!
[ERROR] There are test failures.

Please refer to /var/lib/jenkins/jobs/d1_integration_DEV2_mn_sysmeta_mutability/workspace/target/failsafe-reports for the individual test results.
[JENKINS] Recording test results
Notifying upstream projects of job completion
Join notifier requires a CauseAction
[INFO] ------------------------------------------------------------------------
[INFO] BUILD SUCCESS
[INFO] ------------------------------------------------------------------------
[INFO] Total time: 7:26.506s
[INFO] Finished at: Sat Nov 14 05:16:37 UTC 2015
[INFO] Final Memory: 49M/744M
[INFO] ------------------------------------------------------------------------
Waiting for Jenkins to finish collecting data
[JENKINS] Archiving /var/lib/jenkins/jobs/d1_integration_DEV2_mn_sysmeta_mutability/workspace/pom.xml to org.dataone/d1_integration/2.0-SNAPSHOT/d1_integration-2.0-SNAPSHOT.pom
channel stopped
Notifying upstream projects of job completion
Warning: you have no plugins providing access control for builds, so falling back to legacy behavior of permitting any downstream builds to be triggered
Finished: UNSTABLE