UnstableConsole Output

Skipping 182 KB.. Full Log
.runners.statements.RunAfters.evaluate(RunAfters.java:31)
	at org.junit.runners.BlockJUnit4ClassRunner.runChild(BlockJUnit4ClassRunner.java:76)
	at org.junit.runners.BlockJUnit4ClassRunner.runChild(BlockJUnit4ClassRunner.java:50)
	at org.junit.runners.ParentRunner$3.run(ParentRunner.java:193)
	at org.junit.runners.ParentRunner$1.schedule(ParentRunner.java:52)
	at org.junit.runners.ParentRunner.runChildren(ParentRunner.java:191)
	at org.junit.runners.ParentRunner.access$000(ParentRunner.java:42)
	at org.junit.runners.ParentRunner$2.evaluate(ParentRunner.java:184)
	at org.junit.runners.ParentRunner.run(ParentRunner.java:236)
	at org.apache.maven.surefire.junit4.JUnit4TestSet.execute(JUnit4TestSet.java:53)
	at org.apache.maven.surefire.junit4.JUnit4Provider.executeTestSet(JUnit4Provider.java:123)
	at org.apache.maven.surefire.junit4.JUnit4Provider.invoke(JUnit4Provider.java:104)
	at sun.reflect.NativeMethodAccessorImpl.invoke0(Native Method)
	at sun.reflect.NativeMethodAccessorImpl.invoke(NativeMethodAccessorImpl.java:57)
	at sun.reflect.DelegatingMethodAccessorImpl.invoke(DelegatingMethodAccessorImpl.java:43)
	at java.lang.reflect.Method.invoke(Method.java:606)
	at org.apache.maven.surefire.util.ReflectionUtils.invokeMethodWithArray(ReflectionUtils.java:164)
	at org.apache.maven.surefire.booter.ProviderFactory$ProviderProxy.invoke(ProviderFactory.java:110)
	at org.apache.maven.surefire.booter.SurefireStarter.invokeProvider(SurefireStarter.java:175)
	at org.apache.maven.surefire.booter.SurefireStarter.runSuitesInProcessWhenForked(SurefireStarter.java:107)
	at org.apache.maven.surefire.booter.ForkedBooter.main(ForkedBooter.java:68)
Caused by: org.apache.commons.configuration.ConfigurationException: Cannot locate configuration source null
	at org.apache.commons.configuration.AbstractFileConfiguration.load(AbstractFileConfiguration.java:217)
	at org.apache.commons.configuration.AbstractFileConfiguration.load(AbstractFileConfiguration.java:197)
	at org.apache.commons.configuration.AbstractFileConfiguration.<init>(AbstractFileConfiguration.java:181)
	at org.apache.commons.configuration.PropertiesConfiguration.<init>(PropertiesConfiguration.java:269)
	at org.dataone.configuration.TestSettings.loadConfigurationFile(TestSettings.java:199)
	at org.dataone.configuration.TestSettings.getConfiguration(TestSettings.java:69)
	... 38 more
20151113-05:09:30: [ERROR]: Problem loading testing configuration at: 'null':: Cannot locate configuration source null [org.dataone.configuration.TestSettings]
20151113-05:09:30: [ERROR]: General Problem loading TestSettings. InvocationTargetException: null [org.dataone.configuration.Settings]
java.lang.reflect.InvocationTargetException
	at sun.reflect.NativeMethodAccessorImpl.invoke0(Native Method)
	at sun.reflect.NativeMethodAccessorImpl.invoke(NativeMethodAccessorImpl.java:57)
	at sun.reflect.DelegatingMethodAccessorImpl.invoke(DelegatingMethodAccessorImpl.java:43)
	at java.lang.reflect.Method.invoke(Method.java:606)
	at org.dataone.configuration.Settings.loadTestConfigurations(Settings.java:151)
	at org.dataone.configuration.Settings.getConfiguration(Settings.java:87)
	at org.dataone.configuration.Settings.getResetConfiguration(Settings.java:123)
	at org.dataone.configuration.TestSettingsTest.testContextSafetyOnError(TestSettingsTest.java:209)
	at sun.reflect.NativeMethodAccessorImpl.invoke0(Native Method)
	at sun.reflect.NativeMethodAccessorImpl.invoke(NativeMethodAccessorImpl.java:57)
	at sun.reflect.DelegatingMethodAccessorImpl.invoke(DelegatingMethodAccessorImpl.java:43)
	at java.lang.reflect.Method.invoke(Method.java:606)
	at org.junit.runners.model.FrameworkMethod$1.runReflectiveCall(FrameworkMethod.java:44)
	at org.junit.internal.runners.model.ReflectiveCallable.run(ReflectiveCallable.java:15)
	at org.junit.runners.model.FrameworkMethod.invokeExplosively(FrameworkMethod.java:41)
	at org.junit.internal.runners.statements.InvokeMethod.evaluate(InvokeMethod.java:20)
	at org.junit.internal.runners.statements.RunBefores.evaluate(RunBefores.java:28)
	at org.junit.internal.runners.statements.RunAfters.evaluate(RunAfters.java:31)
	at org.junit.runners.BlockJUnit4ClassRunner.runChild(BlockJUnit4ClassRunner.java:76)
	at org.junit.runners.BlockJUnit4ClassRunner.runChild(BlockJUnit4ClassRunner.java:50)
	at org.junit.runners.ParentRunner$3.run(ParentRunner.java:193)
	at org.junit.runners.ParentRunner$1.schedule(ParentRunner.java:52)
	at org.junit.runners.ParentRunner.runChildren(ParentRunner.java:191)
	at org.junit.runners.ParentRunner.access$000(ParentRunner.java:42)
	at org.junit.runners.ParentRunner$2.evaluate(ParentRunner.java:184)
	at org.junit.runners.ParentRunner.run(ParentRunner.java:236)
	at org.apache.maven.surefire.junit4.JUnit4TestSet.execute(JUnit4TestSet.java:53)
	at org.apache.maven.surefire.junit4.JUnit4Provider.executeTestSet(JUnit4Provider.java:123)
	at org.apache.maven.surefire.junit4.JUnit4Provider.invoke(JUnit4Provider.java:104)
	at sun.reflect.NativeMethodAccessorImpl.invoke0(Native Method)
	at sun.reflect.NativeMethodAccessorImpl.invoke(NativeMethodAccessorImpl.java:57)
	at sun.reflect.DelegatingMethodAccessorImpl.invoke(DelegatingMethodAccessorImpl.java:43)
	at java.lang.reflect.Method.invoke(Method.java:606)
	at org.apache.maven.surefire.util.ReflectionUtils.invokeMethodWithArray(ReflectionUtils.java:164)
	at org.apache.maven.surefire.booter.ProviderFactory$ProviderProxy.invoke(ProviderFactory.java:110)
	at org.apache.maven.surefire.booter.SurefireStarter.invokeProvider(SurefireStarter.java:175)
	at org.apache.maven.surefire.booter.SurefireStarter.runSuitesInProcessWhenForked(SurefireStarter.java:107)
	at org.apache.maven.surefire.booter.ForkedBooter.main(ForkedBooter.java:68)
Caused by: org.apache.commons.configuration.ConfigurationException: Cannot locate configuration source null
	at org.apache.commons.configuration.AbstractFileConfiguration.load(AbstractFileConfiguration.java:217)
	at org.apache.commons.configuration.AbstractFileConfiguration.load(AbstractFileConfiguration.java:197)
	at org.apache.commons.configuration.AbstractFileConfiguration.<init>(AbstractFileConfiguration.java:181)
	at org.apache.commons.configuration.PropertiesConfiguration.<init>(PropertiesConfiguration.java:269)
	at org.dataone.configuration.TestSettings.loadConfigurationFile(TestSettings.java:199)
	at org.dataone.configuration.TestSettings.getConfiguration(TestSettings.java:69)
	... 38 more
20151113-05:09:30: [ERROR]: Problem loading testing configuration at: 'null':: Cannot locate configuration source null [org.dataone.configuration.TestSettings]
20151113-05:09:30: [ERROR]: General Problem loading TestSettings. InvocationTargetException: null [org.dataone.configuration.Settings]
java.lang.reflect.InvocationTargetException
	at sun.reflect.NativeMethodAccessorImpl.invoke0(Native Method)
	at sun.reflect.NativeMethodAccessorImpl.invoke(NativeMethodAccessorImpl.java:57)
	at sun.reflect.DelegatingMethodAccessorImpl.invoke(DelegatingMethodAccessorImpl.java:43)
	at java.lang.reflect.Method.invoke(Method.java:606)
	at org.dataone.configuration.Settings.loadTestConfigurations(Settings.java:151)
	at org.dataone.configuration.Settings.getConfiguration(Settings.java:87)
	at org.dataone.configuration.Settings.getResetConfiguration(Settings.java:123)
	at org.dataone.configuration.TestSettingsTest.testContextSafetyOnError(TestSettingsTest.java:211)
	at sun.reflect.NativeMethodAccessorImpl.invoke0(Native Method)
	at sun.reflect.NativeMethodAccessorImpl.invoke(NativeMethodAccessorImpl.java:57)
	at sun.reflect.DelegatingMethodAccessorImpl.invoke(DelegatingMethodAccessorImpl.java:43)
	at java.lang.reflect.Method.invoke(Method.java:606)
	at org.junit.runners.model.FrameworkMethod$1.runReflectiveCall(FrameworkMethod.java:44)
	at org.junit.internal.runners.model.ReflectiveCallable.run(ReflectiveCallable.java:15)
	at org.junit.runners.model.FrameworkMethod.invokeExplosively(FrameworkMethod.java:41)
	at org.junit.internal.runners.statements.InvokeMethod.evaluate(InvokeMethod.java:20)
	at org.junit.internal.runners.statements.RunBefores.evaluate(RunBefores.java:28)
	at org.junit.internal.runners.statements.RunAfters.evaluate(RunAfters.java:31)
	at org.junit.runners.BlockJUnit4ClassRunner.runChild(BlockJUnit4ClassRunner.java:76)
	at org.junit.runners.BlockJUnit4ClassRunner.runChild(BlockJUnit4ClassRunner.java:50)
	at org.junit.runners.ParentRunner$3.run(ParentRunner.java:193)
	at org.junit.runners.ParentRunner$1.schedule(ParentRunner.java:52)
	at org.junit.runners.ParentRunner.runChildren(ParentRunner.java:191)
	at org.junit.runners.ParentRunner.access$000(ParentRunner.java:42)
	at org.junit.runners.ParentRunner$2.evaluate(ParentRunner.java:184)
	at org.junit.runners.ParentRunner.run(ParentRunner.java:236)
	at org.apache.maven.surefire.junit4.JUnit4TestSet.execute(JUnit4TestSet.java:53)
	at org.apache.maven.surefire.junit4.JUnit4Provider.executeTestSet(JUnit4Provider.java:123)
	at org.apache.maven.surefire.junit4.JUnit4Provider.invoke(JUnit4Provider.java:104)
	at sun.reflect.NativeMethodAccessorImpl.invoke0(Native Method)
	at sun.reflect.NativeMethodAccessorImpl.invoke(NativeMethodAccessorImpl.java:57)
	at sun.reflect.DelegatingMethodAccessorImpl.invoke(DelegatingMethodAccessorImpl.java:43)
	at java.lang.reflect.Method.invoke(Method.java:606)
	at org.apache.maven.surefire.util.ReflectionUtils.invokeMethodWithArray(ReflectionUtils.java:164)
	at org.apache.maven.surefire.booter.ProviderFactory$ProviderProxy.invoke(ProviderFactory.java:110)
	at org.apache.maven.surefire.booter.SurefireStarter.invokeProvider(SurefireStarter.java:175)
	at org.apache.maven.surefire.booter.SurefireStarter.runSuitesInProcessWhenForked(SurefireStarter.java:107)
	at org.apache.maven.surefire.booter.ForkedBooter.main(ForkedBooter.java:68)
Caused by: org.apache.commons.configuration.ConfigurationException: Cannot locate configuration source null
	at org.apache.commons.configuration.AbstractFileConfiguration.load(AbstractFileConfiguration.java:217)
	at org.apache.commons.configuration.AbstractFileConfiguration.load(AbstractFileConfiguration.java:197)
	at org.apache.commons.configuration.AbstractFileConfiguration.<init>(AbstractFileConfiguration.java:181)
	at org.apache.commons.configuration.PropertiesConfiguration.<init>(PropertiesConfiguration.java:269)
	at org.dataone.configuration.TestSettings.loadConfigurationFile(TestSettings.java:199)
	at org.dataone.configuration.TestSettings.getConfiguration(TestSettings.java:69)
	... 38 more
Tests run: 11, Failures: 0, Errors: 0, Skipped: 1, Time elapsed: 0.1 sec
Running org.dataone.client.PoolingHttpClientConnectionManagerTest
Tests run: 2, Failures: 0, Errors: 0, Skipped: 1, Time elapsed: 0.001 sec
Running org.dataone.client.CNRestURLTest
Tests run: 9, Failures: 0, Errors: 0, Skipped: 8, Time elapsed: 0.017 sec

Results :

Tests run: 35, Failures: 0, Errors: 0, Skipped: 12

[JENKINS] Recording test results
[INFO] 
[INFO] --- maven-antrun-plugin:1.3:run (execution1) @ d1_integration ---
[INFO] Executing tasks
     [copy] Copying 236 files to /var/lib/jenkins/jobs/d1_integration_DEV2_mn_sysmeta_mutability/workspace/target/classes
     [copy] Copying 3 files to /var/lib/jenkins/jobs/d1_integration_DEV2_mn_sysmeta_mutability/workspace/target/d1_integration-2.0-SNAPSHOT/org/dataone/integration/webTest
[INFO] Executed tasks
[INFO] 
[INFO] --- maven-dependency-plugin:2.3:unpack-dependencies (jetty-classpath) @ d1_integration ---
[INFO] Unpacking /var/lib/jenkins/.m2/repository/org/eclipse/jetty/orbit/org.apache.jasper.glassfish/2.2.2.v201112011158/org.apache.jasper.glassfish-2.2.2.v201112011158.jar to /var/lib/jenkins/jobs/d1_integration_DEV2_mn_sysmeta_mutability/workspace/target/d1_integration-2.0-SNAPSHOT with includes "" and excludes ""
[INFO] Unpacking /var/lib/jenkins/.m2/repository/org/slf4j/slf4j-simple/1.6.4/slf4j-simple-1.6.4.jar to /var/lib/jenkins/jobs/d1_integration_DEV2_mn_sysmeta_mutability/workspace/target/d1_integration-2.0-SNAPSHOT with includes "" and excludes ""
[INFO] Unpacking /var/lib/jenkins/.m2/repository/org/eclipse/jetty/jetty-websocket/8.1.15.v20140411/jetty-websocket-8.1.15.v20140411.jar to /var/lib/jenkins/jobs/d1_integration_DEV2_mn_sysmeta_mutability/workspace/target/d1_integration-2.0-SNAPSHOT with includes "" and excludes ""
[INFO] Unpacking /var/lib/jenkins/.m2/repository/org/eclipse/jetty/orbit/javax.security.auth.message/1.0.0.v201108011116/javax.security.auth.message-1.0.0.v201108011116.jar to /var/lib/jenkins/jobs/d1_integration_DEV2_mn_sysmeta_mutability/workspace/target/d1_integration-2.0-SNAPSHOT with includes "" and excludes ""
[INFO] Unpacking /var/lib/jenkins/.m2/repository/org/eclipse/jetty/orbit/javax.servlet.jsp.jstl/1.2.0.v201105211821/javax.servlet.jsp.jstl-1.2.0.v201105211821.jar to /var/lib/jenkins/jobs/d1_integration_DEV2_mn_sysmeta_mutability/workspace/target/d1_integration-2.0-SNAPSHOT with includes "" and excludes ""
[INFO] Unpacking /var/lib/jenkins/.m2/repository/org/eclipse/jetty/orbit/com.sun.el/2.2.0.v201108011116/com.sun.el-2.2.0.v201108011116.jar to /var/lib/jenkins/jobs/d1_integration_DEV2_mn_sysmeta_mutability/workspace/target/d1_integration-2.0-SNAPSHOT with includes "" and excludes ""
[INFO] Unpacking /var/lib/jenkins/.m2/repository/org/eclipse/jetty/orbit/javax.mail.glassfish/1.4.1.v201005082020/javax.mail.glassfish-1.4.1.v201005082020.jar to /var/lib/jenkins/jobs/d1_integration_DEV2_mn_sysmeta_mutability/workspace/target/d1_integration-2.0-SNAPSHOT with includes "" and excludes ""
[INFO] Unpacking /var/lib/jenkins/.m2/repository/org/slf4j/slf4j-api/1.6.4/slf4j-api-1.6.4.jar to /var/lib/jenkins/jobs/d1_integration_DEV2_mn_sysmeta_mutability/workspace/target/d1_integration-2.0-SNAPSHOT with includes "" and excludes ""
[INFO] Unpacking /var/lib/jenkins/.m2/repository/org/eclipse/jetty/jetty-io/8.1.15.v20140411/jetty-io-8.1.15.v20140411.jar to /var/lib/jenkins/jobs/d1_integration_DEV2_mn_sysmeta_mutability/workspace/target/d1_integration-2.0-SNAPSHOT with includes "" and excludes ""
[INFO] Unpacking /var/lib/jenkins/.m2/repository/org/eclipse/jetty/orbit/javax.servlet.jsp/2.2.0.v201112011158/javax.servlet.jsp-2.2.0.v201112011158.jar to /var/lib/jenkins/jobs/d1_integration_DEV2_mn_sysmeta_mutability/workspace/target/d1_integration-2.0-SNAPSHOT with includes "" and excludes ""
[INFO] Unpacking /var/lib/jenkins/.m2/repository/org/eclipse/jetty/aggregate/jetty-all-server/8.1.15.v20140411/jetty-all-server-8.1.15.v20140411.jar to /var/lib/jenkins/jobs/d1_integration_DEV2_mn_sysmeta_mutability/workspace/target/d1_integration-2.0-SNAPSHOT with includes "" and excludes ""
[INFO] Unpacking /var/lib/jenkins/.m2/repository/org/eclipse/jetty/jetty-jsp/8.1.15.v20140411/jetty-jsp-8.1.15.v20140411.jar to /var/lib/jenkins/jobs/d1_integration_DEV2_mn_sysmeta_mutability/workspace/target/d1_integration-2.0-SNAPSHOT with includes "" and excludes ""
[INFO] Unpacking /var/lib/jenkins/.m2/repository/org/eclipse/jetty/orbit/org.apache.taglibs.standard.glassfish/1.2.0.v201112081803/org.apache.taglibs.standard.glassfish-1.2.0.v201112081803.jar to /var/lib/jenkins/jobs/d1_integration_DEV2_mn_sysmeta_mutability/workspace/target/d1_integration-2.0-SNAPSHOT with includes "" and excludes ""
[INFO] Unpacking /var/lib/jenkins/.m2/repository/javax/servlet/servlet-api/2.5/servlet-api-2.5.jar to /var/lib/jenkins/jobs/d1_integration_DEV2_mn_sysmeta_mutability/workspace/target/d1_integration-2.0-SNAPSHOT with includes "" and excludes ""
[INFO] Unpacking /var/lib/jenkins/.m2/repository/org/eclipse/jetty/orbit/javax.activation/1.1.0.v201105071233/javax.activation-1.1.0.v201105071233.jar to /var/lib/jenkins/jobs/d1_integration_DEV2_mn_sysmeta_mutability/workspace/target/d1_integration-2.0-SNAPSHOT with includes "" and excludes ""
[INFO] Unpacking /var/lib/jenkins/.m2/repository/org/eclipse/jetty/orbit/javax.annotation/1.1.0.v201108011116/javax.annotation-1.1.0.v201108011116.jar to /var/lib/jenkins/jobs/d1_integration_DEV2_mn_sysmeta_mutability/workspace/target/d1_integration-2.0-SNAPSHOT with includes "" and excludes ""
[INFO] Unpacking /var/lib/jenkins/.m2/repository/org/eclipse/jetty/jetty-http/8.1.15.v20140411/jetty-http-8.1.15.v20140411.jar to /var/lib/jenkins/jobs/d1_integration_DEV2_mn_sysmeta_mutability/workspace/target/d1_integration-2.0-SNAPSHOT with includes "" and excludes ""
[INFO] Unpacking /var/lib/jenkins/.m2/repository/org/eclipse/jetty/jetty-util/8.1.15.v20140411/jetty-util-8.1.15.v20140411.jar to /var/lib/jenkins/jobs/d1_integration_DEV2_mn_sysmeta_mutability/workspace/target/d1_integration-2.0-SNAPSHOT with includes "" and excludes ""
[INFO] Unpacking /var/lib/jenkins/.m2/repository/org/eclipse/jetty/orbit/org.eclipse.jdt.core/3.7.1/org.eclipse.jdt.core-3.7.1.jar to /var/lib/jenkins/jobs/d1_integration_DEV2_mn_sysmeta_mutability/workspace/target/d1_integration-2.0-SNAPSHOT with includes "" and excludes ""
[INFO] Unpacking /var/lib/jenkins/.m2/repository/org/eclipse/jetty/orbit/javax.servlet/3.0.0.v201112011016/javax.servlet-3.0.0.v201112011016.jar to /var/lib/jenkins/jobs/d1_integration_DEV2_mn_sysmeta_mutability/workspace/target/d1_integration-2.0-SNAPSHOT with includes "" and excludes ""
[INFO] Unpacking /var/lib/jenkins/.m2/repository/org/eclipse/jetty/orbit/javax.el/2.2.0.v201108011116/javax.el-2.2.0.v201108011116.jar to /var/lib/jenkins/jobs/d1_integration_DEV2_mn_sysmeta_mutability/workspace/target/d1_integration-2.0-SNAPSHOT with includes "" and excludes ""
[INFO] 
[INFO] --- maven-war-plugin:2.1.1:war (default-war) @ d1_integration ---
[INFO] Packaging webapp
[INFO] Assembling webapp [d1_integration] in [/var/lib/jenkins/jobs/d1_integration_DEV2_mn_sysmeta_mutability/workspace/target/d1_integration-2.0-SNAPSHOT]
[INFO] Processing war project
[INFO] Copying webapp resources [/var/lib/jenkins/jobs/d1_integration_DEV2_mn_sysmeta_mutability/workspace/src/main/webapp]
[INFO] Webapp assembled in [429 msecs]
[INFO] Building war: /var/lib/jenkins/jobs/d1_integration_DEV2_mn_sysmeta_mutability/workspace/target/d1_integration-2.0-SNAPSHOT.war
[INFO] WEB-INF/web.xml already added, skipping
[INFO] 
[INFO] --- maven-antrun-plugin:1.3:run (execution2) @ d1_integration ---
[INFO] Executing tasks
     [move] Moving 1 file to /var/lib/jenkins/jobs/d1_integration_DEV2_mn_sysmeta_mutability/workspace/target
[INFO] Executed tasks
[INFO] 
[INFO] --- maven-failsafe-plugin:2.8.1:integration-test (integration-test) @ d1_integration ---
[INFO] Failsafe report directory: /var/lib/jenkins/jobs/d1_integration_DEV2_mn_sysmeta_mutability/workspace/target/failsafe-reports

-------------------------------------------------------
 T E S T S
-------------------------------------------------------
Running org.dataone.integration.it.apiTests.MNSystemMetadataMutabilityIt
20151113-05:09:44: [INFO]: **************************************************** [org.dataone.integration.ContextAwareTestCaseDataone]
20151113-05:09:44: [INFO]: ***  context label:   DEV2 [org.dataone.integration.ContextAwareTestCaseDataone]
20151113-05:09:44: [INFO]: **************************************************** [org.dataone.integration.ContextAwareTestCaseDataone]
~~~ Context is from d1client.properties: https://cn-dev-2.test.dataone.org/cn
20151113-05:09:45: [INFO]: rest call info: GET https://cn-dev-2.test.dataone.org/cn/v1/node [org.dataone.client.rest.RestClient]
20151113-05:09:45: [INFO]: isNodeAlive for Node: https://cn-dev-2.test.dataone.org/cn ... [org.dataone.integration.ContextAwareTestCaseDataone]
20151113-05:09:45: [INFO]: ... calling node ... [org.dataone.integration.ContextAwareTestCaseDataone]
20151113-05:09:45: [INFO]: rest call info: GET https://cn-dev-2.test.dataone.org/cn [org.dataone.client.rest.RestClient]
20151113-05:09:45: [INFO]: ... called node [org.dataone.integration.ContextAwareTestCaseDataone]
20151113-05:09:45: [INFO]: *** Adding CN to list: cn-dev-2 [ https://cn-dev-2.test.dataone.org/cn ] [org.dataone.integration.ContextAwareTestCaseDataone]
20151113-05:09:45: [INFO]: isNodeAlive for Node: https://cn-dev-ucsb-2.test.dataone.org/cn ... [org.dataone.integration.ContextAwareTestCaseDataone]
20151113-05:09:45: [INFO]: ... calling node ... [org.dataone.integration.ContextAwareTestCaseDataone]
20151113-05:09:45: [INFO]: rest call info: GET https://cn-dev-ucsb-2.test.dataone.org/cn [org.dataone.client.rest.RestClient]
20151113-05:09:45: [INFO]: ... called node [org.dataone.integration.ContextAwareTestCaseDataone]
20151113-05:09:45: [INFO]: *** Adding CN to list: cn-dev-ucsb-2 [ https://cn-dev-ucsb-2.test.dataone.org/cn ] [org.dataone.integration.ContextAwareTestCaseDataone]
20151113-05:09:45: [INFO]: isNodeAlive for Node: https://cn-dev-unm-2.test.dataone.org/cn ... [org.dataone.integration.ContextAwareTestCaseDataone]
20151113-05:09:45: [INFO]: ... calling node ... [org.dataone.integration.ContextAwareTestCaseDataone]
20151113-05:09:45: [INFO]: rest call info: GET https://cn-dev-unm-2.test.dataone.org/cn [org.dataone.client.rest.RestClient]
20151113-05:09:45: [INFO]: ... called node [org.dataone.integration.ContextAwareTestCaseDataone]
20151113-05:09:45: [INFO]: *** Adding CN to list: cn-dev-unm-2 [ https://cn-dev-unm-2.test.dataone.org/cn ] [org.dataone.integration.ContextAwareTestCaseDataone]
20151113-05:09:45: [INFO]: isNodeAlive for Node: https://mn-dev-ucsb-1.test.dataone.org/metacat/d1/mn ... [org.dataone.integration.ContextAwareTestCaseDataone]
20151113-05:09:45: [INFO]: ... calling node ... [org.dataone.integration.ContextAwareTestCaseDataone]
20151113-05:09:46: [INFO]: rest call info: GET https://mn-dev-ucsb-1.test.dataone.org/metacat/d1/mn [org.dataone.client.rest.RestClient]
20151113-05:09:46: [INFO]: ... called node [org.dataone.integration.ContextAwareTestCaseDataone]
20151113-05:09:46: [INFO]: *** Adding MN to list: mn-dev-ucsb-1 [ https://mn-dev-ucsb-1.test.dataone.org/metacat/d1/mn ] [org.dataone.integration.ContextAwareTestCaseDataone]
20151113-05:09:46: [INFO]: isNodeAlive for Node: https://mn-dev-ucsb-2.test.dataone.org/metacat/d1/mn ... [org.dataone.integration.ContextAwareTestCaseDataone]
20151113-05:09:46: [INFO]: ... calling node ... [org.dataone.integration.ContextAwareTestCaseDataone]
20151113-05:09:46: [INFO]: rest call info: GET https://mn-dev-ucsb-2.test.dataone.org/metacat/d1/mn [org.dataone.client.rest.RestClient]
20151113-05:09:46: [INFO]: ... called node [org.dataone.integration.ContextAwareTestCaseDataone]
20151113-05:09:46: [INFO]: *** Adding MN to list: mn-dev-ucsb-2 [ https://mn-dev-ucsb-2.test.dataone.org/metacat/d1/mn ] [org.dataone.integration.ContextAwareTestCaseDataone]
20151113-05:09:46: [INFO]: isNodeAlive for Node: https://mn-dev-unm-1.test.dataone.org/metacat/d1/mn ... [org.dataone.integration.ContextAwareTestCaseDataone]
20151113-05:09:46: [INFO]: ... calling node ... [org.dataone.integration.ContextAwareTestCaseDataone]
20151113-05:09:46: [INFO]: rest call info: GET https://mn-dev-unm-1.test.dataone.org/metacat/d1/mn [org.dataone.client.rest.RestClient]
20151113-05:09:46: [INFO]: ... called node [org.dataone.integration.ContextAwareTestCaseDataone]
20151113-05:09:46: [INFO]: *** Adding MN to list: mn-dev-unm-1 [ https://mn-dev-unm-1.test.dataone.org/metacat/d1/mn ] [org.dataone.integration.ContextAwareTestCaseDataone]
20151113-05:09:46: [INFO]: isNodeAlive for Node: https://mn-dev-unm-2.test.dataone.org/metacat/d1/mn ... [org.dataone.integration.ContextAwareTestCaseDataone]
20151113-05:09:46: [INFO]: ... calling node ... [org.dataone.integration.ContextAwareTestCaseDataone]
20151113-05:09:46: [INFO]: rest call info: GET https://mn-dev-unm-2.test.dataone.org/metacat/d1/mn [org.dataone.client.rest.RestClient]
20151113-05:09:46: [INFO]: ... called node [org.dataone.integration.ContextAwareTestCaseDataone]
20151113-05:09:46: [INFO]: *** Adding MN to list: mn-dev-unm-2 [ https://mn-dev-unm-2.test.dataone.org/metacat/d1/mn ] [org.dataone.integration.ContextAwareTestCaseDataone]
20151113-05:09:46: [INFO]: trying to filter CN list for the round robin CN... original size: 3, includes nodes: [org.dataone.integration.ContextAwareTestCaseDataone]
20151113-05:09:46: [INFO]:     CN: https://cn-dev-2.test.dataone.org/cn "Development 2 Round Robin Router Node" [org.dataone.integration.ContextAwareTestCaseDataone]
20151113-05:09:46: [INFO]:     CN: https://cn-dev-ucsb-2.test.dataone.org/cn "UCSB Development 2 Protocol Coordinating Node" [org.dataone.integration.ContextAwareTestCaseDataone]
20151113-05:09:46: [INFO]:     CN: https://cn-dev-unm-2.test.dataone.org/cn "UNM Development 2 Protocol Coordinating Node" [org.dataone.integration.ContextAwareTestCaseDataone]
20151113-05:09:46: [INFO]: excluding round robin CN: https://cn-dev-2.test.dataone.org/cn "Development 2 Round Robin Router Node" [org.dataone.integration.ContextAwareTestCaseDataone]
20151113-05:09:46: [INFO]: including CN: https://cn-dev-ucsb-2.test.dataone.org/cn "UCSB Development 2 Protocol Coordinating Node" [org.dataone.integration.ContextAwareTestCaseDataone]
20151113-05:09:46: [INFO]: including CN: https://cn-dev-unm-2.test.dataone.org/cn "UNM Development 2 Protocol Coordinating Node" [org.dataone.integration.ContextAwareTestCaseDataone]
20151113-05:09:46: [INFO]: filtered CN list without round robin CN. size: 2, including nodes: [org.dataone.integration.ContextAwareTestCaseDataone]
20151113-05:09:46: [INFO]:     CN: https://cn-dev-ucsb-2.test.dataone.org/cn "UCSB Development 2 Protocol Coordinating Node" [org.dataone.integration.ContextAwareTestCaseDataone]
20151113-05:09:46: [INFO]:     CN: https://cn-dev-unm-2.test.dataone.org/cn "UNM Development 2 Protocol Coordinating Node" [org.dataone.integration.ContextAwareTestCaseDataone]
20151113-05:09:46: [INFO]: **************************************************** [org.dataone.integration.ContextAwareTestCaseDataone]
20151113-05:09:46: [INFO]: certificate directory: /etc/dataone/client/testClientCerts/ [org.dataone.integration.ContextAwareTestCaseDataone]
20151113-05:09:46: [INFO]: certificate filename: cnDevUNM2 [org.dataone.integration.ContextAwareTestCaseDataone]
20151113-05:09:46: [INFO]: client setup as Subject: CN=urn:node:cnDevUNM2,DC=dataone,DC=org [org.dataone.integration.ContextAwareTestCaseDataone]
20151113-05:09:46: [INFO]: rest call info: GET https://cn-dev-ucsb-2.test.dataone.org/cn/v2/node [org.dataone.client.rest.RestClient]
20151113-05:09:46: [INFO]: **************************************************** [org.dataone.integration.ContextAwareTestCaseDataone]
20151113-05:09:46: [INFO]: ***  context label:   DEV2 [org.dataone.integration.ContextAwareTestCaseDataone]
20151113-05:09:46: [INFO]: **************************************************** [org.dataone.integration.ContextAwareTestCaseDataone]
20151113-05:09:46: [INFO]: **************************************************** [org.dataone.integration.ContextAwareTestCaseDataone]
20151113-05:09:47: [INFO]: rest call info: GET https://cn-dev-ucsb-2.test.dataone.org/cn/v2/node [org.dataone.client.rest.RestClient]
20151113-05:09:47: [INFO]: **************************************************** [org.dataone.integration.ContextAwareTestCaseDataone]
20151113-05:09:47: [INFO]: ***  context label:   DEV2 [org.dataone.integration.ContextAwareTestCaseDataone]
20151113-05:09:47: [INFO]: **************************************************** [org.dataone.integration.ContextAwareTestCaseDataone]
20151113-05:09:47: [INFO]: **************************************************** [org.dataone.integration.ContextAwareTestCaseDataone]
20151113-05:09:47: [INFO]: rest call info: GET https://cn-dev-ucsb-2.test.dataone.org/cn/v2/node [org.dataone.client.rest.RestClient]
20151113-05:09:47: [INFO]: **************************************************** [org.dataone.integration.ContextAwareTestCaseDataone]
20151113-05:09:47: [INFO]: ***  context label:   DEV2 [org.dataone.integration.ContextAwareTestCaseDataone]
20151113-05:09:47: [INFO]: **************************************************** [org.dataone.integration.ContextAwareTestCaseDataone]
20151113-05:09:47: [INFO]: **************************************************** [org.dataone.integration.ContextAwareTestCaseDataone]
20151113-05:09:47: [INFO]: rest call info: GET https://cn-dev-ucsb-2.test.dataone.org/cn/v2/node [org.dataone.client.rest.RestClient]
Tests run: 4, Failures: 4, Errors: 0, Skipped: 0, Time elapsed: 4.141 sec <<< FAILURE!
Running org.dataone.integration.it.apiTests.MNUpdateSystemMetadataIT
20151113-05:09:47: [INFO]: **************************************************** [org.dataone.integration.ContextAwareTestCaseDataone]
20151113-05:09:47: [INFO]: ***  context label:   DEV2 [org.dataone.integration.ContextAwareTestCaseDataone]
20151113-05:09:47: [INFO]: **************************************************** [org.dataone.integration.ContextAwareTestCaseDataone]
20151113-05:09:47: [INFO]: **************************************************** [org.dataone.integration.ContextAwareTestCaseDataone]
20151113-05:09:47: [INFO]: rest call info: GET https://mn-dev-ucsb-1.test.dataone.org/metacat/d1/mn/v2/monitor/ping [org.dataone.client.rest.RestClient]
20151113-05:09:47: [INFO]: MN excluded from test: https://mn-dev-ucsb-1.test.dataone.org/metacat/d1/mn [org.dataone.integration.ContextAwareTestCaseDataone]
20151113-05:09:47: [INFO]: rest call info: GET https://mn-dev-ucsb-2.test.dataone.org/metacat/d1/mn/v2/monitor/ping [org.dataone.client.rest.RestClient]
20151113-05:09:47: [INFO]: MN included in test: https://mn-dev-ucsb-2.test.dataone.org/metacat/d1/mn [org.dataone.integration.ContextAwareTestCaseDataone]
20151113-05:09:48: [INFO]: rest call info: GET https://mn-dev-unm-1.test.dataone.org/metacat/d1/mn/v2/monitor/ping [org.dataone.client.rest.RestClient]
20151113-05:09:48: [INFO]: MN excluded from test: https://mn-dev-unm-1.test.dataone.org/metacat/d1/mn [org.dataone.integration.ContextAwareTestCaseDataone]
20151113-05:09:48: [INFO]: rest call info: GET https://mn-dev-unm-2.test.dataone.org/metacat/d1/mn/v2/monitor/ping [org.dataone.client.rest.RestClient]
20151113-05:09:48: [INFO]: MN included in test: https://mn-dev-unm-2.test.dataone.org/metacat/d1/mn [org.dataone.integration.ContextAwareTestCaseDataone]
20151113-05:09:48: [INFO]: certificate directory: /etc/dataone/client/testClientCerts/ [org.dataone.integration.ContextAwareTestCaseDataone]
20151113-05:09:48: [INFO]: certificate filename: testRightsHolder [org.dataone.integration.ContextAwareTestCaseDataone]
20151113-05:09:48: [INFO]: client setup as Subject: CN=testRightsHolder,DC=dataone,DC=org [org.dataone.integration.ContextAwareTestCaseDataone]
20151113-05:09:48: [INFO]: 
***************** running test for testUpdateSystemMetadata_RightsHolder(...) vs. node: https://mn-dev-ucsb-2.test.dataone.org/metacat/d1/mn ***************** [org.dataone.integration.ContextAwareTestCaseDataone]
20151113-05:09:48: [INFO]: certificate directory: /etc/dataone/client/testClientCerts/ [org.dataone.integration.ContextAwareTestCaseDataone]
20151113-05:09:48: [INFO]: certificate filename: cnDevUNM2 [org.dataone.integration.ContextAwareTestCaseDataone]
20151113-05:09:48: [INFO]: client setup as Subject: CN=urn:node:cnDevUNM2,DC=dataone,DC=org [org.dataone.integration.ContextAwareTestCaseDataone]
20151113-05:09:48: [INFO]: refreshing objectFormatCache from cn: null [org.dataone.client.v2.formats.ObjectFormatCache]
20151113-05:09:48: [INFO]: rest call info: GET https://cn-dev-2.test.dataone.org/cn/v2/formats [org.dataone.client.rest.RestClient]
20151113-05:09:48: [INFO]: successful cache refresh from cn.listFormats() [org.dataone.client.v2.formats.ObjectFormatCache]
20151113-05:09:48: [INFO]: creating a test object.  pid = testUpdateSystemMetadata_RightsHolder_201531621948248 on https://mn-dev-ucsb-2.test.dataone.org/metacat/d1/mn/v2 [org.dataone.integration.ContextAwareTestCaseDataone]
20151113-05:09:48: [INFO]: SystemMetadata for pid: testUpdateSystemMetadata_RightsHolder_201531621948248
<?xml version="1.0" encoding="UTF-8"?><d1_v2.0:systemMetadata xmlns:d1_v2.0="http://ns.dataone.org/service/types/v2.0" xmlns:d1="http://ns.dataone.org/service/types/v1"><serialVersion>1</serialVersion><identifier>testUpdateSystemMetadata_RightsHolder_201531621948248</identifier><formatId>eml://ecoinformatics.org/eml-2.0.1</formatId><size>17181</size><checksum algorithm="MD5">03ce09c6b4c3efc1681f3023402998a2</checksum><submitter>CN=urn:node:cnDevUNM2,DC=dataone,DC=org</submitter><rightsHolder>CN=testRightsHolder,DC=dataone,DC=org</rightsHolder><accessPolicy><allow><subject>CN=testRightsHolder,DC=dataone,DC=org</subject><permission>changePermission</permission></allow></accessPolicy><dateUploaded>2015-11-13T05:09:48.641+00:00</dateUploaded><dateSysMetadataModified>2015-11-13T05:09:48.641+00:00</dateSysMetadataModified><originMemberNode>urn:node:mnDevUCSB2</originMemberNode><authoritativeMemberNode>urn:node:mnDevUCSB2</authoritativeMemberNode></d1_v2.0:systemMetadata> [org.dataone.integration.ContextAwareTestCaseDataone]
20151113-05:09:50: [INFO]: rest call info: POST https://mn-dev-ucsb-2.test.dataone.org/metacat/d1/mn/v2/object; MMP message has: ParamPart:pid = testUpdateSystemMetadata_RightsHolder_201531621948248; FilePart:object = /tmp/mmp.output.494438683718105795.tmp (17181 bytes); FilePart:sysmeta = /tmp/mmp.output.269479126768014095.tmp (979 bytes);  [org.dataone.client.rest.RestClient]
20151113-05:09:50: [INFO]: object created.  pid = testUpdateSystemMetadata_RightsHolder_201531621948248 [org.dataone.integration.ContextAwareTestCaseDataone]
20151113-05:09:50: [INFO]: rest call info: GET https://mn-dev-ucsb-2.test.dataone.org/metacat/d1/mn/v2/meta/testUpdateSystemMetadata_RightsHolder_201531621948248 [org.dataone.client.rest.RestClient]
20151113-05:09:56: [INFO]: rest call info: PUT https://mn-dev-ucsb-2.test.dataone.org/metacat/d1/mn/v2/meta; MMP message has: ParamPart:pid = testUpdateSystemMetadata_RightsHolder_201531621948248; FilePart:sysmeta = /tmp/mmp.output.1133731947456094337.tmp (1003 bytes);  [org.dataone.client.rest.RestClient]
20151113-05:10:06: [INFO]: rest call info: GET https://mn-dev-ucsb-2.test.dataone.org/metacat/d1/mn/v2/meta/testUpdateSystemMetadata_RightsHolder_201531621948248 [org.dataone.client.rest.RestClient]
20151113-05:10:06: [INFO]: 
***************** running test for testUpdateSystemMetadata_RightsHolder(...) vs. node: https://mn-dev-unm-2.test.dataone.org/metacat/d1/mn ***************** [org.dataone.integration.ContextAwareTestCaseDataone]
20151113-05:10:06: [INFO]: certificate directory: /etc/dataone/client/testClientCerts/ [org.dataone.integration.ContextAwareTestCaseDataone]
20151113-05:10:06: [INFO]: certificate filename: cnDevUNM2 [org.dataone.integration.ContextAwareTestCaseDataone]
20151113-05:10:06: [INFO]: client setup as Subject: CN=urn:node:cnDevUNM2,DC=dataone,DC=org [org.dataone.integration.ContextAwareTestCaseDataone]
20151113-05:10:06: [INFO]: creating a test object.  pid = testUpdateSystemMetadata_RightsHolder_201531621106653 on https://mn-dev-unm-2.test.dataone.org/metacat/d1/mn/v2 [org.dataone.integration.ContextAwareTestCaseDataone]
20151113-05:10:06: [INFO]: SystemMetadata for pid: testUpdateSystemMetadata_RightsHolder_201531621106653
<?xml version="1.0" encoding="UTF-8"?><d1_v2.0:systemMetadata xmlns:d1_v2.0="http://ns.dataone.org/service/types/v2.0" xmlns:d1="http://ns.dataone.org/service/types/v1"><serialVersion>1</serialVersion><identifier>testUpdateSystemMetadata_RightsHolder_201531621106653</identifier><formatId>eml://ecoinformatics.org/eml-2.0.1</formatId><size>17181</size><checksum algorithm="MD5">03ce09c6b4c3efc1681f3023402998a2</checksum><submitter>CN=urn:node:cnDevUNM2,DC=dataone,DC=org</submitter><rightsHolder>CN=testRightsHolder,DC=dataone,DC=org</rightsHolder><accessPolicy><allow><subject>CN=testRightsHolder,DC=dataone,DC=org</subject><permission>changePermission</permission></allow></accessPolicy><dateUploaded>2015-11-13T05:10:06.674+00:00</dateUploaded><dateSysMetadataModified>2015-11-13T05:10:06.674+00:00</dateSysMetadataModified><originMemberNode>urn:node:mnDevUNM2</originMemberNode><authoritativeMemberNode>urn:node:mnDevUNM2</authoritativeMemberNode></d1_v2.0:systemMetadata> [org.dataone.integration.ContextAwareTestCaseDataone]
20151113-05:10:07: [INFO]: rest call info: POST https://mn-dev-unm-2.test.dataone.org/metacat/d1/mn/v2/object; MMP message has: ParamPart:pid = testUpdateSystemMetadata_RightsHolder_201531621106653; FilePart:object = /tmp/mmp.output.40082604862677574.tmp (17181 bytes); FilePart:sysmeta = /tmp/mmp.output.6487255128548700522.tmp (977 bytes);  [org.dataone.client.rest.RestClient]
20151113-05:10:07: [INFO]: object created.  pid = testUpdateSystemMetadata_RightsHolder_201531621106653 [org.dataone.integration.ContextAwareTestCaseDataone]
20151113-05:10:08: [INFO]: rest call info: GET https://mn-dev-unm-2.test.dataone.org/metacat/d1/mn/v2/meta/testUpdateSystemMetadata_RightsHolder_201531621106653 [org.dataone.client.rest.RestClient]
20151113-05:10:13: [INFO]: rest call info: PUT https://mn-dev-unm-2.test.dataone.org/metacat/d1/mn/v2/meta; MMP message has: ParamPart:pid = testUpdateSystemMetadata_RightsHolder_201531621106653; FilePart:sysmeta = /tmp/mmp.output.4972548864958392767.tmp (1001 bytes);  [org.dataone.client.rest.RestClient]
20151113-05:10:23: [INFO]: rest call info: GET https://mn-dev-unm-2.test.dataone.org/metacat/d1/mn/v2/meta/testUpdateSystemMetadata_RightsHolder_201531621106653 [org.dataone.client.rest.RestClient]
20151113-05:10:23: [INFO]: **************************************************** [org.dataone.integration.ContextAwareTestCaseDataone]
20151113-05:10:23: [INFO]: ***  context label:   DEV2 [org.dataone.integration.ContextAwareTestCaseDataone]
20151113-05:10:23: [INFO]: **************************************************** [org.dataone.integration.ContextAwareTestCaseDataone]
20151113-05:10:23: [INFO]: **************************************************** [org.dataone.integration.ContextAwareTestCaseDataone]
20151113-05:10:23: [INFO]: rest call info: GET https://mn-dev-ucsb-1.test.dataone.org/metacat/d1/mn/v2/monitor/ping [org.dataone.client.rest.RestClient]
20151113-05:10:23: [INFO]: MN excluded from test: https://mn-dev-ucsb-1.test.dataone.org/metacat/d1/mn [org.dataone.integration.ContextAwareTestCaseDataone]
20151113-05:10:23: [INFO]: rest call info: GET https://mn-dev-ucsb-2.test.dataone.org/metacat/d1/mn/v2/monitor/ping [org.dataone.client.rest.RestClient]
20151113-05:10:23: [INFO]: MN included in test: https://mn-dev-ucsb-2.test.dataone.org/metacat/d1/mn [org.dataone.integration.ContextAwareTestCaseDataone]
20151113-05:10:23: [INFO]: rest call info: GET https://mn-dev-unm-1.test.dataone.org/metacat/d1/mn/v2/monitor/ping [org.dataone.client.rest.RestClient]
20151113-05:10:23: [INFO]: MN excluded from test: https://mn-dev-unm-1.test.dataone.org/metacat/d1/mn [org.dataone.integration.ContextAwareTestCaseDataone]
20151113-05:10:23: [INFO]: rest call info: GET https://mn-dev-unm-2.test.dataone.org/metacat/d1/mn/v2/monitor/ping [org.dataone.client.rest.RestClient]
20151113-05:10:23: [INFO]: MN included in test: https://mn-dev-unm-2.test.dataone.org/metacat/d1/mn [org.dataone.integration.ContextAwareTestCaseDataone]
20151113-05:10:23: [INFO]: 
***************** running test for testUpdateSystemMetadata_MutableRightsHolder(...) vs. node: https://mn-dev-ucsb-2.test.dataone.org/metacat/d1/mn ***************** [org.dataone.integration.ContextAwareTestCaseDataone]
20151113-05:10:23: [INFO]: certificate directory: /etc/dataone/client/testClientCerts/ [org.dataone.integration.ContextAwareTestCaseDataone]
20151113-05:10:23: [INFO]: certificate filename: cnDevUNM2 [org.dataone.integration.ContextAwareTestCaseDataone]
20151113-05:10:23: [INFO]: client setup as Subject: CN=urn:node:cnDevUNM2,DC=dataone,DC=org [org.dataone.integration.ContextAwareTestCaseDataone]
20151113-05:10:23: [INFO]: creating a test object.  pid = testUpdateSystemMetadata_MutableRightsHolder_2015316211023794 on https://mn-dev-ucsb-2.test.dataone.org/metacat/d1/mn/v2 [org.dataone.integration.ContextAwareTestCaseDataone]
20151113-05:10:23: [INFO]: SystemMetadata for pid: testUpdateSystemMetadata_MutableRightsHolder_2015316211023794
<?xml version="1.0" encoding="UTF-8"?><d1_v2.0:systemMetadata xmlns:d1_v2.0="http://ns.dataone.org/service/types/v2.0" xmlns:d1="http://ns.dataone.org/service/types/v1"><serialVersion>1</serialVersion><identifier>testUpdateSystemMetadata_MutableRightsHolder_2015316211023794</identifier><formatId>eml://ecoinformatics.org/eml-2.0.1</formatId><size>17181</size><checksum algorithm="MD5">03ce09c6b4c3efc1681f3023402998a2</checksum><submitter>CN=urn:node:cnDevUNM2,DC=dataone,DC=org</submitter><rightsHolder>CN=testRightsHolder,DC=dataone,DC=org</rightsHolder><accessPolicy><allow><subject>CN=testRightsHolder,DC=dataone,DC=org</subject><permission>changePermission</permission></allow></accessPolicy><dateUploaded>2015-11-13T05:10:23.823+00:00</dateUploaded><dateSysMetadataModified>2015-11-13T05:10:23.823+00:00</dateSysMetadataModified><originMemberNode>urn:node:mnDevUCSB2</originMemberNode><authoritativeMemberNode>urn:node:mnDevUCSB2</authoritativeMemberNode></d1_v2.0:systemMetadata> [org.dataone.integration.ContextAwareTestCaseDataone]
20151113-05:10:25: [INFO]: rest call info: POST https://mn-dev-ucsb-2.test.dataone.org/metacat/d1/mn/v2/object; MMP message has: ParamPart:pid = testUpdateSystemMetadata_MutableRightsHolder_2015316211023794; FilePart:object = /tmp/mmp.output.370842013169139317.tmp (17181 bytes); FilePart:sysmeta = /tmp/mmp.output.6061144830355140090.tmp (987 bytes);  [org.dataone.client.rest.RestClient]
20151113-05:10:25: [INFO]: object created.  pid = testUpdateSystemMetadata_MutableRightsHolder_2015316211023794 [org.dataone.integration.ContextAwareTestCaseDataone]
20151113-05:10:25: [INFO]: rest call info: GET https://mn-dev-ucsb-2.test.dataone.org/metacat/d1/mn/v2/meta/testUpdateSystemMetadata_MutableRightsHolder_2015316211023794 [org.dataone.client.rest.RestClient]
20151113-05:10:25: [INFO]: certificate directory: /etc/dataone/client/testClientCerts/ [org.dataone.integration.ContextAwareTestCaseDataone]
20151113-05:10:25: [INFO]: certificate filename: testPerson [org.dataone.integration.ContextAwareTestCaseDataone]
20151113-05:10:25: [INFO]: client setup as Subject: CN=testPerson,DC=dataone,DC=org [org.dataone.integration.ContextAwareTestCaseDataone]
20151113-05:10:31: [INFO]: rest call info: PUT https://mn-dev-ucsb-2.test.dataone.org/metacat/d1/mn/v2/meta; MMP message has: ParamPart:pid = testUpdateSystemMetadata_MutableRightsHolder_2015316211023794; FilePart:sysmeta = /tmp/mmp.output.6263957211211956237.tmp (1005 bytes);  [org.dataone.client.rest.RestClient]
20151113-05:10:41: [INFO]: rest call info: GET https://mn-dev-ucsb-2.test.dataone.org/metacat/d1/mn/v2/meta/testUpdateSystemMetadata_MutableRightsHolder_2015316211023794 [org.dataone.client.rest.RestClient]
20151113-05:10:41: [INFO]: 
***************** running test for testUpdateSystemMetadata_MutableRightsHolder(...) vs. node: https://mn-dev-unm-2.test.dataone.org/metacat/d1/mn ***************** [org.dataone.integration.ContextAwareTestCaseDataone]
20151113-05:10:41: [INFO]: certificate directory: /etc/dataone/client/testClientCerts/ [org.dataone.integration.ContextAwareTestCaseDataone]
20151113-05:10:41: [INFO]: certificate filename: cnDevUNM2 [org.dataone.integration.ContextAwareTestCaseDataone]
20151113-05:10:41: [INFO]: client setup as Subject: CN=urn:node:cnDevUNM2,DC=dataone,DC=org [org.dataone.integration.ContextAwareTestCaseDataone]
20151113-05:10:41: [INFO]: creating a test object.  pid = testUpdateSystemMetadata_MutableRightsHolder_2015316211041698 on https://mn-dev-unm-2.test.dataone.org/metacat/d1/mn/v2 [org.dataone.integration.ContextAwareTestCaseDataone]
20151113-05:10:41: [INFO]: SystemMetadata for pid: testUpdateSystemMetadata_MutableRightsHolder_2015316211041698
<?xml version="1.0" encoding="UTF-8"?><d1_v2.0:systemMetadata xmlns:d1_v2.0="http://ns.dataone.org/service/types/v2.0" xmlns:d1="http://ns.dataone.org/service/types/v1"><serialVersion>1</serialVersion><identifier>testUpdateSystemMetadata_MutableRightsHolder_2015316211041698</identifier><formatId>eml://ecoinformatics.org/eml-2.0.1</formatId><size>17181</size><checksum algorithm="MD5">03ce09c6b4c3efc1681f3023402998a2</checksum><submitter>CN=urn:node:cnDevUNM2,DC=dataone,DC=org</submitter><rightsHolder>CN=testRightsHolder,DC=dataone,DC=org</rightsHolder><accessPolicy><allow><subject>CN=testRightsHolder,DC=dataone,DC=org</subject><permission>changePermission</permission></allow></accessPolicy><dateUploaded>2015-11-13T05:10:41.719+00:00</dateUploaded><dateSysMetadataModified>2015-11-13T05:10:41.719+00:00</dateSysMetadataModified><originMemberNode>urn:node:mnDevUNM2</originMemberNode><authoritativeMemberNode>urn:node:mnDevUNM2</authoritativeMemberNode></d1_v2.0:systemMetadata> [org.dataone.integration.ContextAwareTestCaseDataone]
20151113-05:10:42: [INFO]: rest call info: POST https://mn-dev-unm-2.test.dataone.org/metacat/d1/mn/v2/object; MMP message has: ParamPart:pid = testUpdateSystemMetadata_MutableRightsHolder_2015316211041698; FilePart:object = /tmp/mmp.output.2779108659867972260.tmp (17181 bytes); FilePart:sysmeta = /tmp/mmp.output.1107710209052325283.tmp (985 bytes);  [org.dataone.client.rest.RestClient]
20151113-05:10:42: [INFO]: object created.  pid = testUpdateSystemMetadata_MutableRightsHolder_2015316211041698 [org.dataone.integration.ContextAwareTestCaseDataone]
20151113-05:10:42: [INFO]: rest call info: GET https://mn-dev-unm-2.test.dataone.org/metacat/d1/mn/v2/meta/testUpdateSystemMetadata_MutableRightsHolder_2015316211041698 [org.dataone.client.rest.RestClient]
20151113-05:10:48: [INFO]: rest call info: PUT https://mn-dev-unm-2.test.dataone.org/metacat/d1/mn/v2/meta; MMP message has: ParamPart:pid = testUpdateSystemMetadata_MutableRightsHolder_2015316211041698; FilePart:sysmeta = /tmp/mmp.output.240267776376530047.tmp (1003 bytes);  [org.dataone.client.rest.RestClient]
20151113-05:10:58: [INFO]: rest call info: GET https://mn-dev-unm-2.test.dataone.org/metacat/d1/mn/v2/meta/testUpdateSystemMetadata_MutableRightsHolder_2015316211041698 [org.dataone.client.rest.RestClient]
20151113-05:10:58: [INFO]: **************************************************** [org.dataone.integration.ContextAwareTestCaseDataone]
20151113-05:10:58: [INFO]: ***  context label:   DEV2 [org.dataone.integration.ContextAwareTestCaseDataone]
20151113-05:10:58: [INFO]: **************************************************** [org.dataone.integration.ContextAwareTestCaseDataone]
20151113-05:10:58: [INFO]: **************************************************** [org.dataone.integration.ContextAwareTestCaseDataone]
20151113-05:10:58: [INFO]: rest call info: GET https://mn-dev-ucsb-1.test.dataone.org/metacat/d1/mn/v2/monitor/ping [org.dataone.client.rest.RestClient]
20151113-05:10:58: [INFO]: MN excluded from test: https://mn-dev-ucsb-1.test.dataone.org/metacat/d1/mn [org.dataone.integration.ContextAwareTestCaseDataone]
20151113-05:10:58: [INFO]: rest call info: GET https://mn-dev-ucsb-2.test.dataone.org/metacat/d1/mn/v2/monitor/ping [org.dataone.client.rest.RestClient]
20151113-05:10:58: [INFO]: MN included in test: https://mn-dev-ucsb-2.test.dataone.org/metacat/d1/mn [org.dataone.integration.ContextAwareTestCaseDataone]
20151113-05:10:58: [INFO]: rest call info: GET https://mn-dev-unm-1.test.dataone.org/metacat/d1/mn/v2/monitor/ping [org.dataone.client.rest.RestClient]
20151113-05:10:58: [INFO]: MN excluded from test: https://mn-dev-unm-1.test.dataone.org/metacat/d1/mn [org.dataone.integration.ContextAwareTestCaseDataone]
20151113-05:10:58: [INFO]: rest call info: GET https://mn-dev-unm-2.test.dataone.org/metacat/d1/mn/v2/monitor/ping [org.dataone.client.rest.RestClient]
20151113-05:10:58: [INFO]: MN included in test: https://mn-dev-unm-2.test.dataone.org/metacat/d1/mn [org.dataone.integration.ContextAwareTestCaseDataone]
20151113-05:10:58: [INFO]: 
***************** running test for testUpdateSystemMetadata_MutableFormat(...) vs. node: https://mn-dev-ucsb-2.test.dataone.org/metacat/d1/mn ***************** [org.dataone.integration.ContextAwareTestCaseDataone]
20151113-05:10:58: [INFO]: certificate directory: /etc/dataone/client/testClientCerts/ [org.dataone.integration.ContextAwareTestCaseDataone]
20151113-05:10:58: [INFO]: certificate filename: cnDevUNM2 [org.dataone.integration.ContextAwareTestCaseDataone]
20151113-05:10:58: [INFO]: client setup as Subject: CN=urn:node:cnDevUNM2,DC=dataone,DC=org [org.dataone.integration.ContextAwareTestCaseDataone]
20151113-05:10:58: [INFO]: creating a test object.  pid = testUpdateSystemMetadata_MutableFormat_2015316211058639 on https://mn-dev-ucsb-2.test.dataone.org/metacat/d1/mn/v2 [org.dataone.integration.ContextAwareTestCaseDataone]
20151113-05:10:58: [INFO]: SystemMetadata for pid: testUpdateSystemMetadata_MutableFormat_2015316211058639
<?xml version="1.0" encoding="UTF-8"?><d1_v2.0:systemMetadata xmlns:d1_v2.0="http://ns.dataone.org/service/types/v2.0" xmlns:d1="http://ns.dataone.org/service/types/v1"><serialVersion>1</serialVersion><identifier>testUpdateSystemMetadata_MutableFormat_2015316211058639</identifier><formatId>eml://ecoinformatics.org/eml-2.0.1</formatId><size>17181</size><checksum algorithm="MD5">03ce09c6b4c3efc1681f3023402998a2</checksum><submitter>CN=urn:node:cnDevUNM2,DC=dataone,DC=org</submitter><rightsHolder>CN=testRightsHolder,DC=dataone,DC=org</rightsHolder><accessPolicy><allow><subject>CN=testRightsHolder,DC=dataone,DC=org</subject><permission>changePermission</permission></allow></accessPolicy><dateUploaded>2015-11-13T05:10:58.656+00:00</dateUploaded><dateSysMetadataModified>2015-11-13T05:10:58.656+00:00</dateSysMetadataModified><originMemberNode>urn:node:mnDevUCSB2</originMemberNode><authoritativeMemberNode>urn:node:mnDevUCSB2</authoritativeMemberNode></d1_v2.0:systemMetadata> [org.dataone.integration.ContextAwareTestCaseDataone]
20151113-05:10:59: [INFO]: rest call info: POST https://mn-dev-ucsb-2.test.dataone.org/metacat/d1/mn/v2/object; MMP message has: ParamPart:pid = testUpdateSystemMetadata_MutableFormat_2015316211058639; FilePart:object = /tmp/mmp.output.4954827427475816385.tmp (17181 bytes); FilePart:sysmeta = /tmp/mmp.output.7620331183659048176.tmp (981 bytes);  [org.dataone.client.rest.RestClient]
20151113-05:10:59: [INFO]: object created.  pid = testUpdateSystemMetadata_MutableFormat_2015316211058639 [org.dataone.integration.ContextAwareTestCaseDataone]
20151113-05:11:00: [INFO]: rest call info: GET https://mn-dev-ucsb-2.test.dataone.org/metacat/d1/mn/v2/meta/testUpdateSystemMetadata_MutableFormat_2015316211058639 [org.dataone.client.rest.RestClient]
20151113-05:11:05: [INFO]: rest call info: PUT https://mn-dev-ucsb-2.test.dataone.org/metacat/d1/mn/v2/meta; MMP message has: ParamPart:pid = testUpdateSystemMetadata_MutableFormat_2015316211058639; FilePart:sysmeta = /tmp/mmp.output.5959574495663050916.tmp (980 bytes);  [org.dataone.client.rest.RestClient]
20151113-05:11:15: [INFO]: rest call info: GET https://mn-dev-ucsb-2.test.dataone.org/metacat/d1/mn/v2/meta/testUpdateSystemMetadata_MutableFormat_2015316211058639 [org.dataone.client.rest.RestClient]
20151113-05:11:15: [INFO]: 
***************** running test for testUpdateSystemMetadata_MutableFormat(...) vs. node: https://mn-dev-unm-2.test.dataone.org/metacat/d1/mn ***************** [org.dataone.integration.ContextAwareTestCaseDataone]
20151113-05:11:15: [INFO]: certificate directory: /etc/dataone/client/testClientCerts/ [org.dataone.integration.ContextAwareTestCaseDataone]
20151113-05:11:15: [INFO]: certificate filename: cnDevUNM2 [org.dataone.integration.ContextAwareTestCaseDataone]
20151113-05:11:15: [INFO]: client setup as Subject: CN=urn:node:cnDevUNM2,DC=dataone,DC=org [org.dataone.integration.ContextAwareTestCaseDataone]
20151113-05:11:15: [INFO]: creating a test object.  pid = testUpdateSystemMetadata_MutableFormat_2015316211115957 on https://mn-dev-unm-2.test.dataone.org/metacat/d1/mn/v2 [org.dataone.integration.ContextAwareTestCaseDataone]
20151113-05:11:15: [INFO]: SystemMetadata for pid: testUpdateSystemMetadata_MutableFormat_2015316211115957
<?xml version="1.0" encoding="UTF-8"?><d1_v2.0:systemMetadata xmlns:d1_v2.0="http://ns.dataone.org/service/types/v2.0" xmlns:d1="http://ns.dataone.org/service/types/v1"><serialVersion>1</serialVersion><identifier>testUpdateSystemMetadata_MutableFormat_2015316211115957</identifier><formatId>eml://ecoinformatics.org/eml-2.0.1</formatId><size>17181</size><checksum algorithm="MD5">03ce09c6b4c3efc1681f3023402998a2</checksum><submitter>CN=urn:node:cnDevUNM2,DC=dataone,DC=org</submitter><rightsHolder>CN=testRightsHolder,DC=dataone,DC=org</rightsHolder><accessPolicy><allow><subject>CN=testRightsHolder,DC=dataone,DC=org</subject><permission>changePermission</permission></allow></accessPolicy><dateUploaded>2015-11-13T05:11:15.975+00:00</dateUploaded><dateSysMetadataModified>2015-11-13T05:11:15.975+00:00</dateSysMetadataModified><originMemberNode>urn:node:mnDevUNM2</originMemberNode><authoritativeMemberNode>urn:node:mnDevUNM2</authoritativeMemberNode></d1_v2.0:systemMetadata> [org.dataone.integration.ContextAwareTestCaseDataone]
20151113-05:11:16: [INFO]: rest call info: POST https://mn-dev-unm-2.test.dataone.org/metacat/d1/mn/v2/object; MMP message has: ParamPart:pid = testUpdateSystemMetadata_MutableFormat_2015316211115957; FilePart:object = /tmp/mmp.output.2938731610033495103.tmp (17181 bytes); FilePart:sysmeta = /tmp/mmp.output.5583711984238215633.tmp (979 bytes);  [org.dataone.client.rest.RestClient]
20151113-05:11:16: [INFO]: object created.  pid = testUpdateSystemMetadata_MutableFormat_2015316211115957 [org.dataone.integration.ContextAwareTestCaseDataone]
20151113-05:11:17: [INFO]: rest call info: GET https://mn-dev-unm-2.test.dataone.org/metacat/d1/mn/v2/meta/testUpdateSystemMetadata_MutableFormat_2015316211115957 [org.dataone.client.rest.RestClient]
20151113-05:11:22: [INFO]: rest call info: PUT https://mn-dev-unm-2.test.dataone.org/metacat/d1/mn/v2/meta; MMP message has: ParamPart:pid = testUpdateSystemMetadata_MutableFormat_2015316211115957; FilePart:sysmeta = /tmp/mmp.output.7909005055258958253.tmp (978 bytes);  [org.dataone.client.rest.RestClient]
20151113-05:11:32: [INFO]: rest call info: GET https://mn-dev-unm-2.test.dataone.org/metacat/d1/mn/v2/meta/testUpdateSystemMetadata_MutableFormat_2015316211115957 [org.dataone.client.rest.RestClient]
20151113-05:11:32: [INFO]: **************************************************** [org.dataone.integration.ContextAwareTestCaseDataone]
20151113-05:11:32: [INFO]: ***  context label:   DEV2 [org.dataone.integration.ContextAwareTestCaseDataone]
20151113-05:11:32: [INFO]: **************************************************** [org.dataone.integration.ContextAwareTestCaseDataone]
20151113-05:11:32: [INFO]: **************************************************** [org.dataone.integration.ContextAwareTestCaseDataone]
20151113-05:11:32: [INFO]: rest call info: GET https://mn-dev-ucsb-1.test.dataone.org/metacat/d1/mn/v2/monitor/ping [org.dataone.client.rest.RestClient]
20151113-05:11:32: [INFO]: MN excluded from test: https://mn-dev-ucsb-1.test.dataone.org/metacat/d1/mn [org.dataone.integration.ContextAwareTestCaseDataone]
20151113-05:11:32: [INFO]: rest call info: GET https://mn-dev-ucsb-2.test.dataone.org/metacat/d1/mn/v2/monitor/ping [org.dataone.client.rest.RestClient]
20151113-05:11:32: [INFO]: MN included in test: https://mn-dev-ucsb-2.test.dataone.org/metacat/d1/mn [org.dataone.integration.ContextAwareTestCaseDataone]
20151113-05:11:32: [INFO]: rest call info: GET https://mn-dev-unm-1.test.dataone.org/metacat/d1/mn/v2/monitor/ping [org.dataone.client.rest.RestClient]
20151113-05:11:32: [INFO]: MN excluded from test: https://mn-dev-unm-1.test.dataone.org/metacat/d1/mn [org.dataone.integration.ContextAwareTestCaseDataone]
20151113-05:11:32: [INFO]: rest call info: GET https://mn-dev-unm-2.test.dataone.org/metacat/d1/mn/v2/monitor/ping [org.dataone.client.rest.RestClient]
20151113-05:11:32: [INFO]: MN included in test: https://mn-dev-unm-2.test.dataone.org/metacat/d1/mn [org.dataone.integration.ContextAwareTestCaseDataone]
20151113-05:11:32: [INFO]: 
***************** running test for testUpdateSystemMetadata_MutableAccessPolicy(...) vs. node: https://mn-dev-ucsb-2.test.dataone.org/metacat/d1/mn ***************** [org.dataone.integration.ContextAwareTestCaseDataone]
20151113-05:11:32: [INFO]: certificate directory: /etc/dataone/client/testClientCerts/ [org.dataone.integration.ContextAwareTestCaseDataone]
20151113-05:11:32: [INFO]: certificate filename: cnDevUNM2 [org.dataone.integration.ContextAwareTestCaseDataone]
20151113-05:11:32: [INFO]: client setup as Subject: CN=urn:node:cnDevUNM2,DC=dataone,DC=org [org.dataone.integration.ContextAwareTestCaseDataone]
20151113-05:11:32: [INFO]: creating a test object.  pid = testUpdateSystemMetadata_MutableAccessPolicy_2015316211132812 on https://mn-dev-ucsb-2.test.dataone.org/metacat/d1/mn/v2 [org.dataone.integration.ContextAwareTestCaseDataone]
20151113-05:11:32: [INFO]: SystemMetadata for pid: testUpdateSystemMetadata_MutableAccessPolicy_2015316211132812
<?xml version="1.0" encoding="UTF-8"?><d1_v2.0:systemMetadata xmlns:d1_v2.0="http://ns.dataone.org/service/types/v2.0" xmlns:d1="http://ns.dataone.org/service/types/v1"><serialVersion>1</serialVersion><identifier>testUpdateSystemMetadata_MutableAccessPolicy_2015316211132812</identifier><formatId>eml://ecoinformatics.org/eml-2.0.1</formatId><size>17181</size><checksum algorithm="MD5">03ce09c6b4c3efc1681f3023402998a2</checksum><submitter>CN=urn:node:cnDevUNM2,DC=dataone,DC=org</submitter><rightsHolder>CN=testRightsHolder,DC=dataone,DC=org</rightsHolder><accessPolicy><allow><subject>CN=testRightsHolder,DC=dataone,DC=org</subject><permission>changePermission</permission></allow></accessPolicy><dateUploaded>2015-11-13T05:11:32.829+00:00</dateUploaded><dateSysMetadataModified>2015-11-13T05:11:32.829+00:00</dateSysMetadataModified><originMemberNode>urn:node:mnDevUCSB2</originMemberNode><authoritativeMemberNode>urn:node:mnDevUCSB2</authoritativeMemberNode></d1_v2.0:systemMetadata> [org.dataone.integration.ContextAwareTestCaseDataone]
20151113-05:11:34: [INFO]: rest call info: POST https://mn-dev-ucsb-2.test.dataone.org/metacat/d1/mn/v2/object; MMP message has: ParamPart:pid = testUpdateSystemMetadata_MutableAccessPolicy_2015316211132812; FilePart:object = /tmp/mmp.output.7815878784126148234.tmp (17181 bytes); FilePart:sysmeta = /tmp/mmp.output.2328462592992809626.tmp (987 bytes);  [org.dataone.client.rest.RestClient]
20151113-05:11:34: [INFO]: object created.  pid = testUpdateSystemMetadata_MutableAccessPolicy_2015316211132812 [org.dataone.integration.ContextAwareTestCaseDataone]
20151113-05:11:34: [INFO]: rest call info: GET https://mn-dev-ucsb-2.test.dataone.org/metacat/d1/mn/v2/meta/testUpdateSystemMetadata_MutableAccessPolicy_2015316211132812 [org.dataone.client.rest.RestClient]
20151113-05:11:34: [INFO]: certificate directory: /etc/dataone/client/testClientCerts/ [org.dataone.integration.ContextAwareTestCaseDataone]
20151113-05:11:34: [INFO]: certificate filename: testGroup [org.dataone.integration.ContextAwareTestCaseDataone]
20151113-05:11:34: [INFO]: client setup as Subject: public [org.dataone.integration.ContextAwareTestCaseDataone]
20151113-05:11:40: [INFO]: rest call info: PUT https://mn-dev-ucsb-2.test.dataone.org/metacat/d1/mn/v2/meta; MMP message has: ParamPart:pid = testUpdateSystemMetadata_MutableAccessPolicy_2015316211132812; FilePart:sysmeta = /tmp/mmp.output.6857670684081498459.tmp (980 bytes);  [org.dataone.client.rest.RestClient]
20151113-05:11:50: [INFO]: rest call info: GET https://mn-dev-ucsb-2.test.dataone.org/metacat/d1/mn/v2/meta/testUpdateSystemMetadata_MutableAccessPolicy_2015316211132812 [org.dataone.client.rest.RestClient]
20151113-05:11:50: [INFO]: 
***************** running test for testUpdateSystemMetadata_MutableAccessPolicy(...) vs. node: https://mn-dev-unm-2.test.dataone.org/metacat/d1/mn ***************** [org.dataone.integration.ContextAwareTestCaseDataone]
20151113-05:11:50: [INFO]: certificate directory: /etc/dataone/client/testClientCerts/ [org.dataone.integration.ContextAwareTestCaseDataone]
20151113-05:11:50: [INFO]: certificate filename: cnDevUNM2 [org.dataone.integration.ContextAwareTestCaseDataone]
20151113-05:11:50: [INFO]: client setup as Subject: CN=urn:node:cnDevUNM2,DC=dataone,DC=org [org.dataone.integration.ContextAwareTestCaseDataone]
20151113-05:11:50: [INFO]: creating a test object.  pid = testUpdateSystemMetadata_MutableAccessPolicy_2015316211150860 on https://mn-dev-unm-2.test.dataone.org/metacat/d1/mn/v2 [org.dataone.integration.ContextAwareTestCaseDataone]
20151113-05:11:50: [INFO]: SystemMetadata for pid: testUpdateSystemMetadata_MutableAccessPolicy_2015316211150860
<?xml version="1.0" encoding="UTF-8"?><d1_v2.0:systemMetadata xmlns:d1_v2.0="http://ns.dataone.org/service/types/v2.0" xmlns:d1="http://ns.dataone.org/service/types/v1"><serialVersion>1</serialVersion><identifier>testUpdateSystemMetadata_MutableAccessPolicy_2015316211150860</identifier><formatId>eml://ecoinformatics.org/eml-2.0.1</formatId><size>17181</size><checksum algorithm="MD5">03ce09c6b4c3efc1681f3023402998a2</checksum><submitter>CN=urn:node:cnDevUNM2,DC=dataone,DC=org</submitter><rightsHolder>CN=testRightsHolder,DC=dataone,DC=org</rightsHolder><accessPolicy><allow><subject>CN=testRightsHolder,DC=dataone,DC=org</subject><permission>changePermission</permission></allow></accessPolicy><dateUploaded>2015-11-13T05:11:50.876+00:00</dateUploaded><dateSysMetadataModified>2015-11-13T05:11:50.876+00:00</dateSysMetadataModified><originMemberNode>urn:node:mnDevUNM2</originMemberNode><authoritativeMemberNode>urn:node:mnDevUNM2</authoritativeMemberNode></d1_v2.0:systemMetadata> [org.dataone.integration.ContextAwareTestCaseDataone]
20151113-05:11:52: [INFO]: rest call info: POST https://mn-dev-unm-2.test.dataone.org/metacat/d1/mn/v2/object; MMP message has: ParamPart:pid = testUpdateSystemMetadata_MutableAccessPolicy_2015316211150860; FilePart:object = /tmp/mmp.output.7432138976380661805.tmp (17181 bytes); FilePart:sysmeta = /tmp/mmp.output.4031140245804192189.tmp (985 bytes);  [org.dataone.client.rest.RestClient]
20151113-05:11:52: [INFO]: object created.  pid = testUpdateSystemMetadata_MutableAccessPolicy_2015316211150860 [org.dataone.integration.ContextAwareTestCaseDataone]
20151113-05:11:52: [INFO]: rest call info: GET https://mn-dev-unm-2.test.dataone.org/metacat/d1/mn/v2/meta/testUpdateSystemMetadata_MutableAccessPolicy_2015316211150860 [org.dataone.client.rest.RestClient]
20151113-05:11:57: [INFO]: rest call info: PUT https://mn-dev-unm-2.test.dataone.org/metacat/d1/mn/v2/meta; MMP message has: ParamPart:pid = testUpdateSystemMetadata_MutableAccessPolicy_2015316211150860; FilePart:sysmeta = /tmp/mmp.output.8780392511941428923.tmp (978 bytes);  [org.dataone.client.rest.RestClient]
20151113-05:12:07: [INFO]: rest call info: GET https://mn-dev-unm-2.test.dataone.org/metacat/d1/mn/v2/meta/testUpdateSystemMetadata_MutableAccessPolicy_2015316211150860 [org.dataone.client.rest.RestClient]
20151113-05:12:07: [INFO]: **************************************************** [org.dataone.integration.ContextAwareTestCaseDataone]
20151113-05:12:07: [INFO]: ***  context label:   DEV2 [org.dataone.integration.ContextAwareTestCaseDataone]
20151113-05:12:07: [INFO]: **************************************************** [org.dataone.integration.ContextAwareTestCaseDataone]
20151113-05:12:07: [INFO]: **************************************************** [org.dataone.integration.ContextAwareTestCaseDataone]
20151113-05:12:07: [INFO]: rest call info: GET https://mn-dev-ucsb-1.test.dataone.org/metacat/d1/mn/v2/monitor/ping [org.dataone.client.rest.RestClient]
20151113-05:12:07: [INFO]: MN excluded from test: https://mn-dev-ucsb-1.test.dataone.org/metacat/d1/mn [org.dataone.integration.ContextAwareTestCaseDataone]
20151113-05:12:07: [INFO]: rest call info: GET https://mn-dev-ucsb-2.test.dataone.org/metacat/d1/mn/v2/monitor/ping [org.dataone.client.rest.RestClient]
20151113-05:12:07: [INFO]: MN included in test: https://mn-dev-ucsb-2.test.dataone.org/metacat/d1/mn [org.dataone.integration.ContextAwareTestCaseDataone]
20151113-05:12:07: [INFO]: rest call info: GET https://mn-dev-unm-1.test.dataone.org/metacat/d1/mn/v2/monitor/ping [org.dataone.client.rest.RestClient]
20151113-05:12:07: [INFO]: MN excluded from test: https://mn-dev-unm-1.test.dataone.org/metacat/d1/mn [org.dataone.integration.ContextAwareTestCaseDataone]
20151113-05:12:07: [INFO]: rest call info: GET https://mn-dev-unm-2.test.dataone.org/metacat/d1/mn/v2/monitor/ping [org.dataone.client.rest.RestClient]
20151113-05:12:07: [INFO]: MN included in test: https://mn-dev-unm-2.test.dataone.org/metacat/d1/mn [org.dataone.integration.ContextAwareTestCaseDataone]
20151113-05:12:07: [INFO]: 
***************** running test for testUpdateSystemMetadata_MutableReplPolicy(...) vs. node: https://mn-dev-ucsb-2.test.dataone.org/metacat/d1/mn ***************** [org.dataone.integration.ContextAwareTestCaseDataone]
20151113-05:12:07: [INFO]: certificate directory: /etc/dataone/client/testClientCerts/ [org.dataone.integration.ContextAwareTestCaseDataone]
20151113-05:12:07: [INFO]: certificate filename: cnDevUNM2 [org.dataone.integration.ContextAwareTestCaseDataone]
20151113-05:12:07: [INFO]: client setup as Subject: CN=urn:node:cnDevUNM2,DC=dataone,DC=org [org.dataone.integration.ContextAwareTestCaseDataone]
20151113-05:12:07: [INFO]: creating a test object.  pid = testUpdateSystemMetadata_MutableReplPolicy_201531621127932 on https://mn-dev-ucsb-2.test.dataone.org/metacat/d1/mn/v2 [org.dataone.integration.ContextAwareTestCaseDataone]
20151113-05:12:07: [INFO]: SystemMetadata for pid: testUpdateSystemMetadata_MutableReplPolicy_201531621127932
<?xml version="1.0" encoding="UTF-8"?><d1_v2.0:systemMetadata xmlns:d1_v2.0="http://ns.dataone.org/service/types/v2.0" xmlns:d1="http://ns.dataone.org/service/types/v1"><serialVersion>1</serialVersion><identifier>testUpdateSystemMetadata_MutableReplPolicy_201531621127932</identifier><formatId>eml://ecoinformatics.org/eml-2.0.1</formatId><size>17181</size><checksum algorithm="MD5">03ce09c6b4c3efc1681f3023402998a2</checksum><submitter>CN=urn:node:cnDevUNM2,DC=dataone,DC=org</submitter><rightsHolder>CN=testRightsHolder,DC=dataone,DC=org</rightsHolder><accessPolicy><allow><subject>CN=testRightsHolder,DC=dataone,DC=org</subject><permission>changePermission</permission></allow></accessPolicy><dateUploaded>2015-11-13T05:12:07.948+00:00</dateUploaded><dateSysMetadataModified>2015-11-13T05:12:07.948+00:00</dateSysMetadataModified><originMemberNode>urn:node:mnDevUCSB2</originMemberNode><authoritativeMemberNode>urn:node:mnDevUCSB2</authoritativeMemberNode></d1_v2.0:systemMetadata> [org.dataone.integration.ContextAwareTestCaseDataone]
20151113-05:12:08: [INFO]: rest call info: POST https://mn-dev-ucsb-2.test.dataone.org/metacat/d1/mn/v2/object; MMP message has: ParamPart:pid = testUpdateSystemMetadata_MutableReplPolicy_201531621127932; FilePart:object = /tmp/mmp.output.2158133421144482928.tmp (17181 bytes); FilePart:sysmeta = /tmp/mmp.output.1023295898910187710.tmp (984 bytes);  [org.dataone.client.rest.RestClient]
20151113-05:12:08: [INFO]: object created.  pid = testUpdateSystemMetadata_MutableReplPolicy_201531621127932 [org.dataone.integration.ContextAwareTestCaseDataone]
20151113-05:12:09: [INFO]: rest call info: GET https://mn-dev-ucsb-2.test.dataone.org/metacat/d1/mn/v2/meta/testUpdateSystemMetadata_MutableReplPolicy_201531621127932 [org.dataone.client.rest.RestClient]
20151113-05:12:14: [INFO]: rest call info: PUT https://mn-dev-ucsb-2.test.dataone.org/metacat/d1/mn/v2/meta; MMP message has: ParamPart:pid = testUpdateSystemMetadata_MutableReplPolicy_201531621127932; FilePart:sysmeta = /tmp/mmp.output.8309914983903274587.tmp (1075 bytes);  [org.dataone.client.rest.RestClient]
20151113-05:12:25: [INFO]: rest call info: GET https://mn-dev-ucsb-2.test.dataone.org/metacat/d1/mn/v2/meta/testUpdateSystemMetadata_MutableReplPolicy_201531621127932 [org.dataone.client.rest.RestClient]
20151113-05:12:25: [INFO]: 
***************** running test for testUpdateSystemMetadata_MutableReplPolicy(...) vs. node: https://mn-dev-unm-2.test.dataone.org/metacat/d1/mn ***************** [org.dataone.integration.ContextAwareTestCaseDataone]
20151113-05:12:25: [INFO]: certificate directory: /etc/dataone/client/testClientCerts/ [org.dataone.integration.ContextAwareTestCaseDataone]
20151113-05:12:25: [INFO]: certificate filename: cnDevUNM2 [org.dataone.integration.ContextAwareTestCaseDataone]
20151113-05:12:25: [INFO]: client setup as Subject: CN=urn:node:cnDevUNM2,DC=dataone,DC=org [org.dataone.integration.ContextAwareTestCaseDataone]
20151113-05:12:25: [INFO]: creating a test object.  pid = testUpdateSystemMetadata_MutableReplPolicy_2015316211225275 on https://mn-dev-unm-2.test.dataone.org/metacat/d1/mn/v2 [org.dataone.integration.ContextAwareTestCaseDataone]
20151113-05:12:25: [INFO]: SystemMetadata for pid: testUpdateSystemMetadata_MutableReplPolicy_2015316211225275
<?xml version="1.0" encoding="UTF-8"?><d1_v2.0:systemMetadata xmlns:d1_v2.0="http://ns.dataone.org/service/types/v2.0" xmlns:d1="http://ns.dataone.org/service/types/v1"><serialVersion>1</serialVersion><identifier>testUpdateSystemMetadata_MutableReplPolicy_2015316211225275</identifier><formatId>eml://ecoinformatics.org/eml-2.0.1</formatId><size>17181</size><checksum algorithm="MD5">03ce09c6b4c3efc1681f3023402998a2</checksum><submitter>CN=urn:node:cnDevUNM2,DC=dataone,DC=org</submitter><rightsHolder>CN=testRightsHolder,DC=dataone,DC=org</rightsHolder><accessPolicy><allow><subject>CN=testRightsHolder,DC=dataone,DC=org</subject><permission>changePermission</permission></allow></accessPolicy><dateUploaded>2015-11-13T05:12:25.291+00:00</dateUploaded><dateSysMetadataModified>2015-11-13T05:12:25.291+00:00</dateSysMetadataModified><originMemberNode>urn:node:mnDevUNM2</originMemberNode><authoritativeMemberNode>urn:node:mnDevUNM2</authoritativeMemberNode></d1_v2.0:systemMetadata> [org.dataone.integration.ContextAwareTestCaseDataone]
20151113-05:12:26: [INFO]: rest call info: POST https://mn-dev-unm-2.test.dataone.org/metacat/d1/mn/v2/object; MMP message has: ParamPart:pid = testUpdateSystemMetadata_MutableReplPolicy_2015316211225275; FilePart:object = /tmp/mmp.output.7812208411259621612.tmp (17181 bytes); FilePart:sysmeta = /tmp/mmp.output.8388253786489515239.tmp (983 bytes);  [org.dataone.client.rest.RestClient]
20151113-05:12:26: [INFO]: object created.  pid = testUpdateSystemMetadata_MutableReplPolicy_2015316211225275 [org.dataone.integration.ContextAwareTestCaseDataone]
20151113-05:12:26: [INFO]: rest call info: GET https://mn-dev-unm-2.test.dataone.org/metacat/d1/mn/v2/meta/testUpdateSystemMetadata_MutableReplPolicy_2015316211225275 [org.dataone.client.rest.RestClient]
20151113-05:12:31: [INFO]: rest call info: PUT https://mn-dev-unm-2.test.dataone.org/metacat/d1/mn/v2/meta; MMP message has: ParamPart:pid = testUpdateSystemMetadata_MutableReplPolicy_2015316211225275; FilePart:sysmeta = /tmp/mmp.output.3324801470333687726.tmp (1074 bytes);  [org.dataone.client.rest.RestClient]
20151113-05:12:42: [INFO]: rest call info: GET https://mn-dev-unm-2.test.dataone.org/metacat/d1/mn/v2/meta/testUpdateSystemMetadata_MutableReplPolicy_2015316211225275 [org.dataone.client.rest.RestClient]
20151113-05:12:42: [INFO]: **************************************************** [org.dataone.integration.ContextAwareTestCaseDataone]
20151113-05:12:42: [INFO]: ***  context label:   DEV2 [org.dataone.integration.ContextAwareTestCaseDataone]
20151113-05:12:42: [INFO]: **************************************************** [org.dataone.integration.ContextAwareTestCaseDataone]
20151113-05:12:42: [INFO]: **************************************************** [org.dataone.integration.ContextAwareTestCaseDataone]
20151113-05:12:42: [INFO]: rest call info: GET https://mn-dev-ucsb-1.test.dataone.org/metacat/d1/mn/v2/monitor/ping [org.dataone.client.rest.RestClient]
20151113-05:12:42: [INFO]: MN excluded from test: https://mn-dev-ucsb-1.test.dataone.org/metacat/d1/mn [org.dataone.integration.ContextAwareTestCaseDataone]
20151113-05:12:42: [INFO]: rest call info: GET https://mn-dev-ucsb-2.test.dataone.org/metacat/d1/mn/v2/monitor/ping [org.dataone.client.rest.RestClient]
20151113-05:12:42: [INFO]: MN included in test: https://mn-dev-ucsb-2.test.dataone.org/metacat/d1/mn [org.dataone.integration.ContextAwareTestCaseDataone]
20151113-05:12:42: [INFO]: rest call info: GET https://mn-dev-unm-1.test.dataone.org/metacat/d1/mn/v2/monitor/ping [org.dataone.client.rest.RestClient]
20151113-05:12:42: [INFO]: MN excluded from test: https://mn-dev-unm-1.test.dataone.org/metacat/d1/mn [org.dataone.integration.ContextAwareTestCaseDataone]
20151113-05:12:42: [INFO]: rest call info: GET https://mn-dev-unm-2.test.dataone.org/metacat/d1/mn/v2/monitor/ping [org.dataone.client.rest.RestClient]
20151113-05:12:42: [INFO]: MN included in test: https://mn-dev-unm-2.test.dataone.org/metacat/d1/mn [org.dataone.integration.ContextAwareTestCaseDataone]
20151113-05:12:42: [INFO]: 
***************** running test for testUpdateSystemMetadata_MutableAuthMN(...) vs. node: https://mn-dev-ucsb-2.test.dataone.org/metacat/d1/mn ***************** [org.dataone.integration.ContextAwareTestCaseDataone]
20151113-05:12:42: [INFO]: certificate directory: /etc/dataone/client/testClientCerts/ [org.dataone.integration.ContextAwareTestCaseDataone]
20151113-05:12:42: [INFO]: certificate filename: cnDevUNM2 [org.dataone.integration.ContextAwareTestCaseDataone]
20151113-05:12:42: [INFO]: client setup as Subject: CN=urn:node:cnDevUNM2,DC=dataone,DC=org [org.dataone.integration.ContextAwareTestCaseDataone]
20151113-05:12:42: [INFO]: creating a test object.  pid = testUpdateSystemMetadata_MutableAuthMN_2015316211242371 on https://mn-dev-ucsb-2.test.dataone.org/metacat/d1/mn/v2 [org.dataone.integration.ContextAwareTestCaseDataone]
20151113-05:12:42: [INFO]: SystemMetadata for pid: testUpdateSystemMetadata_MutableAuthMN_2015316211242371
<?xml version="1.0" encoding="UTF-8"?><d1_v2.0:systemMetadata xmlns:d1_v2.0="http://ns.dataone.org/service/types/v2.0" xmlns:d1="http://ns.dataone.org/service/types/v1"><serialVersion>1</serialVersion><identifier>testUpdateSystemMetadata_MutableAuthMN_2015316211242371</identifier><formatId>eml://ecoinformatics.org/eml-2.0.1</formatId><size>17181</size><checksum algorithm="MD5">03ce09c6b4c3efc1681f3023402998a2</checksum><submitter>CN=urn:node:cnDevUNM2,DC=dataone,DC=org</submitter><rightsHolder>CN=testRightsHolder,DC=dataone,DC=org</rightsHolder><accessPolicy><allow><subject>CN=testRightsHolder,DC=dataone,DC=org</subject><permission>changePermission</permission></allow></accessPolicy><dateUploaded>2015-11-13T05:12:42.388+00:00</dateUploaded><dateSysMetadataModified>2015-11-13T05:12:42.388+00:00</dateSysMetadataModified><originMemberNode>urn:node:mnDevUCSB2</originMemberNode><authoritativeMemberNode>urn:node:mnDevUCSB2</authoritativeMemberNode></d1_v2.0:systemMetadata> [org.dataone.integration.ContextAwareTestCaseDataone]
20151113-05:12:43: [INFO]: rest call info: POST https://mn-dev-ucsb-2.test.dataone.org/metacat/d1/mn/v2/object; MMP message has: ParamPart:pid = testUpdateSystemMetadata_MutableAuthMN_2015316211242371; FilePart:object = /tmp/mmp.output.1778973897455996113.tmp (17181 bytes); FilePart:sysmeta = /tmp/mmp.output.3847932942953727756.tmp (981 bytes);  [org.dataone.client.rest.RestClient]
20151113-05:12:43: [INFO]: object created.  pid = testUpdateSystemMetadata_MutableAuthMN_2015316211242371 [org.dataone.integration.ContextAwareTestCaseDataone]
20151113-05:12:43: [INFO]: rest call info: GET https://mn-dev-ucsb-2.test.dataone.org/metacat/d1/mn/v2/meta/testUpdateSystemMetadata_MutableAuthMN_2015316211242371 [org.dataone.client.rest.RestClient]
20151113-05:12:43: [INFO]: rest call info: GET https://cn-dev-ucsb-2.test.dataone.org/cn/v2/node [org.dataone.client.rest.RestClient]
20151113-05:12:43: [WARN]: MN.updateSystemMetadata() returned a ServiceFailure. [org.dataone.integration.it.ContextAwareAdapter]
20151113-05:12:43: [INFO]: 
***************** running test for testUpdateSystemMetadata_MutableAuthMN(...) vs. node: https://mn-dev-unm-2.test.dataone.org/metacat/d1/mn ***************** [org.dataone.integration.ContextAwareTestCaseDataone]
20151113-05:12:43: [INFO]: certificate directory: /etc/dataone/client/testClientCerts/ [org.dataone.integration.ContextAwareTestCaseDataone]
20151113-05:12:43: [INFO]: certificate filename: cnDevUNM2 [org.dataone.integration.ContextAwareTestCaseDataone]
20151113-05:12:43: [INFO]: client setup as Subject: CN=urn:node:cnDevUNM2,DC=dataone,DC=org [org.dataone.integration.ContextAwareTestCaseDataone]
20151113-05:12:43: [INFO]: creating a test object.  pid = testUpdateSystemMetadata_MutableAuthMN_2015316211243844 on https://mn-dev-unm-2.test.dataone.org/metacat/d1/mn/v2 [org.dataone.integration.ContextAwareTestCaseDataone]
20151113-05:12:43: [INFO]: SystemMetadata for pid: testUpdateSystemMetadata_MutableAuthMN_2015316211243844
<?xml version="1.0" encoding="UTF-8"?><d1_v2.0:systemMetadata xmlns:d1_v2.0="http://ns.dataone.org/service/types/v2.0" xmlns:d1="http://ns.dataone.org/service/types/v1"><serialVersion>1</serialVersion><identifier>testUpdateSystemMetadata_MutableAuthMN_2015316211243844</identifier><formatId>eml://ecoinformatics.org/eml-2.0.1</formatId><size>17181</size><checksum algorithm="MD5">03ce09c6b4c3efc1681f3023402998a2</checksum><submitter>CN=urn:node:cnDevUNM2,DC=dataone,DC=org</submitter><rightsHolder>CN=testRightsHolder,DC=dataone,DC=org</rightsHolder><accessPolicy><allow><subject>CN=testRightsHolder,DC=dataone,DC=org</subject><permission>changePermission</permission></allow></accessPolicy><dateUploaded>2015-11-13T05:12:43.860+00:00</dateUploaded><dateSysMetadataModified>2015-11-13T05:12:43.860+00:00</dateSysMetadataModified><originMemberNode>urn:node:mnDevUNM2</originMemberNode><authoritativeMemberNode>urn:node:mnDevUNM2</authoritativeMemberNode></d1_v2.0:systemMetadata> [org.dataone.integration.ContextAwareTestCaseDataone]
20151113-05:12:44: [INFO]: rest call info: POST https://mn-dev-unm-2.test.dataone.org/metacat/d1/mn/v2/object; MMP message has: ParamPart:pid = testUpdateSystemMetadata_MutableAuthMN_2015316211243844; FilePart:object = /tmp/mmp.output.3551836191598704233.tmp (17181 bytes); FilePart:sysmeta = /tmp/mmp.output.3938736160918298385.tmp (979 bytes);  [org.dataone.client.rest.RestClient]
20151113-05:12:44: [INFO]: object created.  pid = testUpdateSystemMetadata_MutableAuthMN_2015316211243844 [org.dataone.integration.ContextAwareTestCaseDataone]
20151113-05:12:44: [INFO]: rest call info: GET https://mn-dev-unm-2.test.dataone.org/metacat/d1/mn/v2/meta/testUpdateSystemMetadata_MutableAuthMN_2015316211243844 [org.dataone.client.rest.RestClient]
20151113-05:12:45: [INFO]: rest call info: GET https://cn-dev-ucsb-2.test.dataone.org/cn/v2/node [org.dataone.client.rest.RestClient]
20151113-05:12:45: [WARN]: MN.updateSystemMetadata() returned a ServiceFailure. [org.dataone.integration.it.ContextAwareAdapter]
20151113-05:12:45: [INFO]: **************************************************** [org.dataone.integration.ContextAwareTestCaseDataone]
20151113-05:12:45: [INFO]: ***  context label:   DEV2 [org.dataone.integration.ContextAwareTestCaseDataone]
20151113-05:12:45: [INFO]: **************************************************** [org.dataone.integration.ContextAwareTestCaseDataone]
20151113-05:12:45: [INFO]: **************************************************** [org.dataone.integration.ContextAwareTestCaseDataone]
20151113-05:12:45: [INFO]: rest call info: GET https://mn-dev-ucsb-1.test.dataone.org/metacat/d1/mn/v2/monitor/ping [org.dataone.client.rest.RestClient]
20151113-05:12:45: [INFO]: MN excluded from test: https://mn-dev-ucsb-1.test.dataone.org/metacat/d1/mn [org.dataone.integration.ContextAwareTestCaseDataone]
20151113-05:12:45: [INFO]: rest call info: GET https://mn-dev-ucsb-2.test.dataone.org/metacat/d1/mn/v2/monitor/ping [org.dataone.client.rest.RestClient]
20151113-05:12:45: [INFO]: MN included in test: https://mn-dev-ucsb-2.test.dataone.org/metacat/d1/mn [org.dataone.integration.ContextAwareTestCaseDataone]
20151113-05:12:45: [INFO]: rest call info: GET https://mn-dev-unm-1.test.dataone.org/metacat/d1/mn/v2/monitor/ping [org.dataone.client.rest.RestClient]
20151113-05:12:45: [INFO]: MN excluded from test: https://mn-dev-unm-1.test.dataone.org/metacat/d1/mn [org.dataone.integration.ContextAwareTestCaseDataone]
20151113-05:12:45: [INFO]: rest call info: GET https://mn-dev-unm-2.test.dataone.org/metacat/d1/mn/v2/monitor/ping [org.dataone.client.rest.RestClient]
20151113-05:12:45: [INFO]: MN included in test: https://mn-dev-unm-2.test.dataone.org/metacat/d1/mn [org.dataone.integration.ContextAwareTestCaseDataone]
20151113-05:12:45: [INFO]: 
***************** running test for testUpdateSystemMetadata_MutableArchived(...) vs. node: https://mn-dev-ucsb-2.test.dataone.org/metacat/d1/mn ***************** [org.dataone.integration.ContextAwareTestCaseDataone]
20151113-05:12:45: [INFO]: certificate directory: /etc/dataone/client/testClientCerts/ [org.dataone.integration.ContextAwareTestCaseDataone]
20151113-05:12:45: [INFO]: certificate filename: cnDevUNM2 [org.dataone.integration.ContextAwareTestCaseDataone]
20151113-05:12:45: [INFO]: client setup as Subject: CN=urn:node:cnDevUNM2,DC=dataone,DC=org [org.dataone.integration.ContextAwareTestCaseDataone]
20151113-05:12:45: [INFO]: creating a test object.  pid = testUpdateSystemMetadata_MutableArchived_2015316211245272 on https://mn-dev-ucsb-2.test.dataone.org/metacat/d1/mn/v2 [org.dataone.integration.ContextAwareTestCaseDataone]
20151113-05:12:45: [INFO]: SystemMetadata for pid: testUpdateSystemMetadata_MutableArchived_2015316211245272
<?xml version="1.0" encoding="UTF-8"?><d1_v2.0:systemMetadata xmlns:d1_v2.0="http://ns.dataone.org/service/types/v2.0" xmlns:d1="http://ns.dataone.org/service/types/v1"><serialVersion>1</serialVersion><identifier>testUpdateSystemMetadata_MutableArchived_2015316211245272</identifier><formatId>eml://ecoinformatics.org/eml-2.0.1</formatId><size>17181</size><checksum algorithm="MD5">03ce09c6b4c3efc1681f3023402998a2</checksum><submitter>CN=urn:node:cnDevUNM2,DC=dataone,DC=org</submitter><rightsHolder>CN=testRightsHolder,DC=dataone,DC=org</rightsHolder><accessPolicy><allow><subject>CN=testRightsHolder,DC=dataone,DC=org</subject><permission>changePermission</permission></allow></accessPolicy><dateUploaded>2015-11-13T05:12:45.287+00:00</dateUploaded><dateSysMetadataModified>2015-11-13T05:12:45.287+00:00</dateSysMetadataModified><originMemberNode>urn:node:mnDevUCSB2</originMemberNode><authoritativeMemberNode>urn:node:mnDevUCSB2</authoritativeMemberNode></d1_v2.0:systemMetadata> [org.dataone.integration.ContextAwareTestCaseDataone]
20151113-05:12:46: [INFO]: rest call info: POST https://mn-dev-ucsb-2.test.dataone.org/metacat/d1/mn/v2/object; MMP message has: ParamPart:pid = testUpdateSystemMetadata_MutableArchived_2015316211245272; FilePart:object = /tmp/mmp.output.8982287369448133477.tmp (17181 bytes); FilePart:sysmeta = /tmp/mmp.output.4026800007599780185.tmp (983 bytes);  [org.dataone.client.rest.RestClient]
20151113-05:12:46: [INFO]: object created.  pid = testUpdateSystemMetadata_MutableArchived_2015316211245272 [org.dataone.integration.ContextAwareTestCaseDataone]
20151113-05:12:46: [INFO]: rest call info: GET https://mn-dev-ucsb-2.test.dataone.org/metacat/d1/mn/v2/meta/testUpdateSystemMetadata_MutableArchived_2015316211245272 [org.dataone.client.rest.RestClient]
20151113-05:12:52: [INFO]: rest call info: PUT https://mn-dev-ucsb-2.test.dataone.org/metacat/d1/mn/v2/meta; MMP message has: ParamPart:pid = testUpdateSystemMetadata_MutableArchived_2015316211245272; FilePart:sysmeta = /tmp/mmp.output.3634254854816907604.tmp (1006 bytes);  [org.dataone.client.rest.RestClient]
20151113-05:13:03: [INFO]: rest call info: GET https://mn-dev-ucsb-2.test.dataone.org/metacat/d1/mn/v2/meta/testUpdateSystemMetadata_MutableArchived_2015316211245272 [org.dataone.client.rest.RestClient]
20151113-05:13:03: [INFO]: 
***************** running test for testUpdateSystemMetadata_MutableArchived(...) vs. node: https://mn-dev-unm-2.test.dataone.org/metacat/d1/mn ***************** [org.dataone.integration.ContextAwareTestCaseDataone]
20151113-05:13:03: [INFO]: certificate directory: /etc/dataone/client/testClientCerts/ [org.dataone.integration.ContextAwareTestCaseDataone]
20151113-05:13:03: [INFO]: certificate filename: cnDevUNM2 [org.dataone.integration.ContextAwareTestCaseDataone]
20151113-05:13:03: [INFO]: client setup as Subject: CN=urn:node:cnDevUNM2,DC=dataone,DC=org [org.dataone.integration.ContextAwareTestCaseDataone]
20151113-05:13:03: [INFO]: creating a test object.  pid = testUpdateSystemMetadata_MutableArchived_2015316211332 on https://mn-dev-unm-2.test.dataone.org/metacat/d1/mn/v2 [org.dataone.integration.ContextAwareTestCaseDataone]
20151113-05:13:03: [INFO]: SystemMetadata for pid: testUpdateSystemMetadata_MutableArchived_2015316211332
<?xml version="1.0" encoding="UTF-8"?><d1_v2.0:systemMetadata xmlns:d1_v2.0="http://ns.dataone.org/service/types/v2.0" xmlns:d1="http://ns.dataone.org/service/types/v1"><serialVersion>1</serialVersion><identifier>testUpdateSystemMetadata_MutableArchived_2015316211332</identifier><formatId>eml://ecoinformatics.org/eml-2.0.1</formatId><size>17181</size><checksum algorithm="MD5">03ce09c6b4c3efc1681f3023402998a2</checksum><submitter>CN=urn:node:cnDevUNM2,DC=dataone,DC=org</submitter><rightsHolder>CN=testRightsHolder,DC=dataone,DC=org</rightsHolder><accessPolicy><allow><subject>CN=testRightsHolder,DC=dataone,DC=org</subject><permission>changePermission</permission></allow></accessPolicy><dateUploaded>2015-11-13T05:13:03.016+00:00</dateUploaded><dateSysMetadataModified>2015-11-13T05:13:03.016+00:00</dateSysMetadataModified><originMemberNode>urn:node:mnDevUNM2</originMemberNode><authoritativeMemberNode>urn:node:mnDevUNM2</authoritativeMemberNode></d1_v2.0:systemMetadata> [org.dataone.integration.ContextAwareTestCaseDataone]
20151113-05:13:03: [INFO]: rest call info: POST https://mn-dev-unm-2.test.dataone.org/metacat/d1/mn/v2/object; MMP message has: ParamPart:pid = testUpdateSystemMetadata_MutableArchived_2015316211332; FilePart:object = /tmp/mmp.output.4146095523070072232.tmp (17181 bytes); FilePart:sysmeta = /tmp/mmp.output.7057363423380928178.tmp (978 bytes);  [org.dataone.client.rest.RestClient]
20151113-05:13:03: [INFO]: object created.  pid = testUpdateSystemMetadata_MutableArchived_2015316211332 [org.dataone.integration.ContextAwareTestCaseDataone]
20151113-05:13:04: [INFO]: rest call info: GET https://mn-dev-unm-2.test.dataone.org/metacat/d1/mn/v2/meta/testUpdateSystemMetadata_MutableArchived_2015316211332 [org.dataone.client.rest.RestClient]
20151113-05:13:04: [INFO]: rest call info: PUT https://mn-dev-unm-2.test.dataone.org/metacat/d1/mn/v2/meta; MMP message has: ParamPart:pid = testUpdateSystemMetadata_MutableArchived_2015316211332; FilePart:sysmeta = /tmp/mmp.output.430231142831203134.tmp (1001 bytes);  [org.dataone.client.rest.RestClient]
20151113-05:13:04: [WARN]: MN.updateSystemMetadata() returned a ServiceFailure. [org.dataone.integration.it.ContextAwareAdapter]
20151113-05:13:04: [INFO]: **************************************************** [org.dataone.integration.ContextAwareTestCaseDataone]
20151113-05:13:04: [INFO]: ***  context label:   DEV2 [org.dataone.integration.ContextAwareTestCaseDataone]
20151113-05:13:04: [INFO]: **************************************************** [org.dataone.integration.ContextAwareTestCaseDataone]
20151113-05:13:04: [INFO]: **************************************************** [org.dataone.integration.ContextAwareTestCaseDataone]
20151113-05:13:04: [INFO]: rest call info: GET https://mn-dev-ucsb-1.test.dataone.org/metacat/d1/mn/v2/monitor/ping [org.dataone.client.rest.RestClient]
20151113-05:13:04: [INFO]: MN excluded from test: https://mn-dev-ucsb-1.test.dataone.org/metacat/d1/mn [org.dataone.integration.ContextAwareTestCaseDataone]
20151113-05:13:04: [INFO]: rest call info: GET https://mn-dev-ucsb-2.test.dataone.org/metacat/d1/mn/v2/monitor/ping [org.dataone.client.rest.RestClient]
20151113-05:13:04: [INFO]: MN included in test: https://mn-dev-ucsb-2.test.dataone.org/metacat/d1/mn [org.dataone.integration.ContextAwareTestCaseDataone]
20151113-05:13:04: [INFO]: rest call info: GET https://mn-dev-unm-1.test.dataone.org/metacat/d1/mn/v2/monitor/ping [org.dataone.client.rest.RestClient]
20151113-05:13:04: [INFO]: MN excluded from test: https://mn-dev-unm-1.test.dataone.org/metacat/d1/mn [org.dataone.integration.ContextAwareTestCaseDataone]
20151113-05:13:05: [INFO]: rest call info: GET https://mn-dev-unm-2.test.dataone.org/metacat/d1/mn/v2/monitor/ping [org.dataone.client.rest.RestClient]
20151113-05:13:05: [INFO]: MN included in test: https://mn-dev-unm-2.test.dataone.org/metacat/d1/mn [org.dataone.integration.ContextAwareTestCaseDataone]
20151113-05:13:05: [INFO]: 
***************** running test for testUpdateSystemMetadata_MutableAuthMN(...) vs. node: https://mn-dev-ucsb-2.test.dataone.org/metacat/d1/mn ***************** [org.dataone.integration.ContextAwareTestCaseDataone]
20151113-05:13:05: [INFO]: certificate directory: /etc/dataone/client/testClientCerts/ [org.dataone.integration.ContextAwareTestCaseDataone]
20151113-05:13:05: [INFO]: certificate filename: cnDevUNM2 [org.dataone.integration.ContextAwareTestCaseDataone]
20151113-05:13:05: [INFO]: client setup as Subject: CN=urn:node:cnDevUNM2,DC=dataone,DC=org [org.dataone.integration.ContextAwareTestCaseDataone]
20151113-05:13:05: [INFO]: creating a test object.  pid = testUpdateSystemMetadata_MutableAuthMN_2015316211356 on https://mn-dev-ucsb-2.test.dataone.org/metacat/d1/mn/v2 [org.dataone.integration.ContextAwareTestCaseDataone]
20151113-05:13:05: [INFO]: SystemMetadata for pid: testUpdateSystemMetadata_MutableAuthMN_2015316211356
<?xml version="1.0" encoding="UTF-8"?><d1_v2.0:systemMetadata xmlns:d1_v2.0="http://ns.dataone.org/service/types/v2.0" xmlns:d1="http://ns.dataone.org/service/types/v1"><serialVersion>1</serialVersion><identifier>testUpdateSystemMetadata_MutableAuthMN_2015316211356</identifier><formatId>eml://ecoinformatics.org/eml-2.0.1</formatId><size>17181</size><checksum algorithm="MD5">03ce09c6b4c3efc1681f3023402998a2</checksum><submitter>CN=urn:node:cnDevUNM2,DC=dataone,DC=org</submitter><rightsHolder>CN=testRightsHolder,DC=dataone,DC=org</rightsHolder><accessPolicy><allow><subject>CN=testRightsHolder,DC=dataone,DC=org</subject><permission>changePermission</permission></allow></accessPolicy><dateUploaded>2015-11-13T05:13:05.020+00:00</dateUploaded><dateSysMetadataModified>2015-11-13T05:13:05.020+00:00</dateSysMetadataModified><originMemberNode>urn:node:mnDevUCSB2</originMemberNode><authoritativeMemberNode>urn:node:mnDevUCSB2</authoritativeMemberNode></d1_v2.0:systemMetadata> [org.dataone.integration.ContextAwareTestCaseDataone]
20151113-05:13:06: [INFO]: rest call info: POST https://mn-dev-ucsb-2.test.dataone.org/metacat/d1/mn/v2/object; MMP message has: ParamPart:pid = testUpdateSystemMetadata_MutableAuthMN_2015316211356; FilePart:object = /tmp/mmp.output.3125957438812460292.tmp (17181 bytes); FilePart:sysmeta = /tmp/mmp.output.6383529747979134622.tmp (978 bytes);  [org.dataone.client.rest.RestClient]
20151113-05:13:06: [INFO]: object created.  pid = testUpdateSystemMetadata_MutableAuthMN_2015316211356 [org.dataone.integration.ContextAwareTestCaseDataone]
20151113-05:13:06: [INFO]: rest call info: GET https://mn-dev-ucsb-2.test.dataone.org/metacat/d1/mn/v2/meta/testUpdateSystemMetadata_MutableAuthMN_2015316211356 [org.dataone.client.rest.RestClient]
20151113-05:13:07: [INFO]: rest call info: GET https://cn-dev-ucsb-2.test.dataone.org/cn/v2/node [org.dataone.client.rest.RestClient]
20151113-05:13:07: [WARN]: MN.updateSystemMetadata() returned a ServiceFailure, was expecting an InvalidRequest or NotAuthorized. [org.dataone.integration.it.ContextAwareAdapter]
20151113-05:13:07: [INFO]: 
***************** running test for testUpdateSystemMetadata_MutableAuthMN(...) vs. node: https://mn-dev-unm-2.test.dataone.org/metacat/d1/mn ***************** [org.dataone.integration.ContextAwareTestCaseDataone]
20151113-05:13:07: [INFO]: certificate directory: /etc/dataone/client/testClientCerts/ [org.dataone.integration.ContextAwareTestCaseDataone]
20151113-05:13:07: [INFO]: certificate filename: cnDevUNM2 [org.dataone.integration.ContextAwareTestCaseDataone]
20151113-05:13:07: [INFO]: client setup as Subject: CN=urn:node:cnDevUNM2,DC=dataone,DC=org [org.dataone.integration.ContextAwareTestCaseDataone]
20151113-05:13:07: [INFO]: creating a test object.  pid = testUpdateSystemMetadata_MutableAuthMN_20153162113711 on https://mn-dev-unm-2.test.dataone.org/metacat/d1/mn/v2 [org.dataone.integration.ContextAwareTestCaseDataone]
20151113-05:13:07: [INFO]: SystemMetadata for pid: testUpdateSystemMetadata_MutableAuthMN_20153162113711
<?xml version="1.0" encoding="UTF-8"?><d1_v2.0:systemMetadata xmlns:d1_v2.0="http://ns.dataone.org/service/types/v2.0" xmlns:d1="http://ns.dataone.org/service/types/v1"><serialVersion>1</serialVersion><identifier>testUpdateSystemMetadata_MutableAuthMN_20153162113711</identifier><formatId>eml://ecoinformatics.org/eml-2.0.1</formatId><size>17181</size><checksum algorithm="MD5">03ce09c6b4c3efc1681f3023402998a2</checksum><submitter>CN=urn:node:cnDevUNM2,DC=dataone,DC=org</submitter><rightsHolder>CN=testRightsHolder,DC=dataone,DC=org</rightsHolder><accessPolicy><allow><subject>CN=testRightsHolder,DC=dataone,DC=org</subject><permission>changePermission</permission></allow></accessPolicy><dateUploaded>2015-11-13T05:13:07.025+00:00</dateUploaded><dateSysMetadataModified>2015-11-13T05:13:07.025+00:00</dateSysMetadataModified><originMemberNode>urn:node:mnDevUNM2</originMemberNode><authoritativeMemberNode>urn:node:mnDevUNM2</authoritativeMemberNode></d1_v2.0:systemMetadata> [org.dataone.integration.ContextAwareTestCaseDataone]
20151113-05:13:07: [INFO]: rest call info: POST https://mn-dev-unm-2.test.dataone.org/metacat/d1/mn/v2/object; MMP message has: ParamPart:pid = testUpdateSystemMetadata_MutableAuthMN_20153162113711; FilePart:object = /tmp/mmp.output.8904423859083181223.tmp (17181 bytes); FilePart:sysmeta = /tmp/mmp.output.3300400794953844868.tmp (977 bytes);  [org.dataone.client.rest.RestClient]
20151113-05:13:07: [INFO]: object created.  pid = testUpdateSystemMetadata_MutableAuthMN_20153162113711 [org.dataone.integration.ContextAwareTestCaseDataone]
20151113-05:13:08: [INFO]: rest call info: GET https://mn-dev-unm-2.test.dataone.org/metacat/d1/mn/v2/meta/testUpdateSystemMetadata_MutableAuthMN_20153162113711 [org.dataone.client.rest.RestClient]
20151113-05:13:08: [INFO]: rest call info: GET https://cn-dev-ucsb-2.test.dataone.org/cn/v2/node [org.dataone.client.rest.RestClient]
20151113-05:13:08: [WARN]: MN.updateSystemMetadata() returned a ServiceFailure, was expecting an InvalidRequest or NotAuthorized. [org.dataone.integration.it.ContextAwareAdapter]
20151113-05:13:08: [INFO]: **************************************************** [org.dataone.integration.ContextAwareTestCaseDataone]
20151113-05:13:08: [INFO]: ***  context label:   DEV2 [org.dataone.integration.ContextAwareTestCaseDataone]
20151113-05:13:08: [INFO]: **************************************************** [org.dataone.integration.ContextAwareTestCaseDataone]
20151113-05:13:08: [INFO]: **************************************************** [org.dataone.integration.ContextAwareTestCaseDataone]
20151113-05:13:08: [INFO]: rest call info: GET https://mn-dev-ucsb-1.test.dataone.org/metacat/d1/mn/v2/monitor/ping [org.dataone.client.rest.RestClient]
20151113-05:13:08: [INFO]: MN excluded from test: https://mn-dev-ucsb-1.test.dataone.org/metacat/d1/mn [org.dataone.integration.ContextAwareTestCaseDataone]
20151113-05:13:08: [INFO]: rest call info: GET https://mn-dev-ucsb-2.test.dataone.org/metacat/d1/mn/v2/monitor/ping [org.dataone.client.rest.RestClient]
20151113-05:13:08: [INFO]: MN included in test: https://mn-dev-ucsb-2.test.dataone.org/metacat/d1/mn [org.dataone.integration.ContextAwareTestCaseDataone]
20151113-05:13:08: [INFO]: rest call info: GET https://mn-dev-unm-1.test.dataone.org/metacat/d1/mn/v2/monitor/ping [org.dataone.client.rest.RestClient]
20151113-05:13:08: [INFO]: MN excluded from test: https://mn-dev-unm-1.test.dataone.org/metacat/d1/mn [org.dataone.integration.ContextAwareTestCaseDataone]
20151113-05:13:08: [INFO]: rest call info: GET https://mn-dev-unm-2.test.dataone.org/metacat/d1/mn/v2/monitor/ping [org.dataone.client.rest.RestClient]
20151113-05:13:08: [INFO]: MN included in test: https://mn-dev-unm-2.test.dataone.org/metacat/d1/mn [org.dataone.integration.ContextAwareTestCaseDataone]
20151113-05:13:08: [INFO]: 
***************** running test for testUpdateSystemMetadata_ObsoletesFail(...) vs. node: https://mn-dev-ucsb-2.test.dataone.org/metacat/d1/mn ***************** [org.dataone.integration.ContextAwareTestCaseDataone]
20151113-05:13:08: [INFO]: certificate directory: /etc/dataone/client/testClientCerts/ [org.dataone.integration.ContextAwareTestCaseDataone]
20151113-05:13:08: [INFO]: certificate filename: cnDevUNM2 [org.dataone.integration.ContextAwareTestCaseDataone]
20151113-05:13:08: [INFO]: client setup as Subject: CN=urn:node:cnDevUNM2,DC=dataone,DC=org [org.dataone.integration.ContextAwareTestCaseDataone]
20151113-05:13:08: [INFO]: creating a test object.  pid = testUpdateSystemMetadata_ObsoletesFail_201531621138386 on https://mn-dev-ucsb-2.test.dataone.org/metacat/d1/mn/v2 [org.dataone.integration.ContextAwareTestCaseDataone]
20151113-05:13:08: [INFO]: SystemMetadata for pid: testUpdateSystemMetadata_ObsoletesFail_201531621138386
<?xml version="1.0" encoding="UTF-8"?><d1_v2.0:systemMetadata xmlns:d1_v2.0="http://ns.dataone.org/service/types/v2.0" xmlns:d1="http://ns.dataone.org/service/types/v1"><serialVersion>1</serialVersion><identifier>testUpdateSystemMetadata_ObsoletesFail_201531621138386</identifier><formatId>eml://ecoinformatics.org/eml-2.0.1</formatId><size>17181</size><checksum algorithm="MD5">03ce09c6b4c3efc1681f3023402998a2</checksum><submitter>CN=urn:node:cnDevUNM2,DC=dataone,DC=org</submitter><rightsHolder>CN=testRightsHolder,DC=dataone,DC=org</rightsHolder><accessPolicy><allow><subject>CN=testRightsHolder,DC=dataone,DC=org</subject><permission>changePermission</permission></allow></accessPolicy><dateUploaded>2015-11-13T05:13:08.403+00:00</dateUploaded><dateSysMetadataModified>2015-11-13T05:13:08.403+00:00</dateSysMetadataModified><originMemberNode>urn:node:mnDevUCSB2</originMemberNode><authoritativeMemberNode>urn:node:mnDevUCSB2</authoritativeMemberNode></d1_v2.0:systemMetadata> [org.dataone.integration.ContextAwareTestCaseDataone]
20151113-05:13:09: [INFO]: rest call info: POST https://mn-dev-ucsb-2.test.dataone.org/metacat/d1/mn/v2/object; MMP message has: ParamPart:pid = testUpdateSystemMetadata_ObsoletesFail_201531621138386; FilePart:object = /tmp/mmp.output.4978412965605527640.tmp (17181 bytes); FilePart:sysmeta = /tmp/mmp.output.4036463842858835232.tmp (980 bytes);  [org.dataone.client.rest.RestClient]
20151113-05:13:09: [INFO]: object created.  pid = testUpdateSystemMetadata_ObsoletesFail_201531621138386 [org.dataone.integration.ContextAwareTestCaseDataone]
20151113-05:13:20: [INFO]: rest call info: PUT https://mn-dev-ucsb-2.test.dataone.org/metacat/d1/mn/v2/object/testUpdateSystemMetadata_ObsoletesFail_201531621138386; MMP message has: ParamPart:newPid = testUpdateSystemMetadata_ObsoletesFail_201531621138387; FilePart:object = /tmp/mmp.output.1199183747876649925.tmp (17181 bytes); FilePart:sysmeta = /tmp/mmp.output.4962584150044391112.tmp (780 bytes);  [org.dataone.client.rest.RestClient]
20151113-05:13:20: [INFO]: certificate directory: /etc/dataone/client/testClientCerts/ [org.dataone.integration.ContextAwareTestCaseDataone]
20151113-05:13:20: [INFO]: certificate filename: cnDevUNM2 [org.dataone.integration.ContextAwareTestCaseDataone]
20151113-05:13:20: [INFO]: client setup as Subject: CN=urn:node:cnDevUNM2,DC=dataone,DC=org [org.dataone.integration.ContextAwareTestCaseDataone]
20151113-05:13:20: [INFO]: creating a test object.  pid = testUpdateSystemMetadata_ObsoletesFail_201531621138388 on https://mn-dev-ucsb-2.test.dataone.org/metacat/d1/mn/v2 [org.dataone.integration.ContextAwareTestCaseDataone]
20151113-05:13:20: [INFO]: SystemMetadata for pid: testUpdateSystemMetadata_ObsoletesFail_201531621138388
<?xml version="1.0" encoding="UTF-8"?><d1_v2.0:systemMetadata xmlns:d1_v2.0="http://ns.dataone.org/service/types/v2.0" xmlns:d1="http://ns.dataone.org/service/types/v1"><serialVersion>1</serialVersion><identifier>testUpdateSystemMetadata_ObsoletesFail_201531621138388</identifier><formatId>eml://ecoinformatics.org/eml-2.0.1</formatId><size>17181</size><checksum algorithm="MD5">03ce09c6b4c3efc1681f3023402998a2</checksum><submitter>CN=urn:node:cnDevUNM2,DC=dataone,DC=org</submitter><rightsHolder>CN=testRightsHolder,DC=dataone,DC=org</rightsHolder><accessPolicy><allow><subject>CN=testRightsHolder,DC=dataone,DC=org</subject><permission>changePermission</permission></allow></accessPolicy><dateUploaded>2015-11-13T05:13:20.974+00:00</dateUploaded><dateSysMetadataModified>2015-11-13T05:13:20.974+00:00</dateSysMetadataModified><originMemberNode>urn:node:mnDevUCSB2</originMemberNode><authoritativeMemberNode>urn:node:mnDevUCSB2</authoritativeMemberNode></d1_v2.0:systemMetadata> [org.dataone.integration.ContextAwareTestCaseDataone]
20151113-05:13:21: [INFO]: rest call info: POST https://mn-dev-ucsb-2.test.dataone.org/metacat/d1/mn/v2/object; MMP message has: ParamPart:pid = testUpdateSystemMetadata_ObsoletesFail_201531621138388; FilePart:object = /tmp/mmp.output.1352918216552530117.tmp (17181 bytes); FilePart:sysmeta = /tmp/mmp.output.8830780721762698404.tmp (980 bytes);  [org.dataone.client.rest.RestClient]
20151113-05:13:21: [INFO]: object created.  pid = testUpdateSystemMetadata_ObsoletesFail_201531621138388 [org.dataone.integration.ContextAwareTestCaseDataone]
20151113-05:13:32: [INFO]: rest call info: GET https://mn-dev-ucsb-2.test.dataone.org/metacat/d1/mn/v2/meta/testUpdateSystemMetadata_ObsoletesFail_201531621138387 [org.dataone.client.rest.RestClient]
20151113-05:13:32: [INFO]: rest call info: PUT https://mn-dev-ucsb-2.test.dataone.org/metacat/d1/mn/v2/meta; MMP message has: ParamPart:pid = testUpdateSystemMetadata_ObsoletesFail_201531621138387; FilePart:sysmeta = /tmp/mmp.output.376964598510030313.tmp (914 bytes);  [org.dataone.client.rest.RestClient]
20151113-05:13:32: [INFO]: 
***************** running test for testUpdateSystemMetadata_ObsoletesFail(...) vs. node: https://mn-dev-unm-2.test.dataone.org/metacat/d1/mn ***************** [org.dataone.integration.ContextAwareTestCaseDataone]
20151113-05:13:32: [INFO]: certificate directory: /etc/dataone/client/testClientCerts/ [org.dataone.integration.ContextAwareTestCaseDataone]
20151113-05:13:32: [INFO]: certificate filename: cnDevUNM2 [org.dataone.integration.ContextAwareTestCaseDataone]
20151113-05:13:32: [INFO]: client setup as Subject: CN=urn:node:cnDevUNM2,DC=dataone,DC=org [org.dataone.integration.ContextAwareTestCaseDataone]
20151113-05:13:32: [INFO]: creating a test object.  pid = testUpdateSystemMetadata_ObsoletesFail_2015316211332728 on https://mn-dev-unm-2.test.dataone.org/metacat/d1/mn/v2 [org.dataone.integration.ContextAwareTestCaseDataone]
20151113-05:13:32: [INFO]: SystemMetadata for pid: testUpdateSystemMetadata_ObsoletesFail_2015316211332728
<?xml version="1.0" encoding="UTF-8"?><d1_v2.0:systemMetadata xmlns:d1_v2.0="http://ns.dataone.org/service/types/v2.0" xmlns:d1="http://ns.dataone.org/service/types/v1"><serialVersion>1</serialVersion><identifier>testUpdateSystemMetadata_ObsoletesFail_2015316211332728</identifier><formatId>eml://ecoinformatics.org/eml-2.0.1</formatId><size>17181</size><checksum algorithm="MD5">03ce09c6b4c3efc1681f3023402998a2</checksum><submitter>CN=urn:node:cnDevUNM2,DC=dataone,DC=org</submitter><rightsHolder>CN=testRightsHolder,DC=dataone,DC=org</rightsHolder><accessPolicy><allow><subject>CN=testRightsHolder,DC=dataone,DC=org</subject><permission>changePermission</permission></allow></accessPolicy><dateUploaded>2015-11-13T05:13:32.746+00:00</dateUploaded><dateSysMetadataModified>2015-11-13T05:13:32.746+00:00</dateSysMetadataModified><originMemberNode>urn:node:mnDevUNM2</originMemberNode><authoritativeMemberNode>urn:node:mnDevUNM2</authoritativeMemberNode></d1_v2.0:systemMetadata> [org.dataone.integration.ContextAwareTestCaseDataone]
20151113-05:13:33: [INFO]: rest call info: POST https://mn-dev-unm-2.test.dataone.org/metacat/d1/mn/v2/object; MMP message has: ParamPart:pid = testUpdateSystemMetadata_ObsoletesFail_2015316211332728; FilePart:object = /tmp/mmp.output.2011184356118714900.tmp (17181 bytes); FilePart:sysmeta = /tmp/mmp.output.498507127657251269.tmp (979 bytes);  [org.dataone.client.rest.RestClient]
20151113-05:13:33: [INFO]: object created.  pid = testUpdateSystemMetadata_ObsoletesFail_2015316211332728 [org.dataone.integration.ContextAwareTestCaseDataone]
20151113-05:13:44: [INFO]: rest call info: PUT https://mn-dev-unm-2.test.dataone.org/metacat/d1/mn/v2/object/testUpdateSystemMetadata_ObsoletesFail_2015316211332728; MMP message has: ParamPart:newPid = testUpdateSystemMetadata_ObsoletesFail_2015316211332730; FilePart:object = /tmp/mmp.output.5889880373634246010.tmp (17181 bytes); FilePart:sysmeta = /tmp/mmp.output.5698343545968518312.tmp (780 bytes);  [org.dataone.client.rest.RestClient]
20151113-05:13:44: [INFO]: certificate directory: /etc/dataone/client/testClientCerts/ [org.dataone.integration.ContextAwareTestCaseDataone]
20151113-05:13:44: [INFO]: certificate filename: cnDevUNM2 [org.dataone.integration.ContextAwareTestCaseDataone]
20151113-05:13:44: [INFO]: client setup as Subject: CN=urn:node:cnDevUNM2,DC=dataone,DC=org [org.dataone.integration.ContextAwareTestCaseDataone]
20151113-05:13:44: [INFO]: creating a test object.  pid = testUpdateSystemMetadata_ObsoletesFail_2015316211332731 on https://mn-dev-unm-2.test.dataone.org/metacat/d1/mn/v2 [org.dataone.integration.ContextAwareTestCaseDataone]
20151113-05:13:44: [INFO]: SystemMetadata for pid: testUpdateSystemMetadata_ObsoletesFail_2015316211332731
<?xml version="1.0" encoding="UTF-8"?><d1_v2.0:systemMetadata xmlns:d1_v2.0="http://ns.dataone.org/service/types/v2.0" xmlns:d1="http://ns.dataone.org/service/types/v1"><serialVersion>1</serialVersion><identifier>testUpdateSystemMetadata_ObsoletesFail_2015316211332731</identifier><formatId>eml://ecoinformatics.org/eml-2.0.1</formatId><size>17181</size><checksum algorithm="MD5">03ce09c6b4c3efc1681f3023402998a2</checksum><submitter>CN=urn:node:cnDevUNM2,DC=dataone,DC=org</submitter><rightsHolder>CN=testRightsHolder,DC=dataone,DC=org</rightsHolder><accessPolicy><allow><subject>CN=testRightsHolder,DC=dataone,DC=org</subject><permission>changePermission</permission></allow></accessPolicy><dateUploaded>2015-11-13T05:13:44.988+00:00</dateUploaded><dateSysMetadataModified>2015-11-13T05:13:44.988+00:00</dateSysMetadataModified><originMemberNode>urn:node:mnDevUNM2</originMemberNode><authoritativeMemberNode>urn:node:mnDevUNM2</authoritativeMemberNode></d1_v2.0:systemMetadata> [org.dataone.integration.ContextAwareTestCaseDataone]
20151113-05:13:45: [INFO]: rest call info: POST https://mn-dev-unm-2.test.dataone.org/metacat/d1/mn/v2/object; MMP message has: ParamPart:pid = testUpdateSystemMetadata_ObsoletesFail_2015316211332731; FilePart:object = /tmp/mmp.output.8037886372915888153.tmp (17181 bytes); FilePart:sysmeta = /tmp/mmp.output.3610525613953638719.tmp (979 bytes);  [org.dataone.client.rest.RestClient]
20151113-05:13:45: [INFO]: object created.  pid = testUpdateSystemMetadata_ObsoletesFail_2015316211332731 [org.dataone.integration.ContextAwareTestCaseDataone]
20151113-05:13:56: [INFO]: rest call info: GET https://mn-dev-unm-2.test.dataone.org/metacat/d1/mn/v2/meta/testUpdateSystemMetadata_ObsoletesFail_2015316211332730 [org.dataone.client.rest.RestClient]
20151113-05:13:56: [INFO]: rest call info: PUT https://mn-dev-unm-2.test.dataone.org/metacat/d1/mn/v2/meta; MMP message has: ParamPart:pid = testUpdateSystemMetadata_ObsoletesFail_2015316211332730; FilePart:sysmeta = /tmp/mmp.output.8629565227481948650.tmp (914 bytes);  [org.dataone.client.rest.RestClient]
20151113-05:13:56: [INFO]: **************************************************** [org.dataone.integration.ContextAwareTestCaseDataone]
20151113-05:13:56: [INFO]: ***  context label:   DEV2 [org.dataone.integration.ContextAwareTestCaseDataone]
20151113-05:13:56: [INFO]: **************************************************** [org.dataone.integration.ContextAwareTestCaseDataone]
20151113-05:13:56: [INFO]: **************************************************** [org.dataone.integration.ContextAwareTestCaseDataone]
20151113-05:13:56: [INFO]: rest call info: GET https://mn-dev-ucsb-1.test.dataone.org/metacat/d1/mn/v2/monitor/ping [org.dataone.client.rest.RestClient]
20151113-05:13:56: [INFO]: MN excluded from test: https://mn-dev-ucsb-1.test.dataone.org/metacat/d1/mn [org.dataone.integration.ContextAwareTestCaseDataone]
20151113-05:13:56: [INFO]: rest call info: GET https://mn-dev-ucsb-2.test.dataone.org/metacat/d1/mn/v2/monitor/ping [org.dataone.client.rest.RestClient]
20151113-05:13:56: [INFO]: MN included in test: https://mn-dev-ucsb-2.test.dataone.org/metacat/d1/mn [org.dataone.integration.ContextAwareTestCaseDataone]
20151113-05:13:56: [INFO]: rest call info: GET https://mn-dev-unm-1.test.dataone.org/metacat/d1/mn/v2/monitor/ping [org.dataone.client.rest.RestClient]
20151113-05:13:56: [INFO]: MN excluded from test: https://mn-dev-unm-1.test.dataone.org/metacat/d1/mn [org.dataone.integration.ContextAwareTestCaseDataone]
20151113-05:13:56: [INFO]: rest call info: GET https://mn-dev-unm-2.test.dataone.org/metacat/d1/mn/v2/monitor/ping [org.dataone.client.rest.RestClient]
20151113-05:13:56: [INFO]: MN included in test: https://mn-dev-unm-2.test.dataone.org/metacat/d1/mn [org.dataone.integration.ContextAwareTestCaseDataone]
20151113-05:13:56: [INFO]: 
***************** running test for testUpdateSystemMetadata_ObsoletedByFail(...) vs. node: https://mn-dev-ucsb-2.test.dataone.org/metacat/d1/mn ***************** [org.dataone.integration.ContextAwareTestCaseDataone]
20151113-05:13:56: [INFO]: certificate directory: /etc/dataone/client/testClientCerts/ [org.dataone.integration.ContextAwareTestCaseDataone]
20151113-05:13:56: [INFO]: certificate filename: cnDevUNM2 [org.dataone.integration.ContextAwareTestCaseDataone]
20151113-05:13:56: [INFO]: client setup as Subject: CN=urn:node:cnDevUNM2,DC=dataone,DC=org [org.dataone.integration.ContextAwareTestCaseDataone]
20151113-05:13:56: [INFO]: creating a test object.  pid = testUpdateSystemMetadata_ObsoletedByFail_2015316211356530 on https://mn-dev-ucsb-2.test.dataone.org/metacat/d1/mn/v2 [org.dataone.integration.ContextAwareTestCaseDataone]
20151113-05:13:56: [INFO]: SystemMetadata for pid: testUpdateSystemMetadata_ObsoletedByFail_2015316211356530
<?xml version="1.0" encoding="UTF-8"?><d1_v2.0:systemMetadata xmlns:d1_v2.0="http://ns.dataone.org/service/types/v2.0" xmlns:d1="http://ns.dataone.org/service/types/v1"><serialVersion>1</serialVersion><identifier>testUpdateSystemMetadata_ObsoletedByFail_2015316211356530</identifier><formatId>eml://ecoinformatics.org/eml-2.0.1</formatId><size>17181</size><checksum algorithm="MD5">03ce09c6b4c3efc1681f3023402998a2</checksum><submitter>CN=urn:node:cnDevUNM2,DC=dataone,DC=org</submitter><rightsHolder>CN=testRightsHolder,DC=dataone,DC=org</rightsHolder><accessPolicy><allow><subject>CN=testRightsHolder,DC=dataone,DC=org</subject><permission>changePermission</permission></allow></accessPolicy><dateUploaded>2015-11-13T05:13:56.549+00:00</dateUploaded><dateSysMetadataModified>2015-11-13T05:13:56.549+00:00</dateSysMetadataModified><originMemberNode>urn:node:mnDevUCSB2</originMemberNode><authoritativeMemberNode>urn:node:mnDevUCSB2</authoritativeMemberNode></d1_v2.0:systemMetadata> [org.dataone.integration.ContextAwareTestCaseDataone]
20151113-05:13:57: [INFO]: rest call info: POST https://mn-dev-ucsb-2.test.dataone.org/metacat/d1/mn/v2/object; MMP message has: ParamPart:pid = testUpdateSystemMetadata_ObsoletedByFail_2015316211356530; FilePart:object = /tmp/mmp.output.6131516959758082644.tmp (17181 bytes); FilePart:sysmeta = /tmp/mmp.output.2585621230268513075.tmp (983 bytes);  [org.dataone.client.rest.RestClient]
20151113-05:13:57: [INFO]: object created.  pid = testUpdateSystemMetadata_ObsoletedByFail_2015316211356530 [org.dataone.integration.ContextAwareTestCaseDataone]
20151113-05:14:09: [INFO]: rest call info: PUT https://mn-dev-ucsb-2.test.dataone.org/metacat/d1/mn/v2/object/testUpdateSystemMetadata_ObsoletedByFail_2015316211356530; MMP message has: ParamPart:newPid = testUpdateSystemMetadata_ObsoletedByFail_2015316211356532; FilePart:object = /tmp/mmp.output.6948563276906264131.tmp (17181 bytes); FilePart:sysmeta = /tmp/mmp.output.8378819278646790746.tmp (786 bytes);  [org.dataone.client.rest.RestClient]
20151113-05:14:09: [INFO]: certificate directory: /etc/dataone/client/testClientCerts/ [org.dataone.integration.ContextAwareTestCaseDataone]
20151113-05:14:09: [INFO]: certificate filename: cnDevUNM2 [org.dataone.integration.ContextAwareTestCaseDataone]
20151113-05:14:09: [INFO]: client setup as Subject: CN=urn:node:cnDevUNM2,DC=dataone,DC=org [org.dataone.integration.ContextAwareTestCaseDataone]
20151113-05:14:09: [INFO]: creating a test object.  pid = testUpdateSystemMetadata_ObsoletedByFail_2015316211356533 on https://mn-dev-ucsb-2.test.dataone.org/metacat/d1/mn/v2 [org.dataone.integration.ContextAwareTestCaseDataone]
20151113-05:14:09: [INFO]: SystemMetadata for pid: testUpdateSystemMetadata_ObsoletedByFail_2015316211356533
<?xml version="1.0" encoding="UTF-8"?><d1_v2.0:systemMetadata xmlns:d1_v2.0="http://ns.dataone.org/service/types/v2.0" xmlns:d1="http://ns.dataone.org/service/types/v1"><serialVersion>1</serialVersion><identifier>testUpdateSystemMetadata_ObsoletedByFail_2015316211356533</identifier><formatId>eml://ecoinformatics.org/eml-2.0.1</formatId><size>17181</size><checksum algorithm="MD5">03ce09c6b4c3efc1681f3023402998a2</checksum><submitter>CN=urn:node:cnDevUNM2,DC=dataone,DC=org</submitter><rightsHolder>CN=testRightsHolder,DC=dataone,DC=org</rightsHolder><accessPolicy><allow><subject>CN=testRightsHolder,DC=dataone,DC=org</subject><permission>changePermission</permission></allow></accessPolicy><dateUploaded>2015-11-13T05:14:09.094+00:00</dateUploaded><dateSysMetadataModified>2015-11-13T05:14:09.094+00:00</dateSysMetadataModified><originMemberNode>urn:node:mnDevUCSB2</originMemberNode><authoritativeMemberNode>urn:node:mnDevUCSB2</authoritativeMemberNode></d1_v2.0:systemMetadata> [org.dataone.integration.ContextAwareTestCaseDataone]
20151113-05:14:09: [INFO]: rest call info: POST https://mn-dev-ucsb-2.test.dataone.org/metacat/d1/mn/v2/object; MMP message has: ParamPart:pid = testUpdateSystemMetadata_ObsoletedByFail_2015316211356533; FilePart:object = /tmp/mmp.output.5264121356692571838.tmp (17181 bytes); FilePart:sysmeta = /tmp/mmp.output.2970539143671448581.tmp (983 bytes);  [org.dataone.client.rest.RestClient]
20151113-05:14:09: [INFO]: object created.  pid = testUpdateSystemMetadata_ObsoletedByFail_2015316211356533 [org.dataone.integration.ContextAwareTestCaseDataone]
20151113-05:14:20: [INFO]: rest call info: GET https://mn-dev-ucsb-2.test.dataone.org/metacat/d1/mn/v2/meta/testUpdateSystemMetadata_ObsoletedByFail_2015316211356530 [org.dataone.client.rest.RestClient]
20151113-05:14:20: [INFO]: rest call info: PUT https://mn-dev-ucsb-2.test.dataone.org/metacat/d1/mn/v2/meta; MMP message has: ParamPart:pid = testUpdateSystemMetadata_ObsoletedByFail_2015316211356530; FilePart:sysmeta = /tmp/mmp.output.5223053202441684800.tmp (1091 bytes);  [org.dataone.client.rest.RestClient]
20151113-05:14:20: [INFO]: 
***************** running test for testUpdateSystemMetadata_ObsoletedByFail(...) vs. node: https://mn-dev-unm-2.test.dataone.org/metacat/d1/mn ***************** [org.dataone.integration.ContextAwareTestCaseDataone]
20151113-05:14:20: [INFO]: certificate directory: /etc/dataone/client/testClientCerts/ [org.dataone.integration.ContextAwareTestCaseDataone]
20151113-05:14:20: [INFO]: certificate filename: cnDevUNM2 [org.dataone.integration.ContextAwareTestCaseDataone]
20151113-05:14:20: [INFO]: client setup as Subject: CN=urn:node:cnDevUNM2,DC=dataone,DC=org [org.dataone.integration.ContextAwareTestCaseDataone]
20151113-05:14:20: [INFO]: creating a test object.  pid = testUpdateSystemMetadata_ObsoletedByFail_2015316211420737 on https://mn-dev-unm-2.test.dataone.org/metacat/d1/mn/v2 [org.dataone.integration.ContextAwareTestCaseDataone]
20151113-05:14:20: [INFO]: SystemMetadata for pid: testUpdateSystemMetadata_ObsoletedByFail_2015316211420737
<?xml version="1.0" encoding="UTF-8"?><d1_v2.0:systemMetadata xmlns:d1_v2.0="http://ns.dataone.org/service/types/v2.0" xmlns:d1="http://ns.dataone.org/service/types/v1"><serialVersion>1</serialVersion><identifier>testUpdateSystemMetadata_ObsoletedByFail_2015316211420737</identifier><formatId>eml://ecoinformatics.org/eml-2.0.1</formatId><size>17181</size><checksum algorithm="MD5">03ce09c6b4c3efc1681f3023402998a2</checksum><submitter>CN=urn:node:cnDevUNM2,DC=dataone,DC=org</submitter><rightsHolder>CN=testRightsHolder,DC=dataone,DC=org</rightsHolder><accessPolicy><allow><subject>CN=testRightsHolder,DC=dataone,DC=org</subject><permission>changePermission</permission></allow></accessPolicy><dateUploaded>2015-11-13T05:14:20.756+00:00</dateUploaded><dateSysMetadataModified>2015-11-13T05:14:20.756+00:00</dateSysMetadataModified><originMemberNode>urn:node:mnDevUNM2</originMemberNode><authoritativeMemberNode>urn:node:mnDevUNM2</authoritativeMemberNode></d1_v2.0:systemMetadata> [org.dataone.integration.ContextAwareTestCaseDataone]
20151113-05:14:21: [INFO]: rest call info: POST https://mn-dev-unm-2.test.dataone.org/metacat/d1/mn/v2/object; MMP message has: ParamPart:pid = testUpdateSystemMetadata_ObsoletedByFail_2015316211420737; FilePart:object = /tmp/mmp.output.562983089972488705.tmp (17181 bytes); FilePart:sysmeta = /tmp/mmp.output.1578031573448704902.tmp (981 bytes);  [org.dataone.client.rest.RestClient]
20151113-05:14:21: [INFO]: object created.  pid = testUpdateSystemMetadata_ObsoletedByFail_2015316211420737 [org.dataone.integration.ContextAwareTestCaseDataone]
20151113-05:14:32: [INFO]: rest call info: PUT https://mn-dev-unm-2.test.dataone.org/metacat/d1/mn/v2/object/testUpdateSystemMetadata_ObsoletedByFail_2015316211420737; MMP message has: ParamPart:newPid = testUpdateSystemMetadata_ObsoletedByFail_2015316211420738; FilePart:object = /tmp/mmp.output.6598238962889139978.tmp (17181 bytes); FilePart:sysmeta = /tmp/mmp.output.8413047020028127251.tmp (786 bytes);  [org.dataone.client.rest.RestClient]
20151113-05:14:32: [INFO]: certificate directory: /etc/dataone/client/testClientCerts/ [org.dataone.integration.ContextAwareTestCaseDataone]
20151113-05:14:32: [INFO]: certificate filename: cnDevUNM2 [org.dataone.integration.ContextAwareTestCaseDataone]
20151113-05:14:33: [INFO]: client setup as Subject: CN=urn:node:cnDevUNM2,DC=dataone,DC=org [org.dataone.integration.ContextAwareTestCaseDataone]
20151113-05:14:33: [INFO]: creating a test object.  pid = testUpdateSystemMetadata_ObsoletedByFail_2015316211420740 on https://mn-dev-unm-2.test.dataone.org/metacat/d1/mn/v2 [org.dataone.integration.ContextAwareTestCaseDataone]
20151113-05:14:33: [INFO]: SystemMetadata for pid: testUpdateSystemMetadata_ObsoletedByFail_2015316211420740
<?xml version="1.0" encoding="UTF-8"?><d1_v2.0:systemMetadata xmlns:d1_v2.0="http://ns.dataone.org/service/types/v2.0" xmlns:d1="http://ns.dataone.org/service/types/v1"><serialVersion>1</serialVersion><identifier>testUpdateSystemMetadata_ObsoletedByFail_2015316211420740</identifier><formatId>eml://ecoinformatics.org/eml-2.0.1</formatId><size>17181</size><checksum algorithm="MD5">03ce09c6b4c3efc1681f3023402998a2</checksum><submitter>CN=urn:node:cnDevUNM2,DC=dataone,DC=org</submitter><rightsHolder>CN=testRightsHolder,DC=dataone,DC=org</rightsHolder><accessPolicy><allow><subject>CN=testRightsHolder,DC=dataone,DC=org</subject><permission>changePermission</permission></allow></accessPolicy><dateUploaded>2015-11-13T05:14:33.010+00:00</dateUploaded><dateSysMetadataModified>2015-11-13T05:14:33.010+00:00</dateSysMetadataModified><originMemberNode>urn:node:mnDevUNM2</originMemberNode><authoritativeMemberNode>urn:node:mnDevUNM2</authoritativeMemberNode></d1_v2.0:systemMetadata> [org.dataone.integration.ContextAwareTestCaseDataone]
20151113-05:14:33: [INFO]: rest call info: POST https://mn-dev-unm-2.test.dataone.org/metacat/d1/mn/v2/object; MMP message has: ParamPart:pid = testUpdateSystemMetadata_ObsoletedByFail_2015316211420740; FilePart:object = /tmp/mmp.output.7310524241385005410.tmp (17181 bytes); FilePart:sysmeta = /tmp/mmp.output.1473786338819383625.tmp (981 bytes);  [org.dataone.client.rest.RestClient]
20151113-05:14:33: [INFO]: object created.  pid = testUpdateSystemMetadata_ObsoletedByFail_2015316211420740 [org.dataone.integration.ContextAwareTestCaseDataone]
20151113-05:14:44: [INFO]: rest call info: GET https://mn-dev-unm-2.test.dataone.org/metacat/d1/mn/v2/meta/testUpdateSystemMetadata_ObsoletedByFail_2015316211420737 [org.dataone.client.rest.RestClient]
20151113-05:14:44: [INFO]: rest call info: PUT https://mn-dev-unm-2.test.dataone.org/metacat/d1/mn/v2/meta; MMP message has: ParamPart:pid = testUpdateSystemMetadata_ObsoletedByFail_2015316211420737; FilePart:sysmeta = /tmp/mmp.output.5085223902652357203.tmp (1089 bytes);  [org.dataone.client.rest.RestClient]
20151113-05:14:44: [INFO]: **************************************************** [org.dataone.integration.ContextAwareTestCaseDataone]
20151113-05:14:44: [INFO]: ***  context label:   DEV2 [org.dataone.integration.ContextAwareTestCaseDataone]
20151113-05:14:44: [INFO]: **************************************************** [org.dataone.integration.ContextAwareTestCaseDataone]
20151113-05:14:44: [INFO]: **************************************************** [org.dataone.integration.ContextAwareTestCaseDataone]
20151113-05:14:44: [INFO]: rest call info: GET https://mn-dev-ucsb-1.test.dataone.org/metacat/d1/mn/v2/monitor/ping [org.dataone.client.rest.RestClient]
20151113-05:14:44: [INFO]: MN excluded from test: https://mn-dev-ucsb-1.test.dataone.org/metacat/d1/mn [org.dataone.integration.ContextAwareTestCaseDataone]
20151113-05:14:44: [INFO]: rest call info: GET https://mn-dev-ucsb-2.test.dataone.org/metacat/d1/mn/v2/monitor/ping [org.dataone.client.rest.RestClient]
20151113-05:14:44: [INFO]: MN included in test: https://mn-dev-ucsb-2.test.dataone.org/metacat/d1/mn [org.dataone.integration.ContextAwareTestCaseDataone]
20151113-05:14:44: [INFO]: rest call info: GET https://mn-dev-unm-1.test.dataone.org/metacat/d1/mn/v2/monitor/ping [org.dataone.client.rest.RestClient]
20151113-05:14:44: [INFO]: MN excluded from test: https://mn-dev-unm-1.test.dataone.org/metacat/d1/mn [org.dataone.integration.ContextAwareTestCaseDataone]
20151113-05:14:44: [INFO]: rest call info: GET https://mn-dev-unm-2.test.dataone.org/metacat/d1/mn/v2/monitor/ping [org.dataone.client.rest.RestClient]
20151113-05:14:44: [INFO]: MN included in test: https://mn-dev-unm-2.test.dataone.org/metacat/d1/mn [org.dataone.integration.ContextAwareTestCaseDataone]
20151113-05:14:44: [INFO]: 
***************** running test for testUpdateSystemMetadata_MutableObsoletedBy(...) vs. node: https://mn-dev-ucsb-2.test.dataone.org/metacat/d1/mn ***************** [org.dataone.integration.ContextAwareTestCaseDataone]
20151113-05:14:44: [INFO]: certificate directory: /etc/dataone/client/testClientCerts/ [org.dataone.integration.ContextAwareTestCaseDataone]
20151113-05:14:44: [INFO]: certificate filename: cnDevUNM2 [org.dataone.integration.ContextAwareTestCaseDataone]
20151113-05:14:44: [INFO]: client setup as Subject: CN=urn:node:cnDevUNM2,DC=dataone,DC=org [org.dataone.integration.ContextAwareTestCaseDataone]
20151113-05:14:44: [INFO]: creating a test object.  pid = testUpdateSystemMetadata_MutableObsoletedBy_2015316211444563 on https://mn-dev-ucsb-2.test.dataone.org/metacat/d1/mn/v2 [org.dataone.integration.ContextAwareTestCaseDataone]
20151113-05:14:44: [INFO]: SystemMetadata for pid: testUpdateSystemMetadata_MutableObsoletedBy_2015316211444563
<?xml version="1.0" encoding="UTF-8"?><d1_v2.0:systemMetadata xmlns:d1_v2.0="http://ns.dataone.org/service/types/v2.0" xmlns:d1="http://ns.dataone.org/service/types/v1"><serialVersion>1</serialVersion><identifier>testUpdateSystemMetadata_MutableObsoletedBy_2015316211444563</identifier><formatId>eml://ecoinformatics.org/eml-2.0.1</formatId><size>17181</size><checksum algorithm="MD5">03ce09c6b4c3efc1681f3023402998a2</checksum><submitter>CN=urn:node:cnDevUNM2,DC=dataone,DC=org</submitter><rightsHolder>CN=testRightsHolder,DC=dataone,DC=org</rightsHolder><accessPolicy><allow><subject>CN=testRightsHolder,DC=dataone,DC=org</subject><permission>changePermission</permission></allow></accessPolicy><dateUploaded>2015-11-13T05:14:44.584+00:00</dateUploaded><dateSysMetadataModified>2015-11-13T05:14:44.584+00:00</dateSysMetadataModified><originMemberNode>urn:node:mnDevUCSB2</originMemberNode><authoritativeMemberNode>urn:node:mnDevUCSB2</authoritativeMemberNode></d1_v2.0:systemMetadata> [org.dataone.integration.ContextAwareTestCaseDataone]
20151113-05:14:46: [INFO]: rest call info: POST https://mn-dev-ucsb-2.test.dataone.org/metacat/d1/mn/v2/object; MMP message has: ParamPart:pid = testUpdateSystemMetadata_MutableObsoletedBy_2015316211444563; FilePart:object = /tmp/mmp.output.6865489789845961369.tmp (17181 bytes); FilePart:sysmeta = /tmp/mmp.output.4990478121043060799.tmp (986 bytes);  [org.dataone.client.rest.RestClient]
20151113-05:14:46: [INFO]: object created.  pid = testUpdateSystemMetadata_MutableObsoletedBy_2015316211444563 [org.dataone.integration.ContextAwareTestCaseDataone]
20151113-05:14:46: [INFO]: certificate directory: /etc/dataone/client/testClientCerts/ [org.dataone.integration.ContextAwareTestCaseDataone]
20151113-05:14:46: [INFO]: certificate filename: cnDevUNM2 [org.dataone.integration.ContextAwareTestCaseDataone]
20151113-05:14:46: [INFO]: client setup as Subject: CN=urn:node:cnDevUNM2,DC=dataone,DC=org [org.dataone.integration.ContextAwareTestCaseDataone]
20151113-05:14:46: [INFO]: creating a test object.  pid = testUpdateSystemMetadata_MutableObsoletedBy_2015316211444565 on https://mn-dev-ucsb-2.test.dataone.org/metacat/d1/mn/v2 [org.dataone.integration.ContextAwareTestCaseDataone]
20151113-05:14:46: [INFO]: SystemMetadata for pid: testUpdateSystemMetadata_MutableObsoletedBy_2015316211444565
<?xml version="1.0" encoding="UTF-8"?><d1_v2.0:systemMetadata xmlns:d1_v2.0="http://ns.dataone.org/service/types/v2.0" xmlns:d1="http://ns.dataone.org/service/types/v1"><serialVersion>1</serialVersion><identifier>testUpdateSystemMetadata_MutableObsoletedBy_2015316211444565</identifier><formatId>eml://ecoinformatics.org/eml-2.0.1</formatId><size>17181</size><checksum algorithm="MD5">03ce09c6b4c3efc1681f3023402998a2</checksum><submitter>CN=urn:node:cnDevUNM2,DC=dataone,DC=org</submitter><rightsHolder>CN=testRightsHolder,DC=dataone,DC=org</rightsHolder><accessPolicy><allow><subject>CN=testRightsHolder,DC=dataone,DC=org</subject><permission>changePermission</permission></allow></accessPolicy><dateUploaded>2015-11-13T05:14:46.031+00:00</dateUploaded><dateSysMetadataModified>2015-11-13T05:14:46.031+00:00</dateSysMetadataModified><originMemberNode>urn:node:mnDevUCSB2</originMemberNode><authoritativeMemberNode>urn:node:mnDevUCSB2</authoritativeMemberNode></d1_v2.0:systemMetadata> [org.dataone.integration.ContextAwareTestCaseDataone]
20151113-05:14:46: [INFO]: rest call info: POST https://mn-dev-ucsb-2.test.dataone.org/metacat/d1/mn/v2/object; MMP message has: ParamPart:pid = testUpdateSystemMetadata_MutableObsoletedBy_2015316211444565; FilePart:object = /tmp/mmp.output.136789695998595087.tmp (17181 bytes); FilePart:sysmeta = /tmp/mmp.output.3023174251604691052.tmp (986 bytes);  [org.dataone.client.rest.RestClient]
20151113-05:14:46: [INFO]: object created.  pid = testUpdateSystemMetadata_MutableObsoletedBy_2015316211444565 [org.dataone.integration.ContextAwareTestCaseDataone]
20151113-05:14:57: [INFO]: rest call info: GET https://mn-dev-ucsb-2.test.dataone.org/metacat/d1/mn/v2/meta/testUpdateSystemMetadata_MutableObsoletedBy_2015316211444563 [org.dataone.client.rest.RestClient]
20151113-05:15:03: [INFO]: rest call info: PUT https://mn-dev-ucsb-2.test.dataone.org/metacat/d1/mn/v2/meta; MMP message has: ParamPart:pid = testUpdateSystemMetadata_MutableObsoletedBy_2015316211444563; FilePart:sysmeta = /tmp/mmp.output.2125238380607109405.tmp (1097 bytes);  [org.dataone.client.rest.RestClient]
20151113-05:15:03: [INFO]: 
***************** running test for testUpdateSystemMetadata_MutableObsoletedBy(...) vs. node: https://mn-dev-unm-2.test.dataone.org/metacat/d1/mn ***************** [org.dataone.integration.ContextAwareTestCaseDataone]
20151113-05:15:03: [INFO]: certificate directory: /etc/dataone/client/testClientCerts/ [org.dataone.integration.ContextAwareTestCaseDataone]
20151113-05:15:03: [INFO]: certificate filename: cnDevUNM2 [org.dataone.integration.ContextAwareTestCaseDataone]
20151113-05:15:03: [INFO]: client setup as Subject: CN=urn:node:cnDevUNM2,DC=dataone,DC=org [org.dataone.integration.ContextAwareTestCaseDataone]
20151113-05:15:03: [INFO]: creating a test object.  pid = testUpdateSystemMetadata_MutableObsoletedBy_20153162115395 on https://mn-dev-unm-2.test.dataone.org/metacat/d1/mn/v2 [org.dataone.integration.ContextAwareTestCaseDataone]
20151113-05:15:03: [INFO]: SystemMetadata for pid: testUpdateSystemMetadata_MutableObsoletedBy_20153162115395
<?xml version="1.0" encoding="UTF-8"?><d1_v2.0:systemMetadata xmlns:d1_v2.0="http://ns.dataone.org/service/types/v2.0" xmlns:d1="http://ns.dataone.org/service/types/v1"><serialVersion>1</serialVersion><identifier>testUpdateSystemMetadata_MutableObsoletedBy_20153162115395</identifier><formatId>eml://ecoinformatics.org/eml-2.0.1</formatId><size>17181</size><checksum algorithm="MD5">03ce09c6b4c3efc1681f3023402998a2</checksum><submitter>CN=urn:node:cnDevUNM2,DC=dataone,DC=org</submitter><rightsHolder>CN=testRightsHolder,DC=dataone,DC=org</rightsHolder><accessPolicy><allow><subject>CN=testRightsHolder,DC=dataone,DC=org</subject><permission>changePermission</permission></allow></accessPolicy><dateUploaded>2015-11-13T05:15:03.110+00:00</dateUploaded><dateSysMetadataModified>2015-11-13T05:15:03.110+00:00</dateSysMetadataModified><originMemberNode>urn:node:mnDevUNM2</originMemberNode><authoritativeMemberNode>urn:node:mnDevUNM2</authoritativeMemberNode></d1_v2.0:systemMetadata> [org.dataone.integration.ContextAwareTestCaseDataone]
20151113-05:15:03: [INFO]: rest call info: POST https://mn-dev-unm-2.test.dataone.org/metacat/d1/mn/v2/object; MMP message has: ParamPart:pid = testUpdateSystemMetadata_MutableObsoletedBy_20153162115395; FilePart:object = /tmp/mmp.output.3529438546023392265.tmp (17181 bytes); FilePart:sysmeta = /tmp/mmp.output.3186477404225399363.tmp (982 bytes);  [org.dataone.client.rest.RestClient]
20151113-05:15:03: [INFO]: object created.  pid = testUpdateSystemMetadata_MutableObsoletedBy_20153162115395 [org.dataone.integration.ContextAwareTestCaseDataone]
20151113-05:15:04: [INFO]: certificate directory: /etc/dataone/client/testClientCerts/ [org.dataone.integration.ContextAwareTestCaseDataone]
20151113-05:15:04: [INFO]: certificate filename: cnDevUNM2 [org.dataone.integration.ContextAwareTestCaseDataone]
20151113-05:15:04: [INFO]: client setup as Subject: CN=urn:node:cnDevUNM2,DC=dataone,DC=org [org.dataone.integration.ContextAwareTestCaseDataone]
20151113-05:15:04: [INFO]: creating a test object.  pid = testUpdateSystemMetadata_MutableObsoletedBy_20153162115396 on https://mn-dev-unm-2.test.dataone.org/metacat/d1/mn/v2 [org.dataone.integration.ContextAwareTestCaseDataone]
20151113-05:15:04: [INFO]: SystemMetadata for pid: testUpdateSystemMetadata_MutableObsoletedBy_20153162115396
<?xml version="1.0" encoding="UTF-8"?><d1_v2.0:systemMetadata xmlns:d1_v2.0="http://ns.dataone.org/service/types/v2.0" xmlns:d1="http://ns.dataone.org/service/types/v1"><serialVersion>1</serialVersion><identifier>testUpdateSystemMetadata_MutableObsoletedBy_20153162115396</identifier><formatId>eml://ecoinformatics.org/eml-2.0.1</formatId><size>17181</size><checksum algorithm="MD5">03ce09c6b4c3efc1681f3023402998a2</checksum><submitter>CN=urn:node:cnDevUNM2,DC=dataone,DC=org</submitter><rightsHolder>CN=testRightsHolder,DC=dataone,DC=org</rightsHolder><accessPolicy><allow><subject>CN=testRightsHolder,DC=dataone,DC=org</subject><permission>changePermission</permission></allow></accessPolicy><dateUploaded>2015-11-13T05:15:04.015+00:00</dateUploaded><dateSysMetadataModified>2015-11-13T05:15:04.015+00:00</dateSysMetadataModified><originMemberNode>urn:node:mnDevUNM2</originMemberNode><authoritativeMemberNode>urn:node:mnDevUNM2</authoritativeMemberNode></d1_v2.0:systemMetadata> [org.dataone.integration.ContextAwareTestCaseDataone]
20151113-05:15:04: [INFO]: rest call info: POST https://mn-dev-unm-2.test.dataone.org/metacat/d1/mn/v2/object; MMP message has: ParamPart:pid = testUpdateSystemMetadata_MutableObsoletedBy_20153162115396; FilePart:object = /tmp/mmp.output.5287387909214400754.tmp (17181 bytes); FilePart:sysmeta = /tmp/mmp.output.1149085515715400626.tmp (982 bytes);  [org.dataone.client.rest.RestClient]
20151113-05:15:04: [INFO]: object created.  pid = testUpdateSystemMetadata_MutableObsoletedBy_20153162115396 [org.dataone.integration.ContextAwareTestCaseDataone]
20151113-05:15:15: [INFO]: rest call info: GET https://mn-dev-unm-2.test.dataone.org/metacat/d1/mn/v2/meta/testUpdateSystemMetadata_MutableObsoletedBy_20153162115395 [org.dataone.client.rest.RestClient]
20151113-05:15:20: [INFO]: rest call info: PUT https://mn-dev-unm-2.test.dataone.org/metacat/d1/mn/v2/meta; MMP message has: ParamPart:pid = testUpdateSystemMetadata_MutableObsoletedBy_20153162115395; FilePart:sysmeta = /tmp/mmp.output.731381665012861758.tmp (1091 bytes);  [org.dataone.client.rest.RestClient]
20151113-05:15:20: [INFO]: **************************************************** [org.dataone.integration.ContextAwareTestCaseDataone]
20151113-05:15:20: [INFO]: ***  context label:   DEV2 [org.dataone.integration.ContextAwareTestCaseDataone]
20151113-05:15:20: [INFO]: **************************************************** [org.dataone.integration.ContextAwareTestCaseDataone]
20151113-05:15:20: [INFO]: **************************************************** [org.dataone.integration.ContextAwareTestCaseDataone]
20151113-05:15:20: [INFO]: rest call info: GET https://mn-dev-ucsb-1.test.dataone.org/metacat/d1/mn/v2/monitor/ping [org.dataone.client.rest.RestClient]
20151113-05:15:20: [INFO]: MN excluded from test: https://mn-dev-ucsb-1.test.dataone.org/metacat/d1/mn [org.dataone.integration.ContextAwareTestCaseDataone]
20151113-05:15:21: [INFO]: rest call info: GET https://mn-dev-ucsb-2.test.dataone.org/metacat/d1/mn/v2/monitor/ping [org.dataone.client.rest.RestClient]
20151113-05:15:21: [INFO]: MN included in test: https://mn-dev-ucsb-2.test.dataone.org/metacat/d1/mn [org.dataone.integration.ContextAwareTestCaseDataone]
20151113-05:15:21: [INFO]: rest call info: GET https://mn-dev-unm-1.test.dataone.org/metacat/d1/mn/v2/monitor/ping [org.dataone.client.rest.RestClient]
20151113-05:15:21: [INFO]: MN excluded from test: https://mn-dev-unm-1.test.dataone.org/metacat/d1/mn [org.dataone.integration.ContextAwareTestCaseDataone]
20151113-05:15:21: [INFO]: rest call info: GET https://mn-dev-unm-2.test.dataone.org/metacat/d1/mn/v2/monitor/ping [org.dataone.client.rest.RestClient]
20151113-05:15:21: [INFO]: MN included in test: https://mn-dev-unm-2.test.dataone.org/metacat/d1/mn [org.dataone.integration.ContextAwareTestCaseDataone]
20151113-05:15:21: [INFO]: 
***************** running test for testUpdateSystemMetadata_MutableObsoletes(...) vs. node: https://mn-dev-ucsb-2.test.dataone.org/metacat/d1/mn ***************** [org.dataone.integration.ContextAwareTestCaseDataone]
20151113-05:15:21: [INFO]: certificate directory: /etc/dataone/client/testClientCerts/ [org.dataone.integration.ContextAwareTestCaseDataone]
20151113-05:15:21: [INFO]: certificate filename: cnDevUNM2 [org.dataone.integration.ContextAwareTestCaseDataone]
20151113-05:15:21: [INFO]: client setup as Subject: CN=urn:node:cnDevUNM2,DC=dataone,DC=org [org.dataone.integration.ContextAwareTestCaseDataone]
20151113-05:15:21: [INFO]: creating a test object.  pid = testUpdateSystemMetadata_MutableObsoletes_2015316211521547 on https://mn-dev-ucsb-2.test.dataone.org/metacat/d1/mn/v2 [org.dataone.integration.ContextAwareTestCaseDataone]
20151113-05:15:21: [INFO]: SystemMetadata for pid: testUpdateSystemMetadata_MutableObsoletes_2015316211521547
<?xml version="1.0" encoding="UTF-8"?><d1_v2.0:systemMetadata xmlns:d1_v2.0="http://ns.dataone.org/service/types/v2.0" xmlns:d1="http://ns.dataone.org/service/types/v1"><serialVersion>1</serialVersion><identifier>testUpdateSystemMetadata_MutableObsoletes_2015316211521547</identifier><formatId>eml://ecoinformatics.org/eml-2.0.1</formatId><size>17181</size><checksum algorithm="MD5">03ce09c6b4c3efc1681f3023402998a2</checksum><submitter>CN=urn:node:cnDevUNM2,DC=dataone,DC=org</submitter><rightsHolder>CN=testRightsHolder,DC=dataone,DC=org</rightsHolder><accessPolicy><allow><subject>CN=testRightsHolder,DC=dataone,DC=org</subject><permission>changePermission</permission></allow></accessPolicy><dateUploaded>2015-11-13T05:15:21.563+00:00</dateUploaded><dateSysMetadataModified>2015-11-13T05:15:21.563+00:00</dateSysMetadataModified><originMemberNode>urn:node:mnDevUCSB2</originMemberNode><authoritativeMemberNode>urn:node:mnDevUCSB2</authoritativeMemberNode></d1_v2.0:systemMetadata> [org.dataone.integration.ContextAwareTestCaseDataone]
20151113-05:15:23: [INFO]: rest call info: POST https://mn-dev-ucsb-2.test.dataone.org/metacat/d1/mn/v2/object; MMP message has: ParamPart:pid = testUpdateSystemMetadata_MutableObsoletes_2015316211521547; FilePart:object = /tmp/mmp.output.5594844821719619476.tmp (17181 bytes); FilePart:sysmeta = /tmp/mmp.output.4446244578149619580.tmp (984 bytes);  [org.dataone.client.rest.RestClient]
20151113-05:15:23: [INFO]: object created.  pid = testUpdateSystemMetadata_MutableObsoletes_2015316211521547 [org.dataone.integration.ContextAwareTestCaseDataone]
20151113-05:15:23: [INFO]: certificate directory: /etc/dataone/client/testClientCerts/ [org.dataone.integration.ContextAwareTestCaseDataone]
20151113-05:15:23: [INFO]: certificate filename: cnDevUNM2 [org.dataone.integration.ContextAwareTestCaseDataone]
20151113-05:15:23: [INFO]: client setup as Subject: CN=urn:node:cnDevUNM2,DC=dataone,DC=org [org.dataone.integration.ContextAwareTestCaseDataone]
20151113-05:15:23: [INFO]: creating a test object.  pid = testUpdateSystemMetadata_MutableObsoletes_2015316211521548 on https://mn-dev-ucsb-2.test.dataone.org/metacat/d1/mn/v2 [org.dataone.integration.ContextAwareTestCaseDataone]
20151113-05:15:23: [INFO]: SystemMetadata for pid: testUpdateSystemMetadata_MutableObsoletes_2015316211521548
<?xml version="1.0" encoding="UTF-8"?><d1_v2.0:systemMetadata xmlns:d1_v2.0="http://ns.dataone.org/service/types/v2.0" xmlns:d1="http://ns.dataone.org/service/types/v1"><serialVersion>1</serialVersion><identifier>testUpdateSystemMetadata_MutableObsoletes_2015316211521548</identifier><formatId>eml://ecoinformatics.org/eml-2.0.1</formatId><size>17181</size><checksum algorithm="MD5">03ce09c6b4c3efc1681f3023402998a2</checksum><submitter>CN=urn:node:cnDevUNM2,DC=dataone,DC=org</submitter><rightsHolder>CN=testRightsHolder,DC=dataone,DC=org</rightsHolder><accessPolicy><allow><subject>CN=testRightsHolder,DC=dataone,DC=org</subject><permission>changePermission</permission></allow></accessPolicy><dateUploaded>2015-11-13T05:15:23.075+00:00</dateUploaded><dateSysMetadataModified>2015-11-13T05:15:23.075+00:00</dateSysMetadataModified><originMemberNode>urn:node:mnDevUCSB2</originMemberNode><authoritativeMemberNode>urn:node:mnDevUCSB2</authoritativeMemberNode></d1_v2.0:systemMetadata> [org.dataone.integration.ContextAwareTestCaseDataone]
20151113-05:15:24: [INFO]: rest call info: POST https://mn-dev-ucsb-2.test.dataone.org/metacat/d1/mn/v2/object; MMP message has: ParamPart:pid = testUpdateSystemMetadata_MutableObsoletes_2015316211521548; FilePart:object = /tmp/mmp.output.3992841547797607116.tmp (17181 bytes); FilePart:sysmeta = /tmp/mmp.output.4477520238935523831.tmp (984 bytes);  [org.dataone.client.rest.RestClient]
20151113-05:15:24: [INFO]: object created.  pid = testUpdateSystemMetadata_MutableObsoletes_2015316211521548 [org.dataone.integration.ContextAwareTestCaseDataone]
20151113-05:15:34: [INFO]: rest call info: GET https://mn-dev-ucsb-2.test.dataone.org/metacat/d1/mn/v2/meta/testUpdateSystemMetadata_MutableObsoletes_2015316211521548 [org.dataone.client.rest.RestClient]
20151113-05:15:40: [INFO]: rest call info: PUT https://mn-dev-ucsb-2.test.dataone.org/metacat/d1/mn/v2/meta; MMP message has: ParamPart:pid = testUpdateSystemMetadata_MutableObsoletes_2015316211521548; FilePart:sysmeta = /tmp/mmp.output.8796951644630260545.tmp (1089 bytes);  [org.dataone.client.rest.RestClient]
20151113-05:15:40: [INFO]: 
***************** running test for testUpdateSystemMetadata_MutableObsoletes(...) vs. node: https://mn-dev-unm-2.test.dataone.org/metacat/d1/mn ***************** [org.dataone.integration.ContextAwareTestCaseDataone]
20151113-05:15:40: [INFO]: certificate directory: /etc/dataone/client/testClientCerts/ [org.dataone.integration.ContextAwareTestCaseDataone]
20151113-05:15:40: [INFO]: certificate filename: cnDevUNM2 [org.dataone.integration.ContextAwareTestCaseDataone]
20151113-05:15:40: [INFO]: client setup as Subject: CN=urn:node:cnDevUNM2,DC=dataone,DC=org [org.dataone.integration.ContextAwareTestCaseDataone]
20151113-05:15:40: [INFO]: creating a test object.  pid = testUpdateSystemMetadata_MutableObsoletes_20153162115404 on https://mn-dev-unm-2.test.dataone.org/metacat/d1/mn/v2 [org.dataone.integration.ContextAwareTestCaseDataone]
20151113-05:15:40: [INFO]: SystemMetadata for pid: testUpdateSystemMetadata_MutableObsoletes_20153162115404
<?xml version="1.0" encoding="UTF-8"?><d1_v2.0:systemMetadata xmlns:d1_v2.0="http://ns.dataone.org/service/types/v2.0" xmlns:d1="http://ns.dataone.org/service/types/v1"><serialVersion>1</serialVersion><identifier>testUpdateSystemMetadata_MutableObsoletes_20153162115404</identifier><formatId>eml://ecoinformatics.org/eml-2.0.1</formatId><size>17181</size><checksum algorithm="MD5">03ce09c6b4c3efc1681f3023402998a2</checksum><submitter>CN=urn:node:cnDevUNM2,DC=dataone,DC=org</submitter><rightsHolder>CN=testRightsHolder,DC=dataone,DC=org</rightsHolder><accessPolicy><allow><subject>CN=testRightsHolder,DC=dataone,DC=org</subject><permission>changePermission</permission></allow></accessPolicy><dateUploaded>2015-11-13T05:15:40.017+00:00</dateUploaded><dateSysMetadataModified>2015-11-13T05:15:40.017+00:00</dateSysMetadataModified><originMemberNode>urn:node:mnDevUNM2</originMemberNode><authoritativeMemberNode>urn:node:mnDevUNM2</authoritativeMemberNode></d1_v2.0:systemMetadata> [org.dataone.integration.ContextAwareTestCaseDataone]
20151113-05:15:40: [INFO]: rest call info: POST https://mn-dev-unm-2.test.dataone.org/metacat/d1/mn/v2/object; MMP message has: ParamPart:pid = testUpdateSystemMetadata_MutableObsoletes_20153162115404; FilePart:object = /tmp/mmp.output.3433611739062024276.tmp (17181 bytes); FilePart:sysmeta = /tmp/mmp.output.2072529559897701847.tmp (980 bytes);  [org.dataone.client.rest.RestClient]
20151113-05:15:40: [INFO]: object created.  pid = testUpdateSystemMetadata_MutableObsoletes_20153162115404 [org.dataone.integration.ContextAwareTestCaseDataone]
20151113-05:15:40: [INFO]: certificate directory: /etc/dataone/client/testClientCerts/ [org.dataone.integration.ContextAwareTestCaseDataone]
20151113-05:15:40: [INFO]: certificate filename: cnDevUNM2 [org.dataone.integration.ContextAwareTestCaseDataone]
20151113-05:15:40: [INFO]: client setup as Subject: CN=urn:node:cnDevUNM2,DC=dataone,DC=org [org.dataone.integration.ContextAwareTestCaseDataone]
20151113-05:15:40: [INFO]: creating a test object.  pid = testUpdateSystemMetadata_MutableObsoletes_20153162115405 on https://mn-dev-unm-2.test.dataone.org/metacat/d1/mn/v2 [org.dataone.integration.ContextAwareTestCaseDataone]
20151113-05:15:40: [INFO]: SystemMetadata for pid: testUpdateSystemMetadata_MutableObsoletes_20153162115405
<?xml version="1.0" encoding="UTF-8"?><d1_v2.0:systemMetadata xmlns:d1_v2.0="http://ns.dataone.org/service/types/v2.0" xmlns:d1="http://ns.dataone.org/service/types/v1"><serialVersion>1</serialVersion><identifier>testUpdateSystemMetadata_MutableObsoletes_20153162115405</identifier><formatId>eml://ecoinformatics.org/eml-2.0.1</formatId><size>17181</size><checksum algorithm="MD5">03ce09c6b4c3efc1681f3023402998a2</checksum><submitter>CN=urn:node:cnDevUNM2,DC=dataone,DC=org</submitter><rightsHolder>CN=testRightsHolder,DC=dataone,DC=org</rightsHolder><accessPolicy><allow><subject>CN=testRightsHolder,DC=dataone,DC=org</subject><permission>changePermission</permission></allow></accessPolicy><dateUploaded>2015-11-13T05:15:40.974+00:00</dateUploaded><dateSysMetadataModified>2015-11-13T05:15:40.974+00:00</dateSysMetadataModified><originMemberNode>urn:node:mnDevUNM2</originMemberNode><authoritativeMemberNode>urn:node:mnDevUNM2</authoritativeMemberNode></d1_v2.0:systemMetadata> [org.dataone.integration.ContextAwareTestCaseDataone]
20151113-05:15:41: [INFO]: rest call info: POST https://mn-dev-unm-2.test.dataone.org/metacat/d1/mn/v2/object; MMP message has: ParamPart:pid = testUpdateSystemMetadata_MutableObsoletes_20153162115405; FilePart:object = /tmp/mmp.output.7186144649835026018.tmp (17181 bytes); FilePart:sysmeta = /tmp/mmp.output.7518496986480713186.tmp (980 bytes);  [org.dataone.client.rest.RestClient]
20151113-05:15:41: [INFO]: object created.  pid = testUpdateSystemMetadata_MutableObsoletes_20153162115405 [org.dataone.integration.ContextAwareTestCaseDataone]
20151113-05:15:52: [INFO]: rest call info: GET https://mn-dev-unm-2.test.dataone.org/metacat/d1/mn/v2/meta/testUpdateSystemMetadata_MutableObsoletes_20153162115405 [org.dataone.client.rest.RestClient]
20151113-05:15:57: [INFO]: rest call info: PUT https://mn-dev-unm-2.test.dataone.org/metacat/d1/mn/v2/meta; MMP message has: ParamPart:pid = testUpdateSystemMetadata_MutableObsoletes_20153162115405; FilePart:sysmeta = /tmp/mmp.output.6891571876078278865.tmp (1083 bytes);  [org.dataone.client.rest.RestClient]
20151113-05:15:57: [INFO]: **************************************************** [org.dataone.integration.ContextAwareTestCaseDataone]
20151113-05:15:57: [INFO]: ***  context label:   DEV2 [org.dataone.integration.ContextAwareTestCaseDataone]
20151113-05:15:57: [INFO]: **************************************************** [org.dataone.integration.ContextAwareTestCaseDataone]
20151113-05:15:57: [INFO]: **************************************************** [org.dataone.integration.ContextAwareTestCaseDataone]
20151113-05:15:57: [INFO]: rest call info: GET https://mn-dev-ucsb-1.test.dataone.org/metacat/d1/mn/v2/monitor/ping [org.dataone.client.rest.RestClient]
20151113-05:15:57: [INFO]: MN excluded from test: https://mn-dev-ucsb-1.test.dataone.org/metacat/d1/mn [org.dataone.integration.ContextAwareTestCaseDataone]
20151113-05:15:57: [INFO]: rest call info: GET https://mn-dev-ucsb-2.test.dataone.org/metacat/d1/mn/v2/monitor/ping [org.dataone.client.rest.RestClient]
20151113-05:15:57: [INFO]: MN included in test: https://mn-dev-ucsb-2.test.dataone.org/metacat/d1/mn [org.dataone.integration.ContextAwareTestCaseDataone]
20151113-05:15:57: [INFO]: rest call info: GET https://mn-dev-unm-1.test.dataone.org/metacat/d1/mn/v2/monitor/ping [org.dataone.client.rest.RestClient]
20151113-05:15:57: [INFO]: MN excluded from test: https://mn-dev-unm-1.test.dataone.org/metacat/d1/mn [org.dataone.integration.ContextAwareTestCaseDataone]
20151113-05:15:57: [INFO]: rest call info: GET https://mn-dev-unm-2.test.dataone.org/metacat/d1/mn/v2/monitor/ping [org.dataone.client.rest.RestClient]
20151113-05:15:57: [INFO]: MN included in test: https://mn-dev-unm-2.test.dataone.org/metacat/d1/mn [org.dataone.integration.ContextAwareTestCaseDataone]
20151113-05:15:57: [INFO]: 
***************** running test for testUpdateSystemMetadata_CNCertNonAuthMN(...) vs. node: https://mn-dev-ucsb-2.test.dataone.org/metacat/d1/mn ***************** [org.dataone.integration.ContextAwareTestCaseDataone]
20151113-05:15:57: [INFO]: rest call info: GET https://cn-dev-ucsb-2.test.dataone.org/cn/v2/node [org.dataone.client.rest.RestClient]
Tests run: 14, Failures: 1, Errors: 0, Skipped: 1, Time elapsed: 370.58 sec <<< FAILURE!

Results :

Failed tests: 
  testRegisterSystemMetadata_dateModified(org.dataone.integration.it.apiTests.MNSystemMetadataMutabilityIt): Unable to fetch node list from CN: https://cn-dev-ucsb-2.test.dataone.org/cn/v2
  testSetReplicationStatus_dateModified(org.dataone.integration.it.apiTests.MNSystemMetadataMutabilityIt): Unable to fetch node list from CN: https://cn-dev-ucsb-2.test.dataone.org/cn/v2
  testSetReplicationMetadata_dateModified(org.dataone.integration.it.apiTests.MNSystemMetadataMutabilityIt): Unable to fetch node list from CN: https://cn-dev-ucsb-2.test.dataone.org/cn/v2
  testDeleteReplicationMetadata_dateModified(org.dataone.integration.it.apiTests.MNSystemMetadataMutabilityIt): Unable to fetch node list from CN: https://cn-dev-ucsb-2.test.dataone.org/cn/v2
  testUpdateSystemMetadata_CNCertNonAuthMN(org.dataone.integration.it.apiTests.MNUpdateSystemMetadataIT): Test setup failed. Couldn't create object: GET https://cn-dev-ucsb-2.test.dataone.org/cn/v2/node : ServiceFailure: -1: 500: Internal Server Error: Deserializing Text/Plain: Just providing message body:

Tests run: 18, Failures: 5, Errors: 0, Skipped: 1

[WARNING] File encoding has not been set, using platform encoding UTF-8, i.e. build is platform dependent!
[JENKINS] Recording test results
[INFO] 
[INFO] --- maven-failsafe-plugin:2.8.1:verify (verify) @ d1_integration ---
[INFO] Failsafe report directory: /var/lib/jenkins/jobs/d1_integration_DEV2_mn_sysmeta_mutability/workspace/target/failsafe-reports
[WARNING] File encoding has not been set, using platform encoding UTF-8, i.e. build is platform dependent!
[ERROR] There are test failures.

Please refer to /var/lib/jenkins/jobs/d1_integration_DEV2_mn_sysmeta_mutability/workspace/target/failsafe-reports for the individual test results.
[JENKINS] Recording test results
Notifying upstream projects of job completion
Join notifier requires a CauseAction
[INFO] ------------------------------------------------------------------------
[INFO] BUILD SUCCESS
[INFO] ------------------------------------------------------------------------
[INFO] Total time: 6:46.775s
[INFO] Finished at: Fri Nov 13 05:15:58 UTC 2015
[INFO] Final Memory: 43M/362M
[INFO] ------------------------------------------------------------------------
Waiting for Jenkins to finish collecting data
[JENKINS] Archiving /var/lib/jenkins/jobs/d1_integration_DEV2_mn_sysmeta_mutability/workspace/pom.xml to org.dataone/d1_integration/2.0-SNAPSHOT/d1_integration-2.0-SNAPSHOT.pom
channel stopped
Notifying upstream projects of job completion
Warning: you have no plugins providing access control for builds, so falling back to legacy behavior of permitting any downstream builds to be triggered
Finished: UNSTABLE