UnstableConsole Output

Skipping 186 KB.. Full Log
a:31)
	at org.junit.runners.BlockJUnit4ClassRunner.runChild(BlockJUnit4ClassRunner.java:76)
	at org.junit.runners.BlockJUnit4ClassRunner.runChild(BlockJUnit4ClassRunner.java:50)
	at org.junit.runners.ParentRunner$3.run(ParentRunner.java:193)
	at org.junit.runners.ParentRunner$1.schedule(ParentRunner.java:52)
	at org.junit.runners.ParentRunner.runChildren(ParentRunner.java:191)
	at org.junit.runners.ParentRunner.access$000(ParentRunner.java:42)
	at org.junit.runners.ParentRunner$2.evaluate(ParentRunner.java:184)
	at org.junit.runners.ParentRunner.run(ParentRunner.java:236)
	at org.apache.maven.surefire.junit4.JUnit4TestSet.execute(JUnit4TestSet.java:53)
	at org.apache.maven.surefire.junit4.JUnit4Provider.executeTestSet(JUnit4Provider.java:123)
	at org.apache.maven.surefire.junit4.JUnit4Provider.invoke(JUnit4Provider.java:104)
	at sun.reflect.NativeMethodAccessorImpl.invoke0(Native Method)
	at sun.reflect.NativeMethodAccessorImpl.invoke(NativeMethodAccessorImpl.java:57)
	at sun.reflect.DelegatingMethodAccessorImpl.invoke(DelegatingMethodAccessorImpl.java:43)
	at java.lang.reflect.Method.invoke(Method.java:606)
	at org.apache.maven.surefire.util.ReflectionUtils.invokeMethodWithArray(ReflectionUtils.java:164)
	at org.apache.maven.surefire.booter.ProviderFactory$ProviderProxy.invoke(ProviderFactory.java:110)
	at org.apache.maven.surefire.booter.SurefireStarter.invokeProvider(SurefireStarter.java:175)
	at org.apache.maven.surefire.booter.SurefireStarter.runSuitesInProcessWhenForked(SurefireStarter.java:107)
	at org.apache.maven.surefire.booter.ForkedBooter.main(ForkedBooter.java:68)
Caused by: org.apache.commons.configuration.ConfigurationException: Cannot locate configuration source null
	at org.apache.commons.configuration.AbstractFileConfiguration.load(AbstractFileConfiguration.java:217)
	at org.apache.commons.configuration.AbstractFileConfiguration.load(AbstractFileConfiguration.java:197)
	at org.apache.commons.configuration.AbstractFileConfiguration.<init>(AbstractFileConfiguration.java:181)
	at org.apache.commons.configuration.PropertiesConfiguration.<init>(PropertiesConfiguration.java:269)
	at org.dataone.configuration.TestSettings.loadConfigurationFile(TestSettings.java:199)
	at org.dataone.configuration.TestSettings.getConfiguration(TestSettings.java:69)
	... 38 more
20151112-05:09:28: [ERROR]: Problem loading testing configuration at: 'null':: Cannot locate configuration source null [org.dataone.configuration.TestSettings]
20151112-05:09:28: [ERROR]: General Problem loading TestSettings. InvocationTargetException: null [org.dataone.configuration.Settings]
java.lang.reflect.InvocationTargetException
	at sun.reflect.NativeMethodAccessorImpl.invoke0(Native Method)
	at sun.reflect.NativeMethodAccessorImpl.invoke(NativeMethodAccessorImpl.java:57)
	at sun.reflect.DelegatingMethodAccessorImpl.invoke(DelegatingMethodAccessorImpl.java:43)
	at java.lang.reflect.Method.invoke(Method.java:606)
	at org.dataone.configuration.Settings.loadTestConfigurations(Settings.java:151)
	at org.dataone.configuration.Settings.getConfiguration(Settings.java:87)
	at org.dataone.configuration.Settings.getResetConfiguration(Settings.java:123)
	at org.dataone.configuration.TestSettingsTest.testContextSafetyOnError(TestSettingsTest.java:209)
	at sun.reflect.NativeMethodAccessorImpl.invoke0(Native Method)
	at sun.reflect.NativeMethodAccessorImpl.invoke(NativeMethodAccessorImpl.java:57)
	at sun.reflect.DelegatingMethodAccessorImpl.invoke(DelegatingMethodAccessorImpl.java:43)
	at java.lang.reflect.Method.invoke(Method.java:606)
	at org.junit.runners.model.FrameworkMethod$1.runReflectiveCall(FrameworkMethod.java:44)
	at org.junit.internal.runners.model.ReflectiveCallable.run(ReflectiveCallable.java:15)
	at org.junit.runners.model.FrameworkMethod.invokeExplosively(FrameworkMethod.java:41)
	at org.junit.internal.runners.statements.InvokeMethod.evaluate(InvokeMethod.java:20)
	at org.junit.internal.runners.statements.RunBefores.evaluate(RunBefores.java:28)
	at org.junit.internal.runners.statements.RunAfters.evaluate(RunAfters.java:31)
	at org.junit.runners.BlockJUnit4ClassRunner.runChild(BlockJUnit4ClassRunner.java:76)
	at org.junit.runners.BlockJUnit4ClassRunner.runChild(BlockJUnit4ClassRunner.java:50)
	at org.junit.runners.ParentRunner$3.run(ParentRunner.java:193)
	at org.junit.runners.ParentRunner$1.schedule(ParentRunner.java:52)
	at org.junit.runners.ParentRunner.runChildren(ParentRunner.java:191)
	at org.junit.runners.ParentRunner.access$000(ParentRunner.java:42)
	at org.junit.runners.ParentRunner$2.evaluate(ParentRunner.java:184)
	at org.junit.runners.ParentRunner.run(ParentRunner.java:236)
	at org.apache.maven.surefire.junit4.JUnit4TestSet.execute(JUnit4TestSet.java:53)
	at org.apache.maven.surefire.junit4.JUnit4Provider.executeTestSet(JUnit4Provider.java:123)
	at org.apache.maven.surefire.junit4.JUnit4Provider.invoke(JUnit4Provider.java:104)
	at sun.reflect.NativeMethodAccessorImpl.invoke0(Native Method)
	at sun.reflect.NativeMethodAccessorImpl.invoke(NativeMethodAccessorImpl.java:57)
	at sun.reflect.DelegatingMethodAccessorImpl.invoke(DelegatingMethodAccessorImpl.java:43)
	at java.lang.reflect.Method.invoke(Method.java:606)
	at org.apache.maven.surefire.util.ReflectionUtils.invokeMethodWithArray(ReflectionUtils.java:164)
	at org.apache.maven.surefire.booter.ProviderFactory$ProviderProxy.invoke(ProviderFactory.java:110)
	at org.apache.maven.surefire.booter.SurefireStarter.invokeProvider(SurefireStarter.java:175)
	at org.apache.maven.surefire.booter.SurefireStarter.runSuitesInProcessWhenForked(SurefireStarter.java:107)
	at org.apache.maven.surefire.booter.ForkedBooter.main(ForkedBooter.java:68)
Caused by: org.apache.commons.configuration.ConfigurationException: Cannot locate configuration source null
	at org.apache.commons.configuration.AbstractFileConfiguration.load(AbstractFileConfiguration.java:217)
	at org.apache.commons.configuration.AbstractFileConfiguration.load(AbstractFileConfiguration.java:197)
	at org.apache.commons.configuration.AbstractFileConfiguration.<init>(AbstractFileConfiguration.java:181)
	at org.apache.commons.configuration.PropertiesConfiguration.<init>(PropertiesConfiguration.java:269)
	at org.dataone.configuration.TestSettings.loadConfigurationFile(TestSettings.java:199)
	at org.dataone.configuration.TestSettings.getConfiguration(TestSettings.java:69)
	... 38 more
20151112-05:09:28: [ERROR]: Problem loading testing configuration at: 'null':: Cannot locate configuration source null [org.dataone.configuration.TestSettings]
20151112-05:09:28: [ERROR]: General Problem loading TestSettings. InvocationTargetException: null [org.dataone.configuration.Settings]
java.lang.reflect.InvocationTargetException
	at sun.reflect.NativeMethodAccessorImpl.invoke0(Native Method)
	at sun.reflect.NativeMethodAccessorImpl.invoke(NativeMethodAccessorImpl.java:57)
	at sun.reflect.DelegatingMethodAccessorImpl.invoke(DelegatingMethodAccessorImpl.java:43)
	at java.lang.reflect.Method.invoke(Method.java:606)
	at org.dataone.configuration.Settings.loadTestConfigurations(Settings.java:151)
	at org.dataone.configuration.Settings.getConfiguration(Settings.java:87)
	at org.dataone.configuration.Settings.getResetConfiguration(Settings.java:123)
	at org.dataone.configuration.TestSettingsTest.testContextSafetyOnError(TestSettingsTest.java:211)
	at sun.reflect.NativeMethodAccessorImpl.invoke0(Native Method)
	at sun.reflect.NativeMethodAccessorImpl.invoke(NativeMethodAccessorImpl.java:57)
	at sun.reflect.DelegatingMethodAccessorImpl.invoke(DelegatingMethodAccessorImpl.java:43)
	at java.lang.reflect.Method.invoke(Method.java:606)
	at org.junit.runners.model.FrameworkMethod$1.runReflectiveCall(FrameworkMethod.java:44)
	at org.junit.internal.runners.model.ReflectiveCallable.run(ReflectiveCallable.java:15)
	at org.junit.runners.model.FrameworkMethod.invokeExplosively(FrameworkMethod.java:41)
	at org.junit.internal.runners.statements.InvokeMethod.evaluate(InvokeMethod.java:20)
	at org.junit.internal.runners.statements.RunBefores.evaluate(RunBefores.java:28)
	at org.junit.internal.runners.statements.RunAfters.evaluate(RunAfters.java:31)
	at org.junit.runners.BlockJUnit4ClassRunner.runChild(BlockJUnit4ClassRunner.java:76)
	at org.junit.runners.BlockJUnit4ClassRunner.runChild(BlockJUnit4ClassRunner.java:50)
	at org.junit.runners.ParentRunner$3.run(ParentRunner.java:193)
	at org.junit.runners.ParentRunner$1.schedule(ParentRunner.java:52)
	at org.junit.runners.ParentRunner.runChildren(ParentRunner.java:191)
	at org.junit.runners.ParentRunner.access$000(ParentRunner.java:42)
	at org.junit.runners.ParentRunner$2.evaluate(ParentRunner.java:184)
	at org.junit.runners.ParentRunner.run(ParentRunner.java:236)
	at org.apache.maven.surefire.junit4.JUnit4TestSet.execute(JUnit4TestSet.java:53)
	at org.apache.maven.surefire.junit4.JUnit4Provider.executeTestSet(JUnit4Provider.java:123)
	at org.apache.maven.surefire.junit4.JUnit4Provider.invoke(JUnit4Provider.java:104)
	at sun.reflect.NativeMethodAccessorImpl.invoke0(Native Method)
	at sun.reflect.NativeMethodAccessorImpl.invoke(NativeMethodAccessorImpl.java:57)
	at sun.reflect.DelegatingMethodAccessorImpl.invoke(DelegatingMethodAccessorImpl.java:43)
	at java.lang.reflect.Method.invoke(Method.java:606)
	at org.apache.maven.surefire.util.ReflectionUtils.invokeMethodWithArray(ReflectionUtils.java:164)
	at org.apache.maven.surefire.booter.ProviderFactory$ProviderProxy.invoke(ProviderFactory.java:110)
	at org.apache.maven.surefire.booter.SurefireStarter.invokeProvider(SurefireStarter.java:175)
	at org.apache.maven.surefire.booter.SurefireStarter.runSuitesInProcessWhenForked(SurefireStarter.java:107)
	at org.apache.maven.surefire.booter.ForkedBooter.main(ForkedBooter.java:68)
Caused by: org.apache.commons.configuration.ConfigurationException: Cannot locate configuration source null
	at org.apache.commons.configuration.AbstractFileConfiguration.load(AbstractFileConfiguration.java:217)
	at org.apache.commons.configuration.AbstractFileConfiguration.load(AbstractFileConfiguration.java:197)
	at org.apache.commons.configuration.AbstractFileConfiguration.<init>(AbstractFileConfiguration.java:181)
	at org.apache.commons.configuration.PropertiesConfiguration.<init>(PropertiesConfiguration.java:269)
	at org.dataone.configuration.TestSettings.loadConfigurationFile(TestSettings.java:199)
	at org.dataone.configuration.TestSettings.getConfiguration(TestSettings.java:69)
	... 38 more
Tests run: 11, Failures: 0, Errors: 0, Skipped: 1, Time elapsed: 0.096 sec
Running org.dataone.client.PoolingHttpClientConnectionManagerTest
Tests run: 2, Failures: 0, Errors: 0, Skipped: 1, Time elapsed: 0.001 sec
Running org.dataone.client.CNRestURLTest
Tests run: 9, Failures: 0, Errors: 0, Skipped: 8, Time elapsed: 0.013 sec

Results :

Tests run: 35, Failures: 0, Errors: 0, Skipped: 12

[JENKINS] Recording test results
[INFO] 
[INFO] --- maven-antrun-plugin:1.3:run (execution1) @ d1_integration ---
[INFO] Executing tasks
     [copy] Copying 236 files to /var/lib/jenkins/jobs/d1_integration_DEV2_mn_sysmeta_mutability/workspace/target/classes
     [copy] Copying 3 files to /var/lib/jenkins/jobs/d1_integration_DEV2_mn_sysmeta_mutability/workspace/target/d1_integration-2.0-SNAPSHOT/org/dataone/integration/webTest
[INFO] Executed tasks
[INFO] 
[INFO] --- maven-dependency-plugin:2.3:unpack-dependencies (jetty-classpath) @ d1_integration ---
[INFO] Unpacking /var/lib/jenkins/.m2/repository/org/eclipse/jetty/orbit/org.apache.jasper.glassfish/2.2.2.v201112011158/org.apache.jasper.glassfish-2.2.2.v201112011158.jar to /var/lib/jenkins/jobs/d1_integration_DEV2_mn_sysmeta_mutability/workspace/target/d1_integration-2.0-SNAPSHOT with includes "" and excludes ""
[INFO] Unpacking /var/lib/jenkins/.m2/repository/org/slf4j/slf4j-simple/1.6.4/slf4j-simple-1.6.4.jar to /var/lib/jenkins/jobs/d1_integration_DEV2_mn_sysmeta_mutability/workspace/target/d1_integration-2.0-SNAPSHOT with includes "" and excludes ""
[INFO] Unpacking /var/lib/jenkins/.m2/repository/org/eclipse/jetty/jetty-websocket/8.1.15.v20140411/jetty-websocket-8.1.15.v20140411.jar to /var/lib/jenkins/jobs/d1_integration_DEV2_mn_sysmeta_mutability/workspace/target/d1_integration-2.0-SNAPSHOT with includes "" and excludes ""
[INFO] Unpacking /var/lib/jenkins/.m2/repository/org/eclipse/jetty/orbit/javax.security.auth.message/1.0.0.v201108011116/javax.security.auth.message-1.0.0.v201108011116.jar to /var/lib/jenkins/jobs/d1_integration_DEV2_mn_sysmeta_mutability/workspace/target/d1_integration-2.0-SNAPSHOT with includes "" and excludes ""
[INFO] Unpacking /var/lib/jenkins/.m2/repository/org/eclipse/jetty/orbit/javax.servlet.jsp.jstl/1.2.0.v201105211821/javax.servlet.jsp.jstl-1.2.0.v201105211821.jar to /var/lib/jenkins/jobs/d1_integration_DEV2_mn_sysmeta_mutability/workspace/target/d1_integration-2.0-SNAPSHOT with includes "" and excludes ""
[INFO] Unpacking /var/lib/jenkins/.m2/repository/org/eclipse/jetty/orbit/com.sun.el/2.2.0.v201108011116/com.sun.el-2.2.0.v201108011116.jar to /var/lib/jenkins/jobs/d1_integration_DEV2_mn_sysmeta_mutability/workspace/target/d1_integration-2.0-SNAPSHOT with includes "" and excludes ""
[INFO] Unpacking /var/lib/jenkins/.m2/repository/org/eclipse/jetty/orbit/javax.mail.glassfish/1.4.1.v201005082020/javax.mail.glassfish-1.4.1.v201005082020.jar to /var/lib/jenkins/jobs/d1_integration_DEV2_mn_sysmeta_mutability/workspace/target/d1_integration-2.0-SNAPSHOT with includes "" and excludes ""
[INFO] Unpacking /var/lib/jenkins/.m2/repository/org/slf4j/slf4j-api/1.6.4/slf4j-api-1.6.4.jar to /var/lib/jenkins/jobs/d1_integration_DEV2_mn_sysmeta_mutability/workspace/target/d1_integration-2.0-SNAPSHOT with includes "" and excludes ""
[INFO] Unpacking /var/lib/jenkins/.m2/repository/org/eclipse/jetty/jetty-io/8.1.15.v20140411/jetty-io-8.1.15.v20140411.jar to /var/lib/jenkins/jobs/d1_integration_DEV2_mn_sysmeta_mutability/workspace/target/d1_integration-2.0-SNAPSHOT with includes "" and excludes ""
[INFO] Unpacking /var/lib/jenkins/.m2/repository/org/eclipse/jetty/orbit/javax.servlet.jsp/2.2.0.v201112011158/javax.servlet.jsp-2.2.0.v201112011158.jar to /var/lib/jenkins/jobs/d1_integration_DEV2_mn_sysmeta_mutability/workspace/target/d1_integration-2.0-SNAPSHOT with includes "" and excludes ""
[INFO] Unpacking /var/lib/jenkins/.m2/repository/org/eclipse/jetty/aggregate/jetty-all-server/8.1.15.v20140411/jetty-all-server-8.1.15.v20140411.jar to /var/lib/jenkins/jobs/d1_integration_DEV2_mn_sysmeta_mutability/workspace/target/d1_integration-2.0-SNAPSHOT with includes "" and excludes ""
[INFO] Unpacking /var/lib/jenkins/.m2/repository/org/eclipse/jetty/jetty-jsp/8.1.15.v20140411/jetty-jsp-8.1.15.v20140411.jar to /var/lib/jenkins/jobs/d1_integration_DEV2_mn_sysmeta_mutability/workspace/target/d1_integration-2.0-SNAPSHOT with includes "" and excludes ""
[INFO] Unpacking /var/lib/jenkins/.m2/repository/org/eclipse/jetty/orbit/org.apache.taglibs.standard.glassfish/1.2.0.v201112081803/org.apache.taglibs.standard.glassfish-1.2.0.v201112081803.jar to /var/lib/jenkins/jobs/d1_integration_DEV2_mn_sysmeta_mutability/workspace/target/d1_integration-2.0-SNAPSHOT with includes "" and excludes ""
[INFO] Unpacking /var/lib/jenkins/.m2/repository/javax/servlet/servlet-api/2.5/servlet-api-2.5.jar to /var/lib/jenkins/jobs/d1_integration_DEV2_mn_sysmeta_mutability/workspace/target/d1_integration-2.0-SNAPSHOT with includes "" and excludes ""
[INFO] Unpacking /var/lib/jenkins/.m2/repository/org/eclipse/jetty/orbit/javax.activation/1.1.0.v201105071233/javax.activation-1.1.0.v201105071233.jar to /var/lib/jenkins/jobs/d1_integration_DEV2_mn_sysmeta_mutability/workspace/target/d1_integration-2.0-SNAPSHOT with includes "" and excludes ""
[INFO] Unpacking /var/lib/jenkins/.m2/repository/org/eclipse/jetty/orbit/javax.annotation/1.1.0.v201108011116/javax.annotation-1.1.0.v201108011116.jar to /var/lib/jenkins/jobs/d1_integration_DEV2_mn_sysmeta_mutability/workspace/target/d1_integration-2.0-SNAPSHOT with includes "" and excludes ""
[INFO] Unpacking /var/lib/jenkins/.m2/repository/org/eclipse/jetty/jetty-http/8.1.15.v20140411/jetty-http-8.1.15.v20140411.jar to /var/lib/jenkins/jobs/d1_integration_DEV2_mn_sysmeta_mutability/workspace/target/d1_integration-2.0-SNAPSHOT with includes "" and excludes ""
[INFO] Unpacking /var/lib/jenkins/.m2/repository/org/eclipse/jetty/jetty-util/8.1.15.v20140411/jetty-util-8.1.15.v20140411.jar to /var/lib/jenkins/jobs/d1_integration_DEV2_mn_sysmeta_mutability/workspace/target/d1_integration-2.0-SNAPSHOT with includes "" and excludes ""
[INFO] Unpacking /var/lib/jenkins/.m2/repository/org/eclipse/jetty/orbit/org.eclipse.jdt.core/3.7.1/org.eclipse.jdt.core-3.7.1.jar to /var/lib/jenkins/jobs/d1_integration_DEV2_mn_sysmeta_mutability/workspace/target/d1_integration-2.0-SNAPSHOT with includes "" and excludes ""
[INFO] Unpacking /var/lib/jenkins/.m2/repository/org/eclipse/jetty/orbit/javax.servlet/3.0.0.v201112011016/javax.servlet-3.0.0.v201112011016.jar to /var/lib/jenkins/jobs/d1_integration_DEV2_mn_sysmeta_mutability/workspace/target/d1_integration-2.0-SNAPSHOT with includes "" and excludes ""
[INFO] Unpacking /var/lib/jenkins/.m2/repository/org/eclipse/jetty/orbit/javax.el/2.2.0.v201108011116/javax.el-2.2.0.v201108011116.jar to /var/lib/jenkins/jobs/d1_integration_DEV2_mn_sysmeta_mutability/workspace/target/d1_integration-2.0-SNAPSHOT with includes "" and excludes ""
[INFO] 
[INFO] --- maven-war-plugin:2.1.1:war (default-war) @ d1_integration ---
[INFO] Packaging webapp
[INFO] Assembling webapp [d1_integration] in [/var/lib/jenkins/jobs/d1_integration_DEV2_mn_sysmeta_mutability/workspace/target/d1_integration-2.0-SNAPSHOT]
[INFO] Processing war project
[INFO] Copying webapp resources [/var/lib/jenkins/jobs/d1_integration_DEV2_mn_sysmeta_mutability/workspace/src/main/webapp]
[INFO] Webapp assembled in [467 msecs]
[INFO] Building war: /var/lib/jenkins/jobs/d1_integration_DEV2_mn_sysmeta_mutability/workspace/target/d1_integration-2.0-SNAPSHOT.war
[INFO] WEB-INF/web.xml already added, skipping
[INFO] 
[INFO] --- maven-antrun-plugin:1.3:run (execution2) @ d1_integration ---
[INFO] Executing tasks
     [move] Moving 1 file to /var/lib/jenkins/jobs/d1_integration_DEV2_mn_sysmeta_mutability/workspace/target
[INFO] Executed tasks
[INFO] 
[INFO] --- maven-failsafe-plugin:2.8.1:integration-test (integration-test) @ d1_integration ---
[INFO] Failsafe report directory: /var/lib/jenkins/jobs/d1_integration_DEV2_mn_sysmeta_mutability/workspace/target/failsafe-reports

-------------------------------------------------------
 T E S T S
-------------------------------------------------------
Running org.dataone.integration.it.apiTests.MNSystemMetadataMutabilityIt
20151112-05:09:42: [INFO]: **************************************************** [org.dataone.integration.ContextAwareTestCaseDataone]
20151112-05:09:42: [INFO]: ***  context label:   DEV2 [org.dataone.integration.ContextAwareTestCaseDataone]
20151112-05:09:42: [INFO]: **************************************************** [org.dataone.integration.ContextAwareTestCaseDataone]
~~~ Context is from d1client.properties: https://cn-dev-2.test.dataone.org/cn
20151112-05:09:43: [INFO]: rest call info: GET https://cn-dev-2.test.dataone.org/cn/v1/node [org.dataone.client.rest.RestClient]
20151112-05:09:43: [INFO]: isNodeAlive for Node: https://cn-dev-2.test.dataone.org/cn ... [org.dataone.integration.ContextAwareTestCaseDataone]
20151112-05:09:43: [INFO]: ... calling node ... [org.dataone.integration.ContextAwareTestCaseDataone]
20151112-05:09:43: [INFO]: rest call info: GET https://cn-dev-2.test.dataone.org/cn [org.dataone.client.rest.RestClient]
20151112-05:09:43: [INFO]: ... called node [org.dataone.integration.ContextAwareTestCaseDataone]
20151112-05:09:43: [INFO]: *** Adding CN to list: cn-dev-2 [ https://cn-dev-2.test.dataone.org/cn ] [org.dataone.integration.ContextAwareTestCaseDataone]
20151112-05:09:43: [INFO]: isNodeAlive for Node: https://cn-dev-ucsb-2.test.dataone.org/cn ... [org.dataone.integration.ContextAwareTestCaseDataone]
20151112-05:09:43: [INFO]: ... calling node ... [org.dataone.integration.ContextAwareTestCaseDataone]
20151112-05:09:44: [INFO]: rest call info: GET https://cn-dev-ucsb-2.test.dataone.org/cn [org.dataone.client.rest.RestClient]
20151112-05:09:44: [INFO]: ... called node [org.dataone.integration.ContextAwareTestCaseDataone]
20151112-05:09:44: [INFO]: *** Adding CN to list: cn-dev-ucsb-2 [ https://cn-dev-ucsb-2.test.dataone.org/cn ] [org.dataone.integration.ContextAwareTestCaseDataone]
20151112-05:09:44: [INFO]: isNodeAlive for Node: https://cn-dev-unm-2.test.dataone.org/cn ... [org.dataone.integration.ContextAwareTestCaseDataone]
20151112-05:09:44: [INFO]: ... calling node ... [org.dataone.integration.ContextAwareTestCaseDataone]
20151112-05:09:44: [INFO]: rest call info: GET https://cn-dev-unm-2.test.dataone.org/cn [org.dataone.client.rest.RestClient]
20151112-05:09:44: [INFO]: ... called node [org.dataone.integration.ContextAwareTestCaseDataone]
20151112-05:09:44: [INFO]: *** Adding CN to list: cn-dev-unm-2 [ https://cn-dev-unm-2.test.dataone.org/cn ] [org.dataone.integration.ContextAwareTestCaseDataone]
20151112-05:09:44: [INFO]: isNodeAlive for Node: https://mn-dev-ucsb-1.test.dataone.org/metacat/d1/mn ... [org.dataone.integration.ContextAwareTestCaseDataone]
20151112-05:09:44: [INFO]: ... calling node ... [org.dataone.integration.ContextAwareTestCaseDataone]
20151112-05:09:44: [INFO]: rest call info: GET https://mn-dev-ucsb-1.test.dataone.org/metacat/d1/mn [org.dataone.client.rest.RestClient]
20151112-05:09:44: [INFO]: ... called node [org.dataone.integration.ContextAwareTestCaseDataone]
20151112-05:09:44: [INFO]: *** Adding MN to list: mn-dev-ucsb-1 [ https://mn-dev-ucsb-1.test.dataone.org/metacat/d1/mn ] [org.dataone.integration.ContextAwareTestCaseDataone]
20151112-05:09:44: [INFO]: isNodeAlive for Node: https://mn-dev-ucsb-2.test.dataone.org/metacat/d1/mn ... [org.dataone.integration.ContextAwareTestCaseDataone]
20151112-05:09:44: [INFO]: ... calling node ... [org.dataone.integration.ContextAwareTestCaseDataone]
20151112-05:09:44: [INFO]: rest call info: GET https://mn-dev-ucsb-2.test.dataone.org/metacat/d1/mn [org.dataone.client.rest.RestClient]
20151112-05:09:44: [INFO]: ... called node [org.dataone.integration.ContextAwareTestCaseDataone]
20151112-05:09:44: [INFO]: *** Adding MN to list: mn-dev-ucsb-2 [ https://mn-dev-ucsb-2.test.dataone.org/metacat/d1/mn ] [org.dataone.integration.ContextAwareTestCaseDataone]
20151112-05:09:44: [INFO]: isNodeAlive for Node: https://mn-dev-unm-1.test.dataone.org/metacat/d1/mn ... [org.dataone.integration.ContextAwareTestCaseDataone]
20151112-05:09:44: [INFO]: ... calling node ... [org.dataone.integration.ContextAwareTestCaseDataone]
20151112-05:09:44: [INFO]: rest call info: GET https://mn-dev-unm-1.test.dataone.org/metacat/d1/mn [org.dataone.client.rest.RestClient]
20151112-05:09:44: [INFO]: ... called node [org.dataone.integration.ContextAwareTestCaseDataone]
20151112-05:09:44: [INFO]: *** Adding MN to list: mn-dev-unm-1 [ https://mn-dev-unm-1.test.dataone.org/metacat/d1/mn ] [org.dataone.integration.ContextAwareTestCaseDataone]
20151112-05:09:44: [INFO]: isNodeAlive for Node: https://mn-dev-unm-2.test.dataone.org/metacat/d1/mn ... [org.dataone.integration.ContextAwareTestCaseDataone]
20151112-05:09:44: [INFO]: ... calling node ... [org.dataone.integration.ContextAwareTestCaseDataone]
20151112-05:09:44: [INFO]: rest call info: GET https://mn-dev-unm-2.test.dataone.org/metacat/d1/mn [org.dataone.client.rest.RestClient]
20151112-05:09:44: [INFO]: ... called node [org.dataone.integration.ContextAwareTestCaseDataone]
20151112-05:09:44: [INFO]: *** Adding MN to list: mn-dev-unm-2 [ https://mn-dev-unm-2.test.dataone.org/metacat/d1/mn ] [org.dataone.integration.ContextAwareTestCaseDataone]
20151112-05:09:44: [INFO]: trying to filter CN list for the round robin CN... original size: 3, includes nodes: [org.dataone.integration.ContextAwareTestCaseDataone]
20151112-05:09:44: [INFO]:     CN: https://cn-dev-2.test.dataone.org/cn "Development 2 Round Robin Router Node" [org.dataone.integration.ContextAwareTestCaseDataone]
20151112-05:09:44: [INFO]:     CN: https://cn-dev-ucsb-2.test.dataone.org/cn "UCSB Development 2 Protocol Coordinating Node" [org.dataone.integration.ContextAwareTestCaseDataone]
20151112-05:09:44: [INFO]:     CN: https://cn-dev-unm-2.test.dataone.org/cn "UNM Development 2 Protocol Coordinating Node" [org.dataone.integration.ContextAwareTestCaseDataone]
20151112-05:09:44: [INFO]: excluding round robin CN: https://cn-dev-2.test.dataone.org/cn "Development 2 Round Robin Router Node" [org.dataone.integration.ContextAwareTestCaseDataone]
20151112-05:09:44: [INFO]: including CN: https://cn-dev-ucsb-2.test.dataone.org/cn "UCSB Development 2 Protocol Coordinating Node" [org.dataone.integration.ContextAwareTestCaseDataone]
20151112-05:09:44: [INFO]: including CN: https://cn-dev-unm-2.test.dataone.org/cn "UNM Development 2 Protocol Coordinating Node" [org.dataone.integration.ContextAwareTestCaseDataone]
20151112-05:09:44: [INFO]: filtered CN list without round robin CN. size: 2, including nodes: [org.dataone.integration.ContextAwareTestCaseDataone]
20151112-05:09:44: [INFO]:     CN: https://cn-dev-ucsb-2.test.dataone.org/cn "UCSB Development 2 Protocol Coordinating Node" [org.dataone.integration.ContextAwareTestCaseDataone]
20151112-05:09:44: [INFO]:     CN: https://cn-dev-unm-2.test.dataone.org/cn "UNM Development 2 Protocol Coordinating Node" [org.dataone.integration.ContextAwareTestCaseDataone]
20151112-05:09:44: [INFO]: **************************************************** [org.dataone.integration.ContextAwareTestCaseDataone]
20151112-05:09:44: [INFO]: certificate directory: /etc/dataone/client/testClientCerts/ [org.dataone.integration.ContextAwareTestCaseDataone]
20151112-05:09:44: [INFO]: certificate filename: cnDevUNM2 [org.dataone.integration.ContextAwareTestCaseDataone]
20151112-05:09:44: [INFO]: client setup as Subject: CN=urn:node:cnDevUNM2,DC=dataone,DC=org [org.dataone.integration.ContextAwareTestCaseDataone]
20151112-05:09:45: [INFO]: rest call info: GET https://cn-dev-ucsb-2.test.dataone.org/cn/v2/node [org.dataone.client.rest.RestClient]
20151112-05:09:45: [INFO]: **************************************************** [org.dataone.integration.ContextAwareTestCaseDataone]
20151112-05:09:45: [INFO]: ***  context label:   DEV2 [org.dataone.integration.ContextAwareTestCaseDataone]
20151112-05:09:45: [INFO]: **************************************************** [org.dataone.integration.ContextAwareTestCaseDataone]
20151112-05:09:45: [INFO]: **************************************************** [org.dataone.integration.ContextAwareTestCaseDataone]
20151112-05:09:45: [INFO]: rest call info: GET https://cn-dev-ucsb-2.test.dataone.org/cn/v2/node [org.dataone.client.rest.RestClient]
20151112-05:09:45: [INFO]: **************************************************** [org.dataone.integration.ContextAwareTestCaseDataone]
20151112-05:09:45: [INFO]: ***  context label:   DEV2 [org.dataone.integration.ContextAwareTestCaseDataone]
20151112-05:09:45: [INFO]: **************************************************** [org.dataone.integration.ContextAwareTestCaseDataone]
20151112-05:09:45: [INFO]: **************************************************** [org.dataone.integration.ContextAwareTestCaseDataone]
20151112-05:09:45: [INFO]: rest call info: GET https://cn-dev-ucsb-2.test.dataone.org/cn/v2/node [org.dataone.client.rest.RestClient]
20151112-05:09:45: [INFO]: **************************************************** [org.dataone.integration.ContextAwareTestCaseDataone]
20151112-05:09:45: [INFO]: ***  context label:   DEV2 [org.dataone.integration.ContextAwareTestCaseDataone]
20151112-05:09:45: [INFO]: **************************************************** [org.dataone.integration.ContextAwareTestCaseDataone]
20151112-05:09:45: [INFO]: **************************************************** [org.dataone.integration.ContextAwareTestCaseDataone]
20151112-05:09:45: [INFO]: rest call info: GET https://cn-dev-ucsb-2.test.dataone.org/cn/v2/node [org.dataone.client.rest.RestClient]
Tests run: 4, Failures: 4, Errors: 0, Skipped: 0, Time elapsed: 4.138 sec <<< FAILURE!
Running org.dataone.integration.it.apiTests.MNUpdateSystemMetadataIT
20151112-05:09:45: [INFO]: **************************************************** [org.dataone.integration.ContextAwareTestCaseDataone]
20151112-05:09:45: [INFO]: ***  context label:   DEV2 [org.dataone.integration.ContextAwareTestCaseDataone]
20151112-05:09:45: [INFO]: **************************************************** [org.dataone.integration.ContextAwareTestCaseDataone]
20151112-05:09:45: [INFO]: **************************************************** [org.dataone.integration.ContextAwareTestCaseDataone]
20151112-05:09:45: [INFO]: rest call info: GET https://mn-dev-ucsb-1.test.dataone.org/metacat/d1/mn/v2/monitor/ping [org.dataone.client.rest.RestClient]
20151112-05:09:45: [INFO]: MN excluded from test: https://mn-dev-ucsb-1.test.dataone.org/metacat/d1/mn [org.dataone.integration.ContextAwareTestCaseDataone]
20151112-05:09:46: [INFO]: rest call info: GET https://mn-dev-ucsb-2.test.dataone.org/metacat/d1/mn/v2/monitor/ping [org.dataone.client.rest.RestClient]
20151112-05:09:46: [INFO]: MN included in test: https://mn-dev-ucsb-2.test.dataone.org/metacat/d1/mn [org.dataone.integration.ContextAwareTestCaseDataone]
20151112-05:09:46: [INFO]: rest call info: GET https://mn-dev-unm-1.test.dataone.org/metacat/d1/mn/v2/monitor/ping [org.dataone.client.rest.RestClient]
20151112-05:09:46: [INFO]: MN excluded from test: https://mn-dev-unm-1.test.dataone.org/metacat/d1/mn [org.dataone.integration.ContextAwareTestCaseDataone]
20151112-05:09:46: [INFO]: rest call info: GET https://mn-dev-unm-2.test.dataone.org/metacat/d1/mn/v2/monitor/ping [org.dataone.client.rest.RestClient]
20151112-05:09:46: [INFO]: MN included in test: https://mn-dev-unm-2.test.dataone.org/metacat/d1/mn [org.dataone.integration.ContextAwareTestCaseDataone]
20151112-05:09:46: [INFO]: certificate directory: /etc/dataone/client/testClientCerts/ [org.dataone.integration.ContextAwareTestCaseDataone]
20151112-05:09:46: [INFO]: certificate filename: testRightsHolder [org.dataone.integration.ContextAwareTestCaseDataone]
20151112-05:09:46: [INFO]: client setup as Subject: CN=testRightsHolder,DC=dataone,DC=org [org.dataone.integration.ContextAwareTestCaseDataone]
20151112-05:09:46: [INFO]: 
***************** running test for testUpdateSystemMetadata_RightsHolder(...) vs. node: https://mn-dev-ucsb-2.test.dataone.org/metacat/d1/mn ***************** [org.dataone.integration.ContextAwareTestCaseDataone]
20151112-05:09:46: [INFO]: certificate directory: /etc/dataone/client/testClientCerts/ [org.dataone.integration.ContextAwareTestCaseDataone]
20151112-05:09:46: [INFO]: certificate filename: cnDevUNM2 [org.dataone.integration.ContextAwareTestCaseDataone]
20151112-05:09:46: [INFO]: client setup as Subject: CN=urn:node:cnDevUNM2,DC=dataone,DC=org [org.dataone.integration.ContextAwareTestCaseDataone]
20151112-05:09:46: [INFO]: refreshing objectFormatCache from cn: null [org.dataone.client.v2.formats.ObjectFormatCache]
20151112-05:09:46: [INFO]: rest call info: GET https://cn-dev-2.test.dataone.org/cn/v2/formats [org.dataone.client.rest.RestClient]
20151112-05:09:46: [INFO]: successful cache refresh from cn.listFormats() [org.dataone.client.v2.formats.ObjectFormatCache]
20151112-05:09:46: [INFO]: creating a test object.  pid = testUpdateSystemMetadata_RightsHolder_201531521946470 on https://mn-dev-ucsb-2.test.dataone.org/metacat/d1/mn/v2 [org.dataone.integration.ContextAwareTestCaseDataone]
20151112-05:09:46: [INFO]: SystemMetadata for pid: testUpdateSystemMetadata_RightsHolder_201531521946470
<?xml version="1.0" encoding="UTF-8"?><d1_v2.0:systemMetadata xmlns:d1_v2.0="http://ns.dataone.org/service/types/v2.0" xmlns:d1="http://ns.dataone.org/service/types/v1"><serialVersion>1</serialVersion><identifier>testUpdateSystemMetadata_RightsHolder_201531521946470</identifier><formatId>eml://ecoinformatics.org/eml-2.0.1</formatId><size>17181</size><checksum algorithm="MD5">03ce09c6b4c3efc1681f3023402998a2</checksum><submitter>CN=urn:node:cnDevUNM2,DC=dataone,DC=org</submitter><rightsHolder>CN=testRightsHolder,DC=dataone,DC=org</rightsHolder><accessPolicy><allow><subject>CN=testRightsHolder,DC=dataone,DC=org</subject><permission>changePermission</permission></allow></accessPolicy><dateUploaded>2015-11-12T05:09:46.865+00:00</dateUploaded><dateSysMetadataModified>2015-11-12T05:09:46.865+00:00</dateSysMetadataModified><originMemberNode>urn:node:mnDevUCSB2</originMemberNode><authoritativeMemberNode>urn:node:mnDevUCSB2</authoritativeMemberNode></d1_v2.0:systemMetadata> [org.dataone.integration.ContextAwareTestCaseDataone]
20151112-05:09:48: [INFO]: rest call info: POST https://mn-dev-ucsb-2.test.dataone.org/metacat/d1/mn/v2/object; MMP message has: ParamPart:pid = testUpdateSystemMetadata_RightsHolder_201531521946470; FilePart:object = /tmp/mmp.output.9010524807250509398.tmp (17181 bytes); FilePart:sysmeta = /tmp/mmp.output.2224979328179791334.tmp (979 bytes);  [org.dataone.client.rest.RestClient]
20151112-05:09:48: [INFO]: object created.  pid = testUpdateSystemMetadata_RightsHolder_201531521946470 [org.dataone.integration.ContextAwareTestCaseDataone]
20151112-05:09:48: [INFO]: rest call info: GET https://mn-dev-ucsb-2.test.dataone.org/metacat/d1/mn/v2/meta/testUpdateSystemMetadata_RightsHolder_201531521946470 [org.dataone.client.rest.RestClient]
20151112-05:09:54: [INFO]: rest call info: PUT https://mn-dev-ucsb-2.test.dataone.org/metacat/d1/mn/v2/meta; MMP message has: ParamPart:pid = testUpdateSystemMetadata_RightsHolder_201531521946470; FilePart:sysmeta = /tmp/mmp.output.8967779042879301497.tmp (1003 bytes);  [org.dataone.client.rest.RestClient]
20151112-05:10:04: [INFO]: rest call info: GET https://mn-dev-ucsb-2.test.dataone.org/metacat/d1/mn/v2/meta/testUpdateSystemMetadata_RightsHolder_201531521946470 [org.dataone.client.rest.RestClient]
20151112-05:10:04: [INFO]: 
***************** running test for testUpdateSystemMetadata_RightsHolder(...) vs. node: https://mn-dev-unm-2.test.dataone.org/metacat/d1/mn ***************** [org.dataone.integration.ContextAwareTestCaseDataone]
20151112-05:10:04: [INFO]: certificate directory: /etc/dataone/client/testClientCerts/ [org.dataone.integration.ContextAwareTestCaseDataone]
20151112-05:10:04: [INFO]: certificate filename: cnDevUNM2 [org.dataone.integration.ContextAwareTestCaseDataone]
20151112-05:10:04: [INFO]: client setup as Subject: CN=urn:node:cnDevUNM2,DC=dataone,DC=org [org.dataone.integration.ContextAwareTestCaseDataone]
20151112-05:10:04: [INFO]: creating a test object.  pid = testUpdateSystemMetadata_RightsHolder_201531521104902 on https://mn-dev-unm-2.test.dataone.org/metacat/d1/mn/v2 [org.dataone.integration.ContextAwareTestCaseDataone]
20151112-05:10:04: [INFO]: SystemMetadata for pid: testUpdateSystemMetadata_RightsHolder_201531521104902
<?xml version="1.0" encoding="UTF-8"?><d1_v2.0:systemMetadata xmlns:d1_v2.0="http://ns.dataone.org/service/types/v2.0" xmlns:d1="http://ns.dataone.org/service/types/v1"><serialVersion>1</serialVersion><identifier>testUpdateSystemMetadata_RightsHolder_201531521104902</identifier><formatId>eml://ecoinformatics.org/eml-2.0.1</formatId><size>17181</size><checksum algorithm="MD5">03ce09c6b4c3efc1681f3023402998a2</checksum><submitter>CN=urn:node:cnDevUNM2,DC=dataone,DC=org</submitter><rightsHolder>CN=testRightsHolder,DC=dataone,DC=org</rightsHolder><accessPolicy><allow><subject>CN=testRightsHolder,DC=dataone,DC=org</subject><permission>changePermission</permission></allow></accessPolicy><dateUploaded>2015-11-12T05:10:04.925+00:00</dateUploaded><dateSysMetadataModified>2015-11-12T05:10:04.925+00:00</dateSysMetadataModified><originMemberNode>urn:node:mnDevUNM2</originMemberNode><authoritativeMemberNode>urn:node:mnDevUNM2</authoritativeMemberNode></d1_v2.0:systemMetadata> [org.dataone.integration.ContextAwareTestCaseDataone]
20151112-05:10:05: [INFO]: rest call info: POST https://mn-dev-unm-2.test.dataone.org/metacat/d1/mn/v2/object; MMP message has: ParamPart:pid = testUpdateSystemMetadata_RightsHolder_201531521104902; FilePart:object = /tmp/mmp.output.260058692834952993.tmp (17181 bytes); FilePart:sysmeta = /tmp/mmp.output.6509114233342876822.tmp (977 bytes);  [org.dataone.client.rest.RestClient]
20151112-05:10:05: [INFO]: object created.  pid = testUpdateSystemMetadata_RightsHolder_201531521104902 [org.dataone.integration.ContextAwareTestCaseDataone]
20151112-05:10:06: [INFO]: rest call info: GET https://mn-dev-unm-2.test.dataone.org/metacat/d1/mn/v2/meta/testUpdateSystemMetadata_RightsHolder_201531521104902 [org.dataone.client.rest.RestClient]
20151112-05:10:11: [INFO]: rest call info: PUT https://mn-dev-unm-2.test.dataone.org/metacat/d1/mn/v2/meta; MMP message has: ParamPart:pid = testUpdateSystemMetadata_RightsHolder_201531521104902; FilePart:sysmeta = /tmp/mmp.output.7459750734791647847.tmp (1001 bytes);  [org.dataone.client.rest.RestClient]
20151112-05:10:21: [INFO]: rest call info: GET https://mn-dev-unm-2.test.dataone.org/metacat/d1/mn/v2/meta/testUpdateSystemMetadata_RightsHolder_201531521104902 [org.dataone.client.rest.RestClient]
20151112-05:10:21: [INFO]: **************************************************** [org.dataone.integration.ContextAwareTestCaseDataone]
20151112-05:10:21: [INFO]: ***  context label:   DEV2 [org.dataone.integration.ContextAwareTestCaseDataone]
20151112-05:10:21: [INFO]: **************************************************** [org.dataone.integration.ContextAwareTestCaseDataone]
20151112-05:10:21: [INFO]: **************************************************** [org.dataone.integration.ContextAwareTestCaseDataone]
20151112-05:10:21: [INFO]: rest call info: GET https://mn-dev-ucsb-1.test.dataone.org/metacat/d1/mn/v2/monitor/ping [org.dataone.client.rest.RestClient]
20151112-05:10:21: [INFO]: MN excluded from test: https://mn-dev-ucsb-1.test.dataone.org/metacat/d1/mn [org.dataone.integration.ContextAwareTestCaseDataone]
20151112-05:10:21: [INFO]: rest call info: GET https://mn-dev-ucsb-2.test.dataone.org/metacat/d1/mn/v2/monitor/ping [org.dataone.client.rest.RestClient]
20151112-05:10:21: [INFO]: MN included in test: https://mn-dev-ucsb-2.test.dataone.org/metacat/d1/mn [org.dataone.integration.ContextAwareTestCaseDataone]
20151112-05:10:21: [INFO]: rest call info: GET https://mn-dev-unm-1.test.dataone.org/metacat/d1/mn/v2/monitor/ping [org.dataone.client.rest.RestClient]
20151112-05:10:21: [INFO]: MN excluded from test: https://mn-dev-unm-1.test.dataone.org/metacat/d1/mn [org.dataone.integration.ContextAwareTestCaseDataone]
20151112-05:10:21: [INFO]: rest call info: GET https://mn-dev-unm-2.test.dataone.org/metacat/d1/mn/v2/monitor/ping [org.dataone.client.rest.RestClient]
20151112-05:10:21: [INFO]: MN included in test: https://mn-dev-unm-2.test.dataone.org/metacat/d1/mn [org.dataone.integration.ContextAwareTestCaseDataone]
20151112-05:10:21: [INFO]: 
***************** running test for testUpdateSystemMetadata_MutableRightsHolder(...) vs. node: https://mn-dev-ucsb-2.test.dataone.org/metacat/d1/mn ***************** [org.dataone.integration.ContextAwareTestCaseDataone]
20151112-05:10:21: [INFO]: certificate directory: /etc/dataone/client/testClientCerts/ [org.dataone.integration.ContextAwareTestCaseDataone]
20151112-05:10:21: [INFO]: certificate filename: cnDevUNM2 [org.dataone.integration.ContextAwareTestCaseDataone]
20151112-05:10:21: [INFO]: client setup as Subject: CN=urn:node:cnDevUNM2,DC=dataone,DC=org [org.dataone.integration.ContextAwareTestCaseDataone]
20151112-05:10:21: [INFO]: creating a test object.  pid = testUpdateSystemMetadata_MutableRightsHolder_2015315211021887 on https://mn-dev-ucsb-2.test.dataone.org/metacat/d1/mn/v2 [org.dataone.integration.ContextAwareTestCaseDataone]
20151112-05:10:21: [INFO]: SystemMetadata for pid: testUpdateSystemMetadata_MutableRightsHolder_2015315211021887
<?xml version="1.0" encoding="UTF-8"?><d1_v2.0:systemMetadata xmlns:d1_v2.0="http://ns.dataone.org/service/types/v2.0" xmlns:d1="http://ns.dataone.org/service/types/v1"><serialVersion>1</serialVersion><identifier>testUpdateSystemMetadata_MutableRightsHolder_2015315211021887</identifier><formatId>eml://ecoinformatics.org/eml-2.0.1</formatId><size>17181</size><checksum algorithm="MD5">03ce09c6b4c3efc1681f3023402998a2</checksum><submitter>CN=urn:node:cnDevUNM2,DC=dataone,DC=org</submitter><rightsHolder>CN=testRightsHolder,DC=dataone,DC=org</rightsHolder><accessPolicy><allow><subject>CN=testRightsHolder,DC=dataone,DC=org</subject><permission>changePermission</permission></allow></accessPolicy><dateUploaded>2015-11-12T05:10:21.905+00:00</dateUploaded><dateSysMetadataModified>2015-11-12T05:10:21.906+00:00</dateSysMetadataModified><originMemberNode>urn:node:mnDevUCSB2</originMemberNode><authoritativeMemberNode>urn:node:mnDevUCSB2</authoritativeMemberNode></d1_v2.0:systemMetadata> [org.dataone.integration.ContextAwareTestCaseDataone]
20151112-05:10:22: [INFO]: rest call info: POST https://mn-dev-ucsb-2.test.dataone.org/metacat/d1/mn/v2/object; MMP message has: ParamPart:pid = testUpdateSystemMetadata_MutableRightsHolder_2015315211021887; FilePart:object = /tmp/mmp.output.5815259444156268646.tmp (17181 bytes); FilePart:sysmeta = /tmp/mmp.output.5981444173099879553.tmp (987 bytes);  [org.dataone.client.rest.RestClient]
20151112-05:10:22: [INFO]: object created.  pid = testUpdateSystemMetadata_MutableRightsHolder_2015315211021887 [org.dataone.integration.ContextAwareTestCaseDataone]
20151112-05:10:23: [INFO]: rest call info: GET https://mn-dev-ucsb-2.test.dataone.org/metacat/d1/mn/v2/meta/testUpdateSystemMetadata_MutableRightsHolder_2015315211021887 [org.dataone.client.rest.RestClient]
20151112-05:10:23: [INFO]: certificate directory: /etc/dataone/client/testClientCerts/ [org.dataone.integration.ContextAwareTestCaseDataone]
20151112-05:10:23: [INFO]: certificate filename: testPerson [org.dataone.integration.ContextAwareTestCaseDataone]
20151112-05:10:23: [INFO]: client setup as Subject: CN=testPerson,DC=dataone,DC=org [org.dataone.integration.ContextAwareTestCaseDataone]
20151112-05:10:28: [INFO]: rest call info: PUT https://mn-dev-ucsb-2.test.dataone.org/metacat/d1/mn/v2/meta; MMP message has: ParamPart:pid = testUpdateSystemMetadata_MutableRightsHolder_2015315211021887; FilePart:sysmeta = /tmp/mmp.output.1585549928429049717.tmp (1005 bytes);  [org.dataone.client.rest.RestClient]
20151112-05:10:39: [INFO]: rest call info: GET https://mn-dev-ucsb-2.test.dataone.org/metacat/d1/mn/v2/meta/testUpdateSystemMetadata_MutableRightsHolder_2015315211021887 [org.dataone.client.rest.RestClient]
20151112-05:10:39: [INFO]: 
***************** running test for testUpdateSystemMetadata_MutableRightsHolder(...) vs. node: https://mn-dev-unm-2.test.dataone.org/metacat/d1/mn ***************** [org.dataone.integration.ContextAwareTestCaseDataone]
20151112-05:10:39: [INFO]: certificate directory: /etc/dataone/client/testClientCerts/ [org.dataone.integration.ContextAwareTestCaseDataone]
20151112-05:10:39: [INFO]: certificate filename: cnDevUNM2 [org.dataone.integration.ContextAwareTestCaseDataone]
20151112-05:10:39: [INFO]: client setup as Subject: CN=urn:node:cnDevUNM2,DC=dataone,DC=org [org.dataone.integration.ContextAwareTestCaseDataone]
20151112-05:10:39: [INFO]: creating a test object.  pid = testUpdateSystemMetadata_MutableRightsHolder_2015315211039376 on https://mn-dev-unm-2.test.dataone.org/metacat/d1/mn/v2 [org.dataone.integration.ContextAwareTestCaseDataone]
20151112-05:10:39: [INFO]: SystemMetadata for pid: testUpdateSystemMetadata_MutableRightsHolder_2015315211039376
<?xml version="1.0" encoding="UTF-8"?><d1_v2.0:systemMetadata xmlns:d1_v2.0="http://ns.dataone.org/service/types/v2.0" xmlns:d1="http://ns.dataone.org/service/types/v1"><serialVersion>1</serialVersion><identifier>testUpdateSystemMetadata_MutableRightsHolder_2015315211039376</identifier><formatId>eml://ecoinformatics.org/eml-2.0.1</formatId><size>17181</size><checksum algorithm="MD5">03ce09c6b4c3efc1681f3023402998a2</checksum><submitter>CN=urn:node:cnDevUNM2,DC=dataone,DC=org</submitter><rightsHolder>CN=testRightsHolder,DC=dataone,DC=org</rightsHolder><accessPolicy><allow><subject>CN=testRightsHolder,DC=dataone,DC=org</subject><permission>changePermission</permission></allow></accessPolicy><dateUploaded>2015-11-12T05:10:39.394+00:00</dateUploaded><dateSysMetadataModified>2015-11-12T05:10:39.394+00:00</dateSysMetadataModified><originMemberNode>urn:node:mnDevUNM2</originMemberNode><authoritativeMemberNode>urn:node:mnDevUNM2</authoritativeMemberNode></d1_v2.0:systemMetadata> [org.dataone.integration.ContextAwareTestCaseDataone]
20151112-05:10:40: [INFO]: rest call info: POST https://mn-dev-unm-2.test.dataone.org/metacat/d1/mn/v2/object; MMP message has: ParamPart:pid = testUpdateSystemMetadata_MutableRightsHolder_2015315211039376; FilePart:object = /tmp/mmp.output.7962484880403663367.tmp (17181 bytes); FilePart:sysmeta = /tmp/mmp.output.872986984008137787.tmp (985 bytes);  [org.dataone.client.rest.RestClient]
20151112-05:10:40: [INFO]: object created.  pid = testUpdateSystemMetadata_MutableRightsHolder_2015315211039376 [org.dataone.integration.ContextAwareTestCaseDataone]
20151112-05:10:40: [INFO]: rest call info: GET https://mn-dev-unm-2.test.dataone.org/metacat/d1/mn/v2/meta/testUpdateSystemMetadata_MutableRightsHolder_2015315211039376 [org.dataone.client.rest.RestClient]
20151112-05:10:45: [INFO]: rest call info: PUT https://mn-dev-unm-2.test.dataone.org/metacat/d1/mn/v2/meta; MMP message has: ParamPart:pid = testUpdateSystemMetadata_MutableRightsHolder_2015315211039376; FilePart:sysmeta = /tmp/mmp.output.7440895632290795647.tmp (1003 bytes);  [org.dataone.client.rest.RestClient]
20151112-05:10:55: [INFO]: rest call info: GET https://mn-dev-unm-2.test.dataone.org/metacat/d1/mn/v2/meta/testUpdateSystemMetadata_MutableRightsHolder_2015315211039376 [org.dataone.client.rest.RestClient]
20151112-05:10:55: [INFO]: **************************************************** [org.dataone.integration.ContextAwareTestCaseDataone]
20151112-05:10:55: [INFO]: ***  context label:   DEV2 [org.dataone.integration.ContextAwareTestCaseDataone]
20151112-05:10:55: [INFO]: **************************************************** [org.dataone.integration.ContextAwareTestCaseDataone]
20151112-05:10:55: [INFO]: **************************************************** [org.dataone.integration.ContextAwareTestCaseDataone]
20151112-05:10:56: [INFO]: rest call info: GET https://mn-dev-ucsb-1.test.dataone.org/metacat/d1/mn/v2/monitor/ping [org.dataone.client.rest.RestClient]
20151112-05:10:56: [INFO]: MN excluded from test: https://mn-dev-ucsb-1.test.dataone.org/metacat/d1/mn [org.dataone.integration.ContextAwareTestCaseDataone]
20151112-05:10:56: [INFO]: rest call info: GET https://mn-dev-ucsb-2.test.dataone.org/metacat/d1/mn/v2/monitor/ping [org.dataone.client.rest.RestClient]
20151112-05:10:56: [INFO]: MN included in test: https://mn-dev-ucsb-2.test.dataone.org/metacat/d1/mn [org.dataone.integration.ContextAwareTestCaseDataone]
20151112-05:10:56: [INFO]: rest call info: GET https://mn-dev-unm-1.test.dataone.org/metacat/d1/mn/v2/monitor/ping [org.dataone.client.rest.RestClient]
20151112-05:10:56: [INFO]: MN excluded from test: https://mn-dev-unm-1.test.dataone.org/metacat/d1/mn [org.dataone.integration.ContextAwareTestCaseDataone]
20151112-05:10:56: [INFO]: rest call info: GET https://mn-dev-unm-2.test.dataone.org/metacat/d1/mn/v2/monitor/ping [org.dataone.client.rest.RestClient]
20151112-05:10:56: [INFO]: MN included in test: https://mn-dev-unm-2.test.dataone.org/metacat/d1/mn [org.dataone.integration.ContextAwareTestCaseDataone]
20151112-05:10:56: [INFO]: 
***************** running test for testUpdateSystemMetadata_MutableFormat(...) vs. node: https://mn-dev-ucsb-2.test.dataone.org/metacat/d1/mn ***************** [org.dataone.integration.ContextAwareTestCaseDataone]
20151112-05:10:56: [INFO]: certificate directory: /etc/dataone/client/testClientCerts/ [org.dataone.integration.ContextAwareTestCaseDataone]
20151112-05:10:56: [INFO]: certificate filename: cnDevUNM2 [org.dataone.integration.ContextAwareTestCaseDataone]
20151112-05:10:56: [INFO]: client setup as Subject: CN=urn:node:cnDevUNM2,DC=dataone,DC=org [org.dataone.integration.ContextAwareTestCaseDataone]
20151112-05:10:56: [INFO]: creating a test object.  pid = testUpdateSystemMetadata_MutableFormat_2015315211056204 on https://mn-dev-ucsb-2.test.dataone.org/metacat/d1/mn/v2 [org.dataone.integration.ContextAwareTestCaseDataone]
20151112-05:10:56: [INFO]: SystemMetadata for pid: testUpdateSystemMetadata_MutableFormat_2015315211056204
<?xml version="1.0" encoding="UTF-8"?><d1_v2.0:systemMetadata xmlns:d1_v2.0="http://ns.dataone.org/service/types/v2.0" xmlns:d1="http://ns.dataone.org/service/types/v1"><serialVersion>1</serialVersion><identifier>testUpdateSystemMetadata_MutableFormat_2015315211056204</identifier><formatId>eml://ecoinformatics.org/eml-2.0.1</formatId><size>17181</size><checksum algorithm="MD5">03ce09c6b4c3efc1681f3023402998a2</checksum><submitter>CN=urn:node:cnDevUNM2,DC=dataone,DC=org</submitter><rightsHolder>CN=testRightsHolder,DC=dataone,DC=org</rightsHolder><accessPolicy><allow><subject>CN=testRightsHolder,DC=dataone,DC=org</subject><permission>changePermission</permission></allow></accessPolicy><dateUploaded>2015-11-12T05:10:56.221+00:00</dateUploaded><dateSysMetadataModified>2015-11-12T05:10:56.221+00:00</dateSysMetadataModified><originMemberNode>urn:node:mnDevUCSB2</originMemberNode><authoritativeMemberNode>urn:node:mnDevUCSB2</authoritativeMemberNode></d1_v2.0:systemMetadata> [org.dataone.integration.ContextAwareTestCaseDataone]
20151112-05:10:57: [INFO]: rest call info: POST https://mn-dev-ucsb-2.test.dataone.org/metacat/d1/mn/v2/object; MMP message has: ParamPart:pid = testUpdateSystemMetadata_MutableFormat_2015315211056204; FilePart:object = /tmp/mmp.output.359677043709618231.tmp (17181 bytes); FilePart:sysmeta = /tmp/mmp.output.2011403421517208775.tmp (981 bytes);  [org.dataone.client.rest.RestClient]
20151112-05:10:57: [INFO]: object created.  pid = testUpdateSystemMetadata_MutableFormat_2015315211056204 [org.dataone.integration.ContextAwareTestCaseDataone]
20151112-05:10:57: [INFO]: rest call info: GET https://mn-dev-ucsb-2.test.dataone.org/metacat/d1/mn/v2/meta/testUpdateSystemMetadata_MutableFormat_2015315211056204 [org.dataone.client.rest.RestClient]
20151112-05:11:03: [INFO]: rest call info: PUT https://mn-dev-ucsb-2.test.dataone.org/metacat/d1/mn/v2/meta; MMP message has: ParamPart:pid = testUpdateSystemMetadata_MutableFormat_2015315211056204; FilePart:sysmeta = /tmp/mmp.output.6768577665194300887.tmp (980 bytes);  [org.dataone.client.rest.RestClient]
20151112-05:11:13: [INFO]: rest call info: GET https://mn-dev-ucsb-2.test.dataone.org/metacat/d1/mn/v2/meta/testUpdateSystemMetadata_MutableFormat_2015315211056204 [org.dataone.client.rest.RestClient]
20151112-05:11:13: [INFO]: 
***************** running test for testUpdateSystemMetadata_MutableFormat(...) vs. node: https://mn-dev-unm-2.test.dataone.org/metacat/d1/mn ***************** [org.dataone.integration.ContextAwareTestCaseDataone]
20151112-05:11:13: [INFO]: certificate directory: /etc/dataone/client/testClientCerts/ [org.dataone.integration.ContextAwareTestCaseDataone]
20151112-05:11:13: [INFO]: certificate filename: cnDevUNM2 [org.dataone.integration.ContextAwareTestCaseDataone]
20151112-05:11:13: [INFO]: client setup as Subject: CN=urn:node:cnDevUNM2,DC=dataone,DC=org [org.dataone.integration.ContextAwareTestCaseDataone]
20151112-05:11:13: [INFO]: creating a test object.  pid = testUpdateSystemMetadata_MutableFormat_2015315211113888 on https://mn-dev-unm-2.test.dataone.org/metacat/d1/mn/v2 [org.dataone.integration.ContextAwareTestCaseDataone]
20151112-05:11:13: [INFO]: SystemMetadata for pid: testUpdateSystemMetadata_MutableFormat_2015315211113888
<?xml version="1.0" encoding="UTF-8"?><d1_v2.0:systemMetadata xmlns:d1_v2.0="http://ns.dataone.org/service/types/v2.0" xmlns:d1="http://ns.dataone.org/service/types/v1"><serialVersion>1</serialVersion><identifier>testUpdateSystemMetadata_MutableFormat_2015315211113888</identifier><formatId>eml://ecoinformatics.org/eml-2.0.1</formatId><size>17181</size><checksum algorithm="MD5">03ce09c6b4c3efc1681f3023402998a2</checksum><submitter>CN=urn:node:cnDevUNM2,DC=dataone,DC=org</submitter><rightsHolder>CN=testRightsHolder,DC=dataone,DC=org</rightsHolder><accessPolicy><allow><subject>CN=testRightsHolder,DC=dataone,DC=org</subject><permission>changePermission</permission></allow></accessPolicy><dateUploaded>2015-11-12T05:11:13.907+00:00</dateUploaded><dateSysMetadataModified>2015-11-12T05:11:13.907+00:00</dateSysMetadataModified><originMemberNode>urn:node:mnDevUNM2</originMemberNode><authoritativeMemberNode>urn:node:mnDevUNM2</authoritativeMemberNode></d1_v2.0:systemMetadata> [org.dataone.integration.ContextAwareTestCaseDataone]
20151112-05:11:14: [INFO]: rest call info: POST https://mn-dev-unm-2.test.dataone.org/metacat/d1/mn/v2/object; MMP message has: ParamPart:pid = testUpdateSystemMetadata_MutableFormat_2015315211113888; FilePart:object = /tmp/mmp.output.1457435601099792379.tmp (17181 bytes); FilePart:sysmeta = /tmp/mmp.output.5265466852573225099.tmp (979 bytes);  [org.dataone.client.rest.RestClient]
20151112-05:11:14: [INFO]: object created.  pid = testUpdateSystemMetadata_MutableFormat_2015315211113888 [org.dataone.integration.ContextAwareTestCaseDataone]
20151112-05:11:14: [INFO]: rest call info: GET https://mn-dev-unm-2.test.dataone.org/metacat/d1/mn/v2/meta/testUpdateSystemMetadata_MutableFormat_2015315211113888 [org.dataone.client.rest.RestClient]
20151112-05:11:20: [INFO]: rest call info: PUT https://mn-dev-unm-2.test.dataone.org/metacat/d1/mn/v2/meta; MMP message has: ParamPart:pid = testUpdateSystemMetadata_MutableFormat_2015315211113888; FilePart:sysmeta = /tmp/mmp.output.7547687435387170390.tmp (978 bytes);  [org.dataone.client.rest.RestClient]
20151112-05:11:30: [INFO]: rest call info: GET https://mn-dev-unm-2.test.dataone.org/metacat/d1/mn/v2/meta/testUpdateSystemMetadata_MutableFormat_2015315211113888 [org.dataone.client.rest.RestClient]
20151112-05:11:30: [INFO]: **************************************************** [org.dataone.integration.ContextAwareTestCaseDataone]
20151112-05:11:30: [INFO]: ***  context label:   DEV2 [org.dataone.integration.ContextAwareTestCaseDataone]
20151112-05:11:30: [INFO]: **************************************************** [org.dataone.integration.ContextAwareTestCaseDataone]
20151112-05:11:30: [INFO]: **************************************************** [org.dataone.integration.ContextAwareTestCaseDataone]
20151112-05:11:30: [INFO]: rest call info: GET https://mn-dev-ucsb-1.test.dataone.org/metacat/d1/mn/v2/monitor/ping [org.dataone.client.rest.RestClient]
20151112-05:11:30: [INFO]: MN excluded from test: https://mn-dev-ucsb-1.test.dataone.org/metacat/d1/mn [org.dataone.integration.ContextAwareTestCaseDataone]
20151112-05:11:30: [INFO]: rest call info: GET https://mn-dev-ucsb-2.test.dataone.org/metacat/d1/mn/v2/monitor/ping [org.dataone.client.rest.RestClient]
20151112-05:11:30: [INFO]: MN included in test: https://mn-dev-ucsb-2.test.dataone.org/metacat/d1/mn [org.dataone.integration.ContextAwareTestCaseDataone]
20151112-05:11:30: [INFO]: rest call info: GET https://mn-dev-unm-1.test.dataone.org/metacat/d1/mn/v2/monitor/ping [org.dataone.client.rest.RestClient]
20151112-05:11:30: [INFO]: MN excluded from test: https://mn-dev-unm-1.test.dataone.org/metacat/d1/mn [org.dataone.integration.ContextAwareTestCaseDataone]
20151112-05:11:30: [INFO]: rest call info: GET https://mn-dev-unm-2.test.dataone.org/metacat/d1/mn/v2/monitor/ping [org.dataone.client.rest.RestClient]
20151112-05:11:30: [INFO]: MN included in test: https://mn-dev-unm-2.test.dataone.org/metacat/d1/mn [org.dataone.integration.ContextAwareTestCaseDataone]
20151112-05:11:30: [INFO]: 
***************** running test for testUpdateSystemMetadata_MutableAccessPolicy(...) vs. node: https://mn-dev-ucsb-2.test.dataone.org/metacat/d1/mn ***************** [org.dataone.integration.ContextAwareTestCaseDataone]
20151112-05:11:30: [INFO]: certificate directory: /etc/dataone/client/testClientCerts/ [org.dataone.integration.ContextAwareTestCaseDataone]
20151112-05:11:30: [INFO]: certificate filename: cnDevUNM2 [org.dataone.integration.ContextAwareTestCaseDataone]
20151112-05:11:30: [INFO]: client setup as Subject: CN=urn:node:cnDevUNM2,DC=dataone,DC=org [org.dataone.integration.ContextAwareTestCaseDataone]
20151112-05:11:30: [INFO]: creating a test object.  pid = testUpdateSystemMetadata_MutableAccessPolicy_2015315211130652 on https://mn-dev-ucsb-2.test.dataone.org/metacat/d1/mn/v2 [org.dataone.integration.ContextAwareTestCaseDataone]
20151112-05:11:30: [INFO]: SystemMetadata for pid: testUpdateSystemMetadata_MutableAccessPolicy_2015315211130652
<?xml version="1.0" encoding="UTF-8"?><d1_v2.0:systemMetadata xmlns:d1_v2.0="http://ns.dataone.org/service/types/v2.0" xmlns:d1="http://ns.dataone.org/service/types/v1"><serialVersion>1</serialVersion><identifier>testUpdateSystemMetadata_MutableAccessPolicy_2015315211130652</identifier><formatId>eml://ecoinformatics.org/eml-2.0.1</formatId><size>17181</size><checksum algorithm="MD5">03ce09c6b4c3efc1681f3023402998a2</checksum><submitter>CN=urn:node:cnDevUNM2,DC=dataone,DC=org</submitter><rightsHolder>CN=testRightsHolder,DC=dataone,DC=org</rightsHolder><accessPolicy><allow><subject>CN=testRightsHolder,DC=dataone,DC=org</subject><permission>changePermission</permission></allow></accessPolicy><dateUploaded>2015-11-12T05:11:30.669+00:00</dateUploaded><dateSysMetadataModified>2015-11-12T05:11:30.669+00:00</dateSysMetadataModified><originMemberNode>urn:node:mnDevUCSB2</originMemberNode><authoritativeMemberNode>urn:node:mnDevUCSB2</authoritativeMemberNode></d1_v2.0:systemMetadata> [org.dataone.integration.ContextAwareTestCaseDataone]
20151112-05:11:32: [INFO]: rest call info: POST https://mn-dev-ucsb-2.test.dataone.org/metacat/d1/mn/v2/object; MMP message has: ParamPart:pid = testUpdateSystemMetadata_MutableAccessPolicy_2015315211130652; FilePart:object = /tmp/mmp.output.8139311141660884927.tmp (17181 bytes); FilePart:sysmeta = /tmp/mmp.output.1566818278795790787.tmp (987 bytes);  [org.dataone.client.rest.RestClient]
20151112-05:11:32: [INFO]: object created.  pid = testUpdateSystemMetadata_MutableAccessPolicy_2015315211130652 [org.dataone.integration.ContextAwareTestCaseDataone]
20151112-05:11:32: [INFO]: rest call info: GET https://mn-dev-ucsb-2.test.dataone.org/metacat/d1/mn/v2/meta/testUpdateSystemMetadata_MutableAccessPolicy_2015315211130652 [org.dataone.client.rest.RestClient]
20151112-05:11:32: [INFO]: certificate directory: /etc/dataone/client/testClientCerts/ [org.dataone.integration.ContextAwareTestCaseDataone]
20151112-05:11:32: [INFO]: certificate filename: testGroup [org.dataone.integration.ContextAwareTestCaseDataone]
20151112-05:11:32: [INFO]: client setup as Subject: public [org.dataone.integration.ContextAwareTestCaseDataone]
20151112-05:11:38: [INFO]: rest call info: PUT https://mn-dev-ucsb-2.test.dataone.org/metacat/d1/mn/v2/meta; MMP message has: ParamPart:pid = testUpdateSystemMetadata_MutableAccessPolicy_2015315211130652; FilePart:sysmeta = /tmp/mmp.output.6792416262819517671.tmp (980 bytes);  [org.dataone.client.rest.RestClient]
20151112-05:11:48: [INFO]: rest call info: GET https://mn-dev-ucsb-2.test.dataone.org/metacat/d1/mn/v2/meta/testUpdateSystemMetadata_MutableAccessPolicy_2015315211130652 [org.dataone.client.rest.RestClient]
20151112-05:11:48: [INFO]: 
***************** running test for testUpdateSystemMetadata_MutableAccessPolicy(...) vs. node: https://mn-dev-unm-2.test.dataone.org/metacat/d1/mn ***************** [org.dataone.integration.ContextAwareTestCaseDataone]
20151112-05:11:48: [INFO]: certificate directory: /etc/dataone/client/testClientCerts/ [org.dataone.integration.ContextAwareTestCaseDataone]
20151112-05:11:48: [INFO]: certificate filename: cnDevUNM2 [org.dataone.integration.ContextAwareTestCaseDataone]
20151112-05:11:48: [INFO]: client setup as Subject: CN=urn:node:cnDevUNM2,DC=dataone,DC=org [org.dataone.integration.ContextAwareTestCaseDataone]
20151112-05:11:48: [INFO]: creating a test object.  pid = testUpdateSystemMetadata_MutableAccessPolicy_2015315211148855 on https://mn-dev-unm-2.test.dataone.org/metacat/d1/mn/v2 [org.dataone.integration.ContextAwareTestCaseDataone]
20151112-05:11:48: [INFO]: SystemMetadata for pid: testUpdateSystemMetadata_MutableAccessPolicy_2015315211148855
<?xml version="1.0" encoding="UTF-8"?><d1_v2.0:systemMetadata xmlns:d1_v2.0="http://ns.dataone.org/service/types/v2.0" xmlns:d1="http://ns.dataone.org/service/types/v1"><serialVersion>1</serialVersion><identifier>testUpdateSystemMetadata_MutableAccessPolicy_2015315211148855</identifier><formatId>eml://ecoinformatics.org/eml-2.0.1</formatId><size>17181</size><checksum algorithm="MD5">03ce09c6b4c3efc1681f3023402998a2</checksum><submitter>CN=urn:node:cnDevUNM2,DC=dataone,DC=org</submitter><rightsHolder>CN=testRightsHolder,DC=dataone,DC=org</rightsHolder><accessPolicy><allow><subject>CN=testRightsHolder,DC=dataone,DC=org</subject><permission>changePermission</permission></allow></accessPolicy><dateUploaded>2015-11-12T05:11:48.871+00:00</dateUploaded><dateSysMetadataModified>2015-11-12T05:11:48.871+00:00</dateSysMetadataModified><originMemberNode>urn:node:mnDevUNM2</originMemberNode><authoritativeMemberNode>urn:node:mnDevUNM2</authoritativeMemberNode></d1_v2.0:systemMetadata> [org.dataone.integration.ContextAwareTestCaseDataone]
20151112-05:11:49: [INFO]: rest call info: POST https://mn-dev-unm-2.test.dataone.org/metacat/d1/mn/v2/object; MMP message has: ParamPart:pid = testUpdateSystemMetadata_MutableAccessPolicy_2015315211148855; FilePart:object = /tmp/mmp.output.1012634496111224466.tmp (17181 bytes); FilePart:sysmeta = /tmp/mmp.output.5487542020863552006.tmp (985 bytes);  [org.dataone.client.rest.RestClient]
20151112-05:11:49: [INFO]: object created.  pid = testUpdateSystemMetadata_MutableAccessPolicy_2015315211148855 [org.dataone.integration.ContextAwareTestCaseDataone]
20151112-05:11:49: [INFO]: rest call info: GET https://mn-dev-unm-2.test.dataone.org/metacat/d1/mn/v2/meta/testUpdateSystemMetadata_MutableAccessPolicy_2015315211148855 [org.dataone.client.rest.RestClient]
20151112-05:11:55: [INFO]: rest call info: PUT https://mn-dev-unm-2.test.dataone.org/metacat/d1/mn/v2/meta; MMP message has: ParamPart:pid = testUpdateSystemMetadata_MutableAccessPolicy_2015315211148855; FilePart:sysmeta = /tmp/mmp.output.6975869229158940122.tmp (978 bytes);  [org.dataone.client.rest.RestClient]
20151112-05:12:05: [INFO]: rest call info: GET https://mn-dev-unm-2.test.dataone.org/metacat/d1/mn/v2/meta/testUpdateSystemMetadata_MutableAccessPolicy_2015315211148855 [org.dataone.client.rest.RestClient]
20151112-05:12:05: [INFO]: **************************************************** [org.dataone.integration.ContextAwareTestCaseDataone]
20151112-05:12:05: [INFO]: ***  context label:   DEV2 [org.dataone.integration.ContextAwareTestCaseDataone]
20151112-05:12:05: [INFO]: **************************************************** [org.dataone.integration.ContextAwareTestCaseDataone]
20151112-05:12:05: [INFO]: **************************************************** [org.dataone.integration.ContextAwareTestCaseDataone]
20151112-05:12:05: [INFO]: rest call info: GET https://mn-dev-ucsb-1.test.dataone.org/metacat/d1/mn/v2/monitor/ping [org.dataone.client.rest.RestClient]
20151112-05:12:05: [INFO]: MN excluded from test: https://mn-dev-ucsb-1.test.dataone.org/metacat/d1/mn [org.dataone.integration.ContextAwareTestCaseDataone]
20151112-05:12:05: [INFO]: rest call info: GET https://mn-dev-ucsb-2.test.dataone.org/metacat/d1/mn/v2/monitor/ping [org.dataone.client.rest.RestClient]
20151112-05:12:05: [INFO]: MN included in test: https://mn-dev-ucsb-2.test.dataone.org/metacat/d1/mn [org.dataone.integration.ContextAwareTestCaseDataone]
20151112-05:12:05: [INFO]: rest call info: GET https://mn-dev-unm-1.test.dataone.org/metacat/d1/mn/v2/monitor/ping [org.dataone.client.rest.RestClient]
20151112-05:12:05: [INFO]: MN excluded from test: https://mn-dev-unm-1.test.dataone.org/metacat/d1/mn [org.dataone.integration.ContextAwareTestCaseDataone]
20151112-05:12:05: [INFO]: rest call info: GET https://mn-dev-unm-2.test.dataone.org/metacat/d1/mn/v2/monitor/ping [org.dataone.client.rest.RestClient]
20151112-05:12:05: [INFO]: MN included in test: https://mn-dev-unm-2.test.dataone.org/metacat/d1/mn [org.dataone.integration.ContextAwareTestCaseDataone]
20151112-05:12:05: [INFO]: 
***************** running test for testUpdateSystemMetadata_MutableReplPolicy(...) vs. node: https://mn-dev-ucsb-2.test.dataone.org/metacat/d1/mn ***************** [org.dataone.integration.ContextAwareTestCaseDataone]
20151112-05:12:05: [INFO]: certificate directory: /etc/dataone/client/testClientCerts/ [org.dataone.integration.ContextAwareTestCaseDataone]
20151112-05:12:05: [INFO]: certificate filename: cnDevUNM2 [org.dataone.integration.ContextAwareTestCaseDataone]
20151112-05:12:05: [INFO]: client setup as Subject: CN=urn:node:cnDevUNM2,DC=dataone,DC=org [org.dataone.integration.ContextAwareTestCaseDataone]
20151112-05:12:05: [INFO]: creating a test object.  pid = testUpdateSystemMetadata_MutableReplPolicy_201531521125601 on https://mn-dev-ucsb-2.test.dataone.org/metacat/d1/mn/v2 [org.dataone.integration.ContextAwareTestCaseDataone]
20151112-05:12:05: [INFO]: SystemMetadata for pid: testUpdateSystemMetadata_MutableReplPolicy_201531521125601
<?xml version="1.0" encoding="UTF-8"?><d1_v2.0:systemMetadata xmlns:d1_v2.0="http://ns.dataone.org/service/types/v2.0" xmlns:d1="http://ns.dataone.org/service/types/v1"><serialVersion>1</serialVersion><identifier>testUpdateSystemMetadata_MutableReplPolicy_201531521125601</identifier><formatId>eml://ecoinformatics.org/eml-2.0.1</formatId><size>17181</size><checksum algorithm="MD5">03ce09c6b4c3efc1681f3023402998a2</checksum><submitter>CN=urn:node:cnDevUNM2,DC=dataone,DC=org</submitter><rightsHolder>CN=testRightsHolder,DC=dataone,DC=org</rightsHolder><accessPolicy><allow><subject>CN=testRightsHolder,DC=dataone,DC=org</subject><permission>changePermission</permission></allow></accessPolicy><dateUploaded>2015-11-12T05:12:05.617+00:00</dateUploaded><dateSysMetadataModified>2015-11-12T05:12:05.617+00:00</dateSysMetadataModified><originMemberNode>urn:node:mnDevUCSB2</originMemberNode><authoritativeMemberNode>urn:node:mnDevUCSB2</authoritativeMemberNode></d1_v2.0:systemMetadata> [org.dataone.integration.ContextAwareTestCaseDataone]
20151112-05:12:06: [INFO]: rest call info: POST https://mn-dev-ucsb-2.test.dataone.org/metacat/d1/mn/v2/object; MMP message has: ParamPart:pid = testUpdateSystemMetadata_MutableReplPolicy_201531521125601; FilePart:object = /tmp/mmp.output.2188701678407568082.tmp (17181 bytes); FilePart:sysmeta = /tmp/mmp.output.2172328850942562358.tmp (984 bytes);  [org.dataone.client.rest.RestClient]
20151112-05:12:06: [INFO]: object created.  pid = testUpdateSystemMetadata_MutableReplPolicy_201531521125601 [org.dataone.integration.ContextAwareTestCaseDataone]
20151112-05:12:07: [INFO]: rest call info: GET https://mn-dev-ucsb-2.test.dataone.org/metacat/d1/mn/v2/meta/testUpdateSystemMetadata_MutableReplPolicy_201531521125601 [org.dataone.client.rest.RestClient]
20151112-05:12:12: [INFO]: rest call info: PUT https://mn-dev-ucsb-2.test.dataone.org/metacat/d1/mn/v2/meta; MMP message has: ParamPart:pid = testUpdateSystemMetadata_MutableReplPolicy_201531521125601; FilePart:sysmeta = /tmp/mmp.output.8839037665824765721.tmp (1075 bytes);  [org.dataone.client.rest.RestClient]
20151112-05:12:23: [INFO]: rest call info: GET https://mn-dev-ucsb-2.test.dataone.org/metacat/d1/mn/v2/meta/testUpdateSystemMetadata_MutableReplPolicy_201531521125601 [org.dataone.client.rest.RestClient]
20151112-05:12:23: [INFO]: 
***************** running test for testUpdateSystemMetadata_MutableReplPolicy(...) vs. node: https://mn-dev-unm-2.test.dataone.org/metacat/d1/mn ***************** [org.dataone.integration.ContextAwareTestCaseDataone]
20151112-05:12:23: [INFO]: certificate directory: /etc/dataone/client/testClientCerts/ [org.dataone.integration.ContextAwareTestCaseDataone]
20151112-05:12:23: [INFO]: certificate filename: cnDevUNM2 [org.dataone.integration.ContextAwareTestCaseDataone]
20151112-05:12:23: [INFO]: client setup as Subject: CN=urn:node:cnDevUNM2,DC=dataone,DC=org [org.dataone.integration.ContextAwareTestCaseDataone]
20151112-05:12:23: [INFO]: creating a test object.  pid = testUpdateSystemMetadata_MutableReplPolicy_2015315211223150 on https://mn-dev-unm-2.test.dataone.org/metacat/d1/mn/v2 [org.dataone.integration.ContextAwareTestCaseDataone]
20151112-05:12:23: [INFO]: SystemMetadata for pid: testUpdateSystemMetadata_MutableReplPolicy_2015315211223150
<?xml version="1.0" encoding="UTF-8"?><d1_v2.0:systemMetadata xmlns:d1_v2.0="http://ns.dataone.org/service/types/v2.0" xmlns:d1="http://ns.dataone.org/service/types/v1"><serialVersion>1</serialVersion><identifier>testUpdateSystemMetadata_MutableReplPolicy_2015315211223150</identifier><formatId>eml://ecoinformatics.org/eml-2.0.1</formatId><size>17181</size><checksum algorithm="MD5">03ce09c6b4c3efc1681f3023402998a2</checksum><submitter>CN=urn:node:cnDevUNM2,DC=dataone,DC=org</submitter><rightsHolder>CN=testRightsHolder,DC=dataone,DC=org</rightsHolder><accessPolicy><allow><subject>CN=testRightsHolder,DC=dataone,DC=org</subject><permission>changePermission</permission></allow></accessPolicy><dateUploaded>2015-11-12T05:12:23.165+00:00</dateUploaded><dateSysMetadataModified>2015-11-12T05:12:23.165+00:00</dateSysMetadataModified><originMemberNode>urn:node:mnDevUNM2</originMemberNode><authoritativeMemberNode>urn:node:mnDevUNM2</authoritativeMemberNode></d1_v2.0:systemMetadata> [org.dataone.integration.ContextAwareTestCaseDataone]
20151112-05:12:24: [INFO]: rest call info: POST https://mn-dev-unm-2.test.dataone.org/metacat/d1/mn/v2/object; MMP message has: ParamPart:pid = testUpdateSystemMetadata_MutableReplPolicy_2015315211223150; FilePart:object = /tmp/mmp.output.1825031127062435590.tmp (17181 bytes); FilePart:sysmeta = /tmp/mmp.output.3721061476099120584.tmp (983 bytes);  [org.dataone.client.rest.RestClient]
20151112-05:12:24: [INFO]: object created.  pid = testUpdateSystemMetadata_MutableReplPolicy_2015315211223150 [org.dataone.integration.ContextAwareTestCaseDataone]
20151112-05:12:24: [INFO]: rest call info: GET https://mn-dev-unm-2.test.dataone.org/metacat/d1/mn/v2/meta/testUpdateSystemMetadata_MutableReplPolicy_2015315211223150 [org.dataone.client.rest.RestClient]
20151112-05:12:29: [INFO]: rest call info: PUT https://mn-dev-unm-2.test.dataone.org/metacat/d1/mn/v2/meta; MMP message has: ParamPart:pid = testUpdateSystemMetadata_MutableReplPolicy_2015315211223150; FilePart:sysmeta = /tmp/mmp.output.5146840086529711781.tmp (1074 bytes);  [org.dataone.client.rest.RestClient]
20151112-05:12:39: [INFO]: rest call info: GET https://mn-dev-unm-2.test.dataone.org/metacat/d1/mn/v2/meta/testUpdateSystemMetadata_MutableReplPolicy_2015315211223150 [org.dataone.client.rest.RestClient]
20151112-05:12:39: [INFO]: **************************************************** [org.dataone.integration.ContextAwareTestCaseDataone]
20151112-05:12:39: [INFO]: ***  context label:   DEV2 [org.dataone.integration.ContextAwareTestCaseDataone]
20151112-05:12:39: [INFO]: **************************************************** [org.dataone.integration.ContextAwareTestCaseDataone]
20151112-05:12:39: [INFO]: **************************************************** [org.dataone.integration.ContextAwareTestCaseDataone]
20151112-05:12:39: [INFO]: rest call info: GET https://mn-dev-ucsb-1.test.dataone.org/metacat/d1/mn/v2/monitor/ping [org.dataone.client.rest.RestClient]
20151112-05:12:39: [INFO]: MN excluded from test: https://mn-dev-ucsb-1.test.dataone.org/metacat/d1/mn [org.dataone.integration.ContextAwareTestCaseDataone]
20151112-05:12:39: [INFO]: rest call info: GET https://mn-dev-ucsb-2.test.dataone.org/metacat/d1/mn/v2/monitor/ping [org.dataone.client.rest.RestClient]
20151112-05:12:39: [INFO]: MN included in test: https://mn-dev-ucsb-2.test.dataone.org/metacat/d1/mn [org.dataone.integration.ContextAwareTestCaseDataone]
20151112-05:12:39: [INFO]: rest call info: GET https://mn-dev-unm-1.test.dataone.org/metacat/d1/mn/v2/monitor/ping [org.dataone.client.rest.RestClient]
20151112-05:12:40: [INFO]: MN excluded from test: https://mn-dev-unm-1.test.dataone.org/metacat/d1/mn [org.dataone.integration.ContextAwareTestCaseDataone]
20151112-05:12:40: [INFO]: rest call info: GET https://mn-dev-unm-2.test.dataone.org/metacat/d1/mn/v2/monitor/ping [org.dataone.client.rest.RestClient]
20151112-05:12:40: [INFO]: MN included in test: https://mn-dev-unm-2.test.dataone.org/metacat/d1/mn [org.dataone.integration.ContextAwareTestCaseDataone]
20151112-05:12:40: [INFO]: 
***************** running test for testUpdateSystemMetadata_MutableAuthMN(...) vs. node: https://mn-dev-ucsb-2.test.dataone.org/metacat/d1/mn ***************** [org.dataone.integration.ContextAwareTestCaseDataone]
20151112-05:12:40: [INFO]: certificate directory: /etc/dataone/client/testClientCerts/ [org.dataone.integration.ContextAwareTestCaseDataone]
20151112-05:12:40: [INFO]: certificate filename: cnDevUNM2 [org.dataone.integration.ContextAwareTestCaseDataone]
20151112-05:12:40: [INFO]: client setup as Subject: CN=urn:node:cnDevUNM2,DC=dataone,DC=org [org.dataone.integration.ContextAwareTestCaseDataone]
20151112-05:12:40: [INFO]: creating a test object.  pid = testUpdateSystemMetadata_MutableAuthMN_201531521124023 on https://mn-dev-ucsb-2.test.dataone.org/metacat/d1/mn/v2 [org.dataone.integration.ContextAwareTestCaseDataone]
20151112-05:12:40: [INFO]: SystemMetadata for pid: testUpdateSystemMetadata_MutableAuthMN_201531521124023
<?xml version="1.0" encoding="UTF-8"?><d1_v2.0:systemMetadata xmlns:d1_v2.0="http://ns.dataone.org/service/types/v2.0" xmlns:d1="http://ns.dataone.org/service/types/v1"><serialVersion>1</serialVersion><identifier>testUpdateSystemMetadata_MutableAuthMN_201531521124023</identifier><formatId>eml://ecoinformatics.org/eml-2.0.1</formatId><size>17181</size><checksum algorithm="MD5">03ce09c6b4c3efc1681f3023402998a2</checksum><submitter>CN=urn:node:cnDevUNM2,DC=dataone,DC=org</submitter><rightsHolder>CN=testRightsHolder,DC=dataone,DC=org</rightsHolder><accessPolicy><allow><subject>CN=testRightsHolder,DC=dataone,DC=org</subject><permission>changePermission</permission></allow></accessPolicy><dateUploaded>2015-11-12T05:12:40.040+00:00</dateUploaded><dateSysMetadataModified>2015-11-12T05:12:40.040+00:00</dateSysMetadataModified><originMemberNode>urn:node:mnDevUCSB2</originMemberNode><authoritativeMemberNode>urn:node:mnDevUCSB2</authoritativeMemberNode></d1_v2.0:systemMetadata> [org.dataone.integration.ContextAwareTestCaseDataone]
20151112-05:12:41: [INFO]: rest call info: POST https://mn-dev-ucsb-2.test.dataone.org/metacat/d1/mn/v2/object; MMP message has: ParamPart:pid = testUpdateSystemMetadata_MutableAuthMN_201531521124023; FilePart:object = /tmp/mmp.output.4348804642837930294.tmp (17181 bytes); FilePart:sysmeta = /tmp/mmp.output.5158303204629170658.tmp (980 bytes);  [org.dataone.client.rest.RestClient]
20151112-05:12:41: [INFO]: object created.  pid = testUpdateSystemMetadata_MutableAuthMN_201531521124023 [org.dataone.integration.ContextAwareTestCaseDataone]
20151112-05:12:41: [INFO]: rest call info: GET https://mn-dev-ucsb-2.test.dataone.org/metacat/d1/mn/v2/meta/testUpdateSystemMetadata_MutableAuthMN_201531521124023 [org.dataone.client.rest.RestClient]
20151112-05:12:41: [INFO]: rest call info: GET https://cn-dev-ucsb-2.test.dataone.org/cn/v2/node [org.dataone.client.rest.RestClient]
20151112-05:12:41: [WARN]: MN.updateSystemMetadata() returned a ServiceFailure. [org.dataone.integration.it.ContextAwareAdapter]
20151112-05:12:41: [INFO]: 
***************** running test for testUpdateSystemMetadata_MutableAuthMN(...) vs. node: https://mn-dev-unm-2.test.dataone.org/metacat/d1/mn ***************** [org.dataone.integration.ContextAwareTestCaseDataone]
20151112-05:12:41: [INFO]: certificate directory: /etc/dataone/client/testClientCerts/ [org.dataone.integration.ContextAwareTestCaseDataone]
20151112-05:12:41: [INFO]: certificate filename: cnDevUNM2 [org.dataone.integration.ContextAwareTestCaseDataone]
20151112-05:12:41: [INFO]: client setup as Subject: CN=urn:node:cnDevUNM2,DC=dataone,DC=org [org.dataone.integration.ContextAwareTestCaseDataone]
20151112-05:12:41: [INFO]: creating a test object.  pid = testUpdateSystemMetadata_MutableAuthMN_2015315211241761 on https://mn-dev-unm-2.test.dataone.org/metacat/d1/mn/v2 [org.dataone.integration.ContextAwareTestCaseDataone]
20151112-05:12:41: [INFO]: SystemMetadata for pid: testUpdateSystemMetadata_MutableAuthMN_2015315211241761
<?xml version="1.0" encoding="UTF-8"?><d1_v2.0:systemMetadata xmlns:d1_v2.0="http://ns.dataone.org/service/types/v2.0" xmlns:d1="http://ns.dataone.org/service/types/v1"><serialVersion>1</serialVersion><identifier>testUpdateSystemMetadata_MutableAuthMN_2015315211241761</identifier><formatId>eml://ecoinformatics.org/eml-2.0.1</formatId><size>17181</size><checksum algorithm="MD5">03ce09c6b4c3efc1681f3023402998a2</checksum><submitter>CN=urn:node:cnDevUNM2,DC=dataone,DC=org</submitter><rightsHolder>CN=testRightsHolder,DC=dataone,DC=org</rightsHolder><accessPolicy><allow><subject>CN=testRightsHolder,DC=dataone,DC=org</subject><permission>changePermission</permission></allow></accessPolicy><dateUploaded>2015-11-12T05:12:41.775+00:00</dateUploaded><dateSysMetadataModified>2015-11-12T05:12:41.775+00:00</dateSysMetadataModified><originMemberNode>urn:node:mnDevUNM2</originMemberNode><authoritativeMemberNode>urn:node:mnDevUNM2</authoritativeMemberNode></d1_v2.0:systemMetadata> [org.dataone.integration.ContextAwareTestCaseDataone]
20151112-05:12:42: [INFO]: rest call info: POST https://mn-dev-unm-2.test.dataone.org/metacat/d1/mn/v2/object; MMP message has: ParamPart:pid = testUpdateSystemMetadata_MutableAuthMN_2015315211241761; FilePart:object = /tmp/mmp.output.3419011523762292760.tmp (17181 bytes); FilePart:sysmeta = /tmp/mmp.output.7802854402551163613.tmp (979 bytes);  [org.dataone.client.rest.RestClient]
20151112-05:12:42: [INFO]: object created.  pid = testUpdateSystemMetadata_MutableAuthMN_2015315211241761 [org.dataone.integration.ContextAwareTestCaseDataone]
20151112-05:12:42: [INFO]: rest call info: GET https://mn-dev-unm-2.test.dataone.org/metacat/d1/mn/v2/meta/testUpdateSystemMetadata_MutableAuthMN_2015315211241761 [org.dataone.client.rest.RestClient]
20151112-05:12:42: [INFO]: rest call info: GET https://cn-dev-ucsb-2.test.dataone.org/cn/v2/node [org.dataone.client.rest.RestClient]
20151112-05:12:42: [WARN]: MN.updateSystemMetadata() returned a ServiceFailure. [org.dataone.integration.it.ContextAwareAdapter]
20151112-05:12:42: [INFO]: **************************************************** [org.dataone.integration.ContextAwareTestCaseDataone]
20151112-05:12:42: [INFO]: ***  context label:   DEV2 [org.dataone.integration.ContextAwareTestCaseDataone]
20151112-05:12:42: [INFO]: **************************************************** [org.dataone.integration.ContextAwareTestCaseDataone]
20151112-05:12:42: [INFO]: **************************************************** [org.dataone.integration.ContextAwareTestCaseDataone]
20151112-05:12:43: [INFO]: rest call info: GET https://mn-dev-ucsb-1.test.dataone.org/metacat/d1/mn/v2/monitor/ping [org.dataone.client.rest.RestClient]
20151112-05:12:43: [INFO]: MN excluded from test: https://mn-dev-ucsb-1.test.dataone.org/metacat/d1/mn [org.dataone.integration.ContextAwareTestCaseDataone]
20151112-05:12:43: [INFO]: rest call info: GET https://mn-dev-ucsb-2.test.dataone.org/metacat/d1/mn/v2/monitor/ping [org.dataone.client.rest.RestClient]
20151112-05:12:43: [INFO]: MN included in test: https://mn-dev-ucsb-2.test.dataone.org/metacat/d1/mn [org.dataone.integration.ContextAwareTestCaseDataone]
20151112-05:12:43: [INFO]: rest call info: GET https://mn-dev-unm-1.test.dataone.org/metacat/d1/mn/v2/monitor/ping [org.dataone.client.rest.RestClient]
20151112-05:12:43: [INFO]: MN excluded from test: https://mn-dev-unm-1.test.dataone.org/metacat/d1/mn [org.dataone.integration.ContextAwareTestCaseDataone]
20151112-05:12:43: [INFO]: rest call info: GET https://mn-dev-unm-2.test.dataone.org/metacat/d1/mn/v2/monitor/ping [org.dataone.client.rest.RestClient]
20151112-05:12:43: [INFO]: MN included in test: https://mn-dev-unm-2.test.dataone.org/metacat/d1/mn [org.dataone.integration.ContextAwareTestCaseDataone]
20151112-05:12:43: [INFO]: 
***************** running test for testUpdateSystemMetadata_MutableArchived(...) vs. node: https://mn-dev-ucsb-2.test.dataone.org/metacat/d1/mn ***************** [org.dataone.integration.ContextAwareTestCaseDataone]
20151112-05:12:43: [INFO]: certificate directory: /etc/dataone/client/testClientCerts/ [org.dataone.integration.ContextAwareTestCaseDataone]
20151112-05:12:43: [INFO]: certificate filename: cnDevUNM2 [org.dataone.integration.ContextAwareTestCaseDataone]
20151112-05:12:43: [INFO]: client setup as Subject: CN=urn:node:cnDevUNM2,DC=dataone,DC=org [org.dataone.integration.ContextAwareTestCaseDataone]
20151112-05:12:43: [INFO]: creating a test object.  pid = testUpdateSystemMetadata_MutableArchived_2015315211243191 on https://mn-dev-ucsb-2.test.dataone.org/metacat/d1/mn/v2 [org.dataone.integration.ContextAwareTestCaseDataone]
20151112-05:12:43: [INFO]: SystemMetadata for pid: testUpdateSystemMetadata_MutableArchived_2015315211243191
<?xml version="1.0" encoding="UTF-8"?><d1_v2.0:systemMetadata xmlns:d1_v2.0="http://ns.dataone.org/service/types/v2.0" xmlns:d1="http://ns.dataone.org/service/types/v1"><serialVersion>1</serialVersion><identifier>testUpdateSystemMetadata_MutableArchived_2015315211243191</identifier><formatId>eml://ecoinformatics.org/eml-2.0.1</formatId><size>17181</size><checksum algorithm="MD5">03ce09c6b4c3efc1681f3023402998a2</checksum><submitter>CN=urn:node:cnDevUNM2,DC=dataone,DC=org</submitter><rightsHolder>CN=testRightsHolder,DC=dataone,DC=org</rightsHolder><accessPolicy><allow><subject>CN=testRightsHolder,DC=dataone,DC=org</subject><permission>changePermission</permission></allow></accessPolicy><dateUploaded>2015-11-12T05:12:43.206+00:00</dateUploaded><dateSysMetadataModified>2015-11-12T05:12:43.206+00:00</dateSysMetadataModified><originMemberNode>urn:node:mnDevUCSB2</originMemberNode><authoritativeMemberNode>urn:node:mnDevUCSB2</authoritativeMemberNode></d1_v2.0:systemMetadata> [org.dataone.integration.ContextAwareTestCaseDataone]
20151112-05:12:44: [INFO]: rest call info: POST https://mn-dev-ucsb-2.test.dataone.org/metacat/d1/mn/v2/object; MMP message has: ParamPart:pid = testUpdateSystemMetadata_MutableArchived_2015315211243191; FilePart:object = /tmp/mmp.output.5029559178259891853.tmp (17181 bytes); FilePart:sysmeta = /tmp/mmp.output.707807902899057192.tmp (983 bytes);  [org.dataone.client.rest.RestClient]
20151112-05:12:44: [INFO]: object created.  pid = testUpdateSystemMetadata_MutableArchived_2015315211243191 [org.dataone.integration.ContextAwareTestCaseDataone]
20151112-05:12:44: [INFO]: rest call info: GET https://mn-dev-ucsb-2.test.dataone.org/metacat/d1/mn/v2/meta/testUpdateSystemMetadata_MutableArchived_2015315211243191 [org.dataone.client.rest.RestClient]
20151112-05:12:50: [INFO]: rest call info: PUT https://mn-dev-ucsb-2.test.dataone.org/metacat/d1/mn/v2/meta; MMP message has: ParamPart:pid = testUpdateSystemMetadata_MutableArchived_2015315211243191; FilePart:sysmeta = /tmp/mmp.output.721518146268038539.tmp (1006 bytes);  [org.dataone.client.rest.RestClient]
20151112-05:13:00: [INFO]: rest call info: GET https://mn-dev-ucsb-2.test.dataone.org/metacat/d1/mn/v2/meta/testUpdateSystemMetadata_MutableArchived_2015315211243191 [org.dataone.client.rest.RestClient]
20151112-05:13:00: [INFO]: 
***************** running test for testUpdateSystemMetadata_MutableArchived(...) vs. node: https://mn-dev-unm-2.test.dataone.org/metacat/d1/mn ***************** [org.dataone.integration.ContextAwareTestCaseDataone]
20151112-05:13:00: [INFO]: certificate directory: /etc/dataone/client/testClientCerts/ [org.dataone.integration.ContextAwareTestCaseDataone]
20151112-05:13:00: [INFO]: certificate filename: cnDevUNM2 [org.dataone.integration.ContextAwareTestCaseDataone]
20151112-05:13:00: [INFO]: client setup as Subject: CN=urn:node:cnDevUNM2,DC=dataone,DC=org [org.dataone.integration.ContextAwareTestCaseDataone]
20151112-05:13:00: [INFO]: creating a test object.  pid = testUpdateSystemMetadata_MutableArchived_201531521130838 on https://mn-dev-unm-2.test.dataone.org/metacat/d1/mn/v2 [org.dataone.integration.ContextAwareTestCaseDataone]
20151112-05:13:00: [INFO]: SystemMetadata for pid: testUpdateSystemMetadata_MutableArchived_201531521130838
<?xml version="1.0" encoding="UTF-8"?><d1_v2.0:systemMetadata xmlns:d1_v2.0="http://ns.dataone.org/service/types/v2.0" xmlns:d1="http://ns.dataone.org/service/types/v1"><serialVersion>1</serialVersion><identifier>testUpdateSystemMetadata_MutableArchived_201531521130838</identifier><formatId>eml://ecoinformatics.org/eml-2.0.1</formatId><size>17181</size><checksum algorithm="MD5">03ce09c6b4c3efc1681f3023402998a2</checksum><submitter>CN=urn:node:cnDevUNM2,DC=dataone,DC=org</submitter><rightsHolder>CN=testRightsHolder,DC=dataone,DC=org</rightsHolder><accessPolicy><allow><subject>CN=testRightsHolder,DC=dataone,DC=org</subject><permission>changePermission</permission></allow></accessPolicy><dateUploaded>2015-11-12T05:13:00.853+00:00</dateUploaded><dateSysMetadataModified>2015-11-12T05:13:00.853+00:00</dateSysMetadataModified><originMemberNode>urn:node:mnDevUNM2</originMemberNode><authoritativeMemberNode>urn:node:mnDevUNM2</authoritativeMemberNode></d1_v2.0:systemMetadata> [org.dataone.integration.ContextAwareTestCaseDataone]
20151112-05:13:01: [INFO]: rest call info: POST https://mn-dev-unm-2.test.dataone.org/metacat/d1/mn/v2/object; MMP message has: ParamPart:pid = testUpdateSystemMetadata_MutableArchived_201531521130838; FilePart:object = /tmp/mmp.output.1543554844733793072.tmp (17181 bytes); FilePart:sysmeta = /tmp/mmp.output.6250265452956240766.tmp (980 bytes);  [org.dataone.client.rest.RestClient]
20151112-05:13:01: [INFO]: object created.  pid = testUpdateSystemMetadata_MutableArchived_201531521130838 [org.dataone.integration.ContextAwareTestCaseDataone]
20151112-05:13:01: [INFO]: rest call info: GET https://mn-dev-unm-2.test.dataone.org/metacat/d1/mn/v2/meta/testUpdateSystemMetadata_MutableArchived_201531521130838 [org.dataone.client.rest.RestClient]
20151112-05:13:02: [INFO]: rest call info: PUT https://mn-dev-unm-2.test.dataone.org/metacat/d1/mn/v2/meta; MMP message has: ParamPart:pid = testUpdateSystemMetadata_MutableArchived_201531521130838; FilePart:sysmeta = /tmp/mmp.output.3200752950704798509.tmp (1003 bytes);  [org.dataone.client.rest.RestClient]
20151112-05:13:02: [WARN]: MN.updateSystemMetadata() returned a ServiceFailure. [org.dataone.integration.it.ContextAwareAdapter]
20151112-05:13:02: [INFO]: **************************************************** [org.dataone.integration.ContextAwareTestCaseDataone]
20151112-05:13:02: [INFO]: ***  context label:   DEV2 [org.dataone.integration.ContextAwareTestCaseDataone]
20151112-05:13:02: [INFO]: **************************************************** [org.dataone.integration.ContextAwareTestCaseDataone]
20151112-05:13:02: [INFO]: **************************************************** [org.dataone.integration.ContextAwareTestCaseDataone]
20151112-05:13:02: [INFO]: rest call info: GET https://mn-dev-ucsb-1.test.dataone.org/metacat/d1/mn/v2/monitor/ping [org.dataone.client.rest.RestClient]
20151112-05:13:02: [INFO]: MN excluded from test: https://mn-dev-ucsb-1.test.dataone.org/metacat/d1/mn [org.dataone.integration.ContextAwareTestCaseDataone]
20151112-05:13:02: [INFO]: rest call info: GET https://mn-dev-ucsb-2.test.dataone.org/metacat/d1/mn/v2/monitor/ping [org.dataone.client.rest.RestClient]
20151112-05:13:02: [INFO]: MN included in test: https://mn-dev-ucsb-2.test.dataone.org/metacat/d1/mn [org.dataone.integration.ContextAwareTestCaseDataone]
20151112-05:13:02: [INFO]: rest call info: GET https://mn-dev-unm-1.test.dataone.org/metacat/d1/mn/v2/monitor/ping [org.dataone.client.rest.RestClient]
20151112-05:13:02: [INFO]: MN excluded from test: https://mn-dev-unm-1.test.dataone.org/metacat/d1/mn [org.dataone.integration.ContextAwareTestCaseDataone]
20151112-05:13:02: [INFO]: rest call info: GET https://mn-dev-unm-2.test.dataone.org/metacat/d1/mn/v2/monitor/ping [org.dataone.client.rest.RestClient]
20151112-05:13:02: [INFO]: MN included in test: https://mn-dev-unm-2.test.dataone.org/metacat/d1/mn [org.dataone.integration.ContextAwareTestCaseDataone]
20151112-05:13:02: [INFO]: 
***************** running test for testUpdateSystemMetadata_MutableAuthMN(...) vs. node: https://mn-dev-ucsb-2.test.dataone.org/metacat/d1/mn ***************** [org.dataone.integration.ContextAwareTestCaseDataone]
20151112-05:13:02: [INFO]: certificate directory: /etc/dataone/client/testClientCerts/ [org.dataone.integration.ContextAwareTestCaseDataone]
20151112-05:13:02: [INFO]: certificate filename: cnDevUNM2 [org.dataone.integration.ContextAwareTestCaseDataone]
20151112-05:13:02: [INFO]: client setup as Subject: CN=urn:node:cnDevUNM2,DC=dataone,DC=org [org.dataone.integration.ContextAwareTestCaseDataone]
20151112-05:13:02: [INFO]: creating a test object.  pid = testUpdateSystemMetadata_MutableAuthMN_201531521132863 on https://mn-dev-ucsb-2.test.dataone.org/metacat/d1/mn/v2 [org.dataone.integration.ContextAwareTestCaseDataone]
20151112-05:13:02: [INFO]: SystemMetadata for pid: testUpdateSystemMetadata_MutableAuthMN_201531521132863
<?xml version="1.0" encoding="UTF-8"?><d1_v2.0:systemMetadata xmlns:d1_v2.0="http://ns.dataone.org/service/types/v2.0" xmlns:d1="http://ns.dataone.org/service/types/v1"><serialVersion>1</serialVersion><identifier>testUpdateSystemMetadata_MutableAuthMN_201531521132863</identifier><formatId>eml://ecoinformatics.org/eml-2.0.1</formatId><size>17181</size><checksum algorithm="MD5">03ce09c6b4c3efc1681f3023402998a2</checksum><submitter>CN=urn:node:cnDevUNM2,DC=dataone,DC=org</submitter><rightsHolder>CN=testRightsHolder,DC=dataone,DC=org</rightsHolder><accessPolicy><allow><subject>CN=testRightsHolder,DC=dataone,DC=org</subject><permission>changePermission</permission></allow></accessPolicy><dateUploaded>2015-11-12T05:13:02.878+00:00</dateUploaded><dateSysMetadataModified>2015-11-12T05:13:02.878+00:00</dateSysMetadataModified><originMemberNode>urn:node:mnDevUCSB2</originMemberNode><authoritativeMemberNode>urn:node:mnDevUCSB2</authoritativeMemberNode></d1_v2.0:systemMetadata> [org.dataone.integration.ContextAwareTestCaseDataone]
20151112-05:13:03: [INFO]: rest call info: POST https://mn-dev-ucsb-2.test.dataone.org/metacat/d1/mn/v2/object; MMP message has: ParamPart:pid = testUpdateSystemMetadata_MutableAuthMN_201531521132863; FilePart:object = /tmp/mmp.output.7763730159891447559.tmp (17181 bytes); FilePart:sysmeta = /tmp/mmp.output.8544076950542436396.tmp (980 bytes);  [org.dataone.client.rest.RestClient]
20151112-05:13:03: [INFO]: object created.  pid = testUpdateSystemMetadata_MutableAuthMN_201531521132863 [org.dataone.integration.ContextAwareTestCaseDataone]
20151112-05:13:04: [INFO]: rest call info: GET https://mn-dev-ucsb-2.test.dataone.org/metacat/d1/mn/v2/meta/testUpdateSystemMetadata_MutableAuthMN_201531521132863 [org.dataone.client.rest.RestClient]
20151112-05:13:04: [INFO]: rest call info: GET https://cn-dev-ucsb-2.test.dataone.org/cn/v2/node [org.dataone.client.rest.RestClient]
20151112-05:13:04: [WARN]: MN.updateSystemMetadata() returned a ServiceFailure, was expecting an InvalidRequest or NotAuthorized. [org.dataone.integration.it.ContextAwareAdapter]
20151112-05:13:04: [INFO]: 
***************** running test for testUpdateSystemMetadata_MutableAuthMN(...) vs. node: https://mn-dev-unm-2.test.dataone.org/metacat/d1/mn ***************** [org.dataone.integration.ContextAwareTestCaseDataone]
20151112-05:13:04: [INFO]: certificate directory: /etc/dataone/client/testClientCerts/ [org.dataone.integration.ContextAwareTestCaseDataone]
20151112-05:13:04: [INFO]: certificate filename: cnDevUNM2 [org.dataone.integration.ContextAwareTestCaseDataone]
20151112-05:13:04: [INFO]: client setup as Subject: CN=urn:node:cnDevUNM2,DC=dataone,DC=org [org.dataone.integration.ContextAwareTestCaseDataone]
20151112-05:13:04: [INFO]: creating a test object.  pid = testUpdateSystemMetadata_MutableAuthMN_201531521134363 on https://mn-dev-unm-2.test.dataone.org/metacat/d1/mn/v2 [org.dataone.integration.ContextAwareTestCaseDataone]
20151112-05:13:04: [INFO]: SystemMetadata for pid: testUpdateSystemMetadata_MutableAuthMN_201531521134363
<?xml version="1.0" encoding="UTF-8"?><d1_v2.0:systemMetadata xmlns:d1_v2.0="http://ns.dataone.org/service/types/v2.0" xmlns:d1="http://ns.dataone.org/service/types/v1"><serialVersion>1</serialVersion><identifier>testUpdateSystemMetadata_MutableAuthMN_201531521134363</identifier><formatId>eml://ecoinformatics.org/eml-2.0.1</formatId><size>17181</size><checksum algorithm="MD5">03ce09c6b4c3efc1681f3023402998a2</checksum><submitter>CN=urn:node:cnDevUNM2,DC=dataone,DC=org</submitter><rightsHolder>CN=testRightsHolder,DC=dataone,DC=org</rightsHolder><accessPolicy><allow><subject>CN=testRightsHolder,DC=dataone,DC=org</subject><permission>changePermission</permission></allow></accessPolicy><dateUploaded>2015-11-12T05:13:04.377+00:00</dateUploaded><dateSysMetadataModified>2015-11-12T05:13:04.377+00:00</dateSysMetadataModified><originMemberNode>urn:node:mnDevUNM2</originMemberNode><authoritativeMemberNode>urn:node:mnDevUNM2</authoritativeMemberNode></d1_v2.0:systemMetadata> [org.dataone.integration.ContextAwareTestCaseDataone]
20151112-05:13:05: [INFO]: rest call info: POST https://mn-dev-unm-2.test.dataone.org/metacat/d1/mn/v2/object; MMP message has: ParamPart:pid = testUpdateSystemMetadata_MutableAuthMN_201531521134363; FilePart:object = /tmp/mmp.output.8618125092510473241.tmp (17181 bytes); FilePart:sysmeta = /tmp/mmp.output.4045396080559294520.tmp (978 bytes);  [org.dataone.client.rest.RestClient]
20151112-05:13:05: [INFO]: object created.  pid = testUpdateSystemMetadata_MutableAuthMN_201531521134363 [org.dataone.integration.ContextAwareTestCaseDataone]
20151112-05:13:05: [INFO]: rest call info: GET https://mn-dev-unm-2.test.dataone.org/metacat/d1/mn/v2/meta/testUpdateSystemMetadata_MutableAuthMN_201531521134363 [org.dataone.client.rest.RestClient]
20151112-05:13:05: [INFO]: rest call info: GET https://cn-dev-ucsb-2.test.dataone.org/cn/v2/node [org.dataone.client.rest.RestClient]
20151112-05:13:05: [WARN]: MN.updateSystemMetadata() returned a ServiceFailure, was expecting an InvalidRequest or NotAuthorized. [org.dataone.integration.it.ContextAwareAdapter]
20151112-05:13:05: [INFO]: **************************************************** [org.dataone.integration.ContextAwareTestCaseDataone]
20151112-05:13:05: [INFO]: ***  context label:   DEV2 [org.dataone.integration.ContextAwareTestCaseDataone]
20151112-05:13:05: [INFO]: **************************************************** [org.dataone.integration.ContextAwareTestCaseDataone]
20151112-05:13:05: [INFO]: **************************************************** [org.dataone.integration.ContextAwareTestCaseDataone]
20151112-05:13:05: [INFO]: rest call info: GET https://mn-dev-ucsb-1.test.dataone.org/metacat/d1/mn/v2/monitor/ping [org.dataone.client.rest.RestClient]
20151112-05:13:05: [INFO]: MN excluded from test: https://mn-dev-ucsb-1.test.dataone.org/metacat/d1/mn [org.dataone.integration.ContextAwareTestCaseDataone]
20151112-05:13:05: [INFO]: rest call info: GET https://mn-dev-ucsb-2.test.dataone.org/metacat/d1/mn/v2/monitor/ping [org.dataone.client.rest.RestClient]
20151112-05:13:05: [INFO]: MN included in test: https://mn-dev-ucsb-2.test.dataone.org/metacat/d1/mn [org.dataone.integration.ContextAwareTestCaseDataone]
20151112-05:13:05: [INFO]: rest call info: GET https://mn-dev-unm-1.test.dataone.org/metacat/d1/mn/v2/monitor/ping [org.dataone.client.rest.RestClient]
20151112-05:13:05: [INFO]: MN excluded from test: https://mn-dev-unm-1.test.dataone.org/metacat/d1/mn [org.dataone.integration.ContextAwareTestCaseDataone]
20151112-05:13:05: [INFO]: rest call info: GET https://mn-dev-unm-2.test.dataone.org/metacat/d1/mn/v2/monitor/ping [org.dataone.client.rest.RestClient]
20151112-05:13:05: [INFO]: MN included in test: https://mn-dev-unm-2.test.dataone.org/metacat/d1/mn [org.dataone.integration.ContextAwareTestCaseDataone]
20151112-05:13:05: [INFO]: 
***************** running test for testUpdateSystemMetadata_ObsoletesFail(...) vs. node: https://mn-dev-ucsb-2.test.dataone.org/metacat/d1/mn ***************** [org.dataone.integration.ContextAwareTestCaseDataone]
20151112-05:13:05: [INFO]: certificate directory: /etc/dataone/client/testClientCerts/ [org.dataone.integration.ContextAwareTestCaseDataone]
20151112-05:13:05: [INFO]: certificate filename: cnDevUNM2 [org.dataone.integration.ContextAwareTestCaseDataone]
20151112-05:13:05: [INFO]: client setup as Subject: CN=urn:node:cnDevUNM2,DC=dataone,DC=org [org.dataone.integration.ContextAwareTestCaseDataone]
20151112-05:13:05: [INFO]: creating a test object.  pid = testUpdateSystemMetadata_ObsoletesFail_201531521135779 on https://mn-dev-ucsb-2.test.dataone.org/metacat/d1/mn/v2 [org.dataone.integration.ContextAwareTestCaseDataone]
20151112-05:13:05: [INFO]: SystemMetadata for pid: testUpdateSystemMetadata_ObsoletesFail_201531521135779
<?xml version="1.0" encoding="UTF-8"?><d1_v2.0:systemMetadata xmlns:d1_v2.0="http://ns.dataone.org/service/types/v2.0" xmlns:d1="http://ns.dataone.org/service/types/v1"><serialVersion>1</serialVersion><identifier>testUpdateSystemMetadata_ObsoletesFail_201531521135779</identifier><formatId>eml://ecoinformatics.org/eml-2.0.1</formatId><size>17181</size><checksum algorithm="MD5">03ce09c6b4c3efc1681f3023402998a2</checksum><submitter>CN=urn:node:cnDevUNM2,DC=dataone,DC=org</submitter><rightsHolder>CN=testRightsHolder,DC=dataone,DC=org</rightsHolder><accessPolicy><allow><subject>CN=testRightsHolder,DC=dataone,DC=org</subject><permission>changePermission</permission></allow></accessPolicy><dateUploaded>2015-11-12T05:13:05.798+00:00</dateUploaded><dateSysMetadataModified>2015-11-12T05:13:05.798+00:00</dateSysMetadataModified><originMemberNode>urn:node:mnDevUCSB2</originMemberNode><authoritativeMemberNode>urn:node:mnDevUCSB2</authoritativeMemberNode></d1_v2.0:systemMetadata> [org.dataone.integration.ContextAwareTestCaseDataone]
20151112-05:13:06: [INFO]: rest call info: POST https://mn-dev-ucsb-2.test.dataone.org/metacat/d1/mn/v2/object; MMP message has: ParamPart:pid = testUpdateSystemMetadata_ObsoletesFail_201531521135779; FilePart:object = /tmp/mmp.output.2206468917879804162.tmp (17181 bytes); FilePart:sysmeta = /tmp/mmp.output.5021651829077300846.tmp (980 bytes);  [org.dataone.client.rest.RestClient]
20151112-05:13:06: [INFO]: object created.  pid = testUpdateSystemMetadata_ObsoletesFail_201531521135779 [org.dataone.integration.ContextAwareTestCaseDataone]
20151112-05:13:18: [INFO]: rest call info: PUT https://mn-dev-ucsb-2.test.dataone.org/metacat/d1/mn/v2/object/testUpdateSystemMetadata_ObsoletesFail_201531521135779; MMP message has: ParamPart:newPid = testUpdateSystemMetadata_ObsoletesFail_201531521135781; FilePart:object = /tmp/mmp.output.131112207834346093.tmp (17181 bytes); FilePart:sysmeta = /tmp/mmp.output.6649636681395009759.tmp (780 bytes);  [org.dataone.client.rest.RestClient]
20151112-05:13:18: [INFO]: certificate directory: /etc/dataone/client/testClientCerts/ [org.dataone.integration.ContextAwareTestCaseDataone]
20151112-05:13:18: [INFO]: certificate filename: cnDevUNM2 [org.dataone.integration.ContextAwareTestCaseDataone]
20151112-05:13:18: [INFO]: client setup as Subject: CN=urn:node:cnDevUNM2,DC=dataone,DC=org [org.dataone.integration.ContextAwareTestCaseDataone]
20151112-05:13:18: [INFO]: creating a test object.  pid = testUpdateSystemMetadata_ObsoletesFail_201531521135782 on https://mn-dev-ucsb-2.test.dataone.org/metacat/d1/mn/v2 [org.dataone.integration.ContextAwareTestCaseDataone]
20151112-05:13:18: [INFO]: SystemMetadata for pid: testUpdateSystemMetadata_ObsoletesFail_201531521135782
<?xml version="1.0" encoding="UTF-8"?><d1_v2.0:systemMetadata xmlns:d1_v2.0="http://ns.dataone.org/service/types/v2.0" xmlns:d1="http://ns.dataone.org/service/types/v1"><serialVersion>1</serialVersion><identifier>testUpdateSystemMetadata_ObsoletesFail_201531521135782</identifier><formatId>eml://ecoinformatics.org/eml-2.0.1</formatId><size>17181</size><checksum algorithm="MD5">03ce09c6b4c3efc1681f3023402998a2</checksum><submitter>CN=urn:node:cnDevUNM2,DC=dataone,DC=org</submitter><rightsHolder>CN=testRightsHolder,DC=dataone,DC=org</rightsHolder><accessPolicy><allow><subject>CN=testRightsHolder,DC=dataone,DC=org</subject><permission>changePermission</permission></allow></accessPolicy><dateUploaded>2015-11-12T05:13:18.373+00:00</dateUploaded><dateSysMetadataModified>2015-11-12T05:13:18.373+00:00</dateSysMetadataModified><originMemberNode>urn:node:mnDevUCSB2</originMemberNode><authoritativeMemberNode>urn:node:mnDevUCSB2</authoritativeMemberNode></d1_v2.0:systemMetadata> [org.dataone.integration.ContextAwareTestCaseDataone]
20151112-05:13:19: [INFO]: rest call info: POST https://mn-dev-ucsb-2.test.dataone.org/metacat/d1/mn/v2/object; MMP message has: ParamPart:pid = testUpdateSystemMetadata_ObsoletesFail_201531521135782; FilePart:object = /tmp/mmp.output.5225593930644733955.tmp (17181 bytes); FilePart:sysmeta = /tmp/mmp.output.242832269412347385.tmp (980 bytes);  [org.dataone.client.rest.RestClient]
20151112-05:13:19: [INFO]: object created.  pid = testUpdateSystemMetadata_ObsoletesFail_201531521135782 [org.dataone.integration.ContextAwareTestCaseDataone]
20151112-05:13:29: [INFO]: rest call info: GET https://mn-dev-ucsb-2.test.dataone.org/metacat/d1/mn/v2/meta/testUpdateSystemMetadata_ObsoletesFail_201531521135781 [org.dataone.client.rest.RestClient]
20151112-05:13:30: [INFO]: rest call info: PUT https://mn-dev-ucsb-2.test.dataone.org/metacat/d1/mn/v2/meta; MMP message has: ParamPart:pid = testUpdateSystemMetadata_ObsoletesFail_201531521135781; FilePart:sysmeta = /tmp/mmp.output.1959166081125153538.tmp (914 bytes);  [org.dataone.client.rest.RestClient]
20151112-05:13:30: [INFO]: 
***************** running test for testUpdateSystemMetadata_ObsoletesFail(...) vs. node: https://mn-dev-unm-2.test.dataone.org/metacat/d1/mn ***************** [org.dataone.integration.ContextAwareTestCaseDataone]
20151112-05:13:30: [INFO]: certificate directory: /etc/dataone/client/testClientCerts/ [org.dataone.integration.ContextAwareTestCaseDataone]
20151112-05:13:30: [INFO]: certificate filename: cnDevUNM2 [org.dataone.integration.ContextAwareTestCaseDataone]
20151112-05:13:30: [INFO]: client setup as Subject: CN=urn:node:cnDevUNM2,DC=dataone,DC=org [org.dataone.integration.ContextAwareTestCaseDataone]
20151112-05:13:30: [INFO]: creating a test object.  pid = testUpdateSystemMetadata_ObsoletesFail_2015315211330103 on https://mn-dev-unm-2.test.dataone.org/metacat/d1/mn/v2 [org.dataone.integration.ContextAwareTestCaseDataone]
20151112-05:13:30: [INFO]: SystemMetadata for pid: testUpdateSystemMetadata_ObsoletesFail_2015315211330103
<?xml version="1.0" encoding="UTF-8"?><d1_v2.0:systemMetadata xmlns:d1_v2.0="http://ns.dataone.org/service/types/v2.0" xmlns:d1="http://ns.dataone.org/service/types/v1"><serialVersion>1</serialVersion><identifier>testUpdateSystemMetadata_ObsoletesFail_2015315211330103</identifier><formatId>eml://ecoinformatics.org/eml-2.0.1</formatId><size>17181</size><checksum algorithm="MD5">03ce09c6b4c3efc1681f3023402998a2</checksum><submitter>CN=urn:node:cnDevUNM2,DC=dataone,DC=org</submitter><rightsHolder>CN=testRightsHolder,DC=dataone,DC=org</rightsHolder><accessPolicy><allow><subject>CN=testRightsHolder,DC=dataone,DC=org</subject><permission>changePermission</permission></allow></accessPolicy><dateUploaded>2015-11-12T05:13:30.121+00:00</dateUploaded><dateSysMetadataModified>2015-11-12T05:13:30.121+00:00</dateSysMetadataModified><originMemberNode>urn:node:mnDevUNM2</originMemberNode><authoritativeMemberNode>urn:node:mnDevUNM2</authoritativeMemberNode></d1_v2.0:systemMetadata> [org.dataone.integration.ContextAwareTestCaseDataone]
20151112-05:13:30: [INFO]: rest call info: POST https://mn-dev-unm-2.test.dataone.org/metacat/d1/mn/v2/object; MMP message has: ParamPart:pid = testUpdateSystemMetadata_ObsoletesFail_2015315211330103; FilePart:object = /tmp/mmp.output.4048521022116815216.tmp (17181 bytes); FilePart:sysmeta = /tmp/mmp.output.3426350859243102179.tmp (979 bytes);  [org.dataone.client.rest.RestClient]
20151112-05:13:30: [INFO]: object created.  pid = testUpdateSystemMetadata_ObsoletesFail_2015315211330103 [org.dataone.integration.ContextAwareTestCaseDataone]
20151112-05:13:42: [INFO]: rest call info: PUT https://mn-dev-unm-2.test.dataone.org/metacat/d1/mn/v2/object/testUpdateSystemMetadata_ObsoletesFail_2015315211330103; MMP message has: ParamPart:newPid = testUpdateSystemMetadata_ObsoletesFail_2015315211330104; FilePart:object = /tmp/mmp.output.522588955095110071.tmp (17181 bytes); FilePart:sysmeta = /tmp/mmp.output.3934122383435137415.tmp (780 bytes);  [org.dataone.client.rest.RestClient]
20151112-05:13:42: [INFO]: certificate directory: /etc/dataone/client/testClientCerts/ [org.dataone.integration.ContextAwareTestCaseDataone]
20151112-05:13:42: [INFO]: certificate filename: cnDevUNM2 [org.dataone.integration.ContextAwareTestCaseDataone]
20151112-05:13:42: [INFO]: client setup as Subject: CN=urn:node:cnDevUNM2,DC=dataone,DC=org [org.dataone.integration.ContextAwareTestCaseDataone]
20151112-05:13:42: [INFO]: creating a test object.  pid = testUpdateSystemMetadata_ObsoletesFail_2015315211330105 on https://mn-dev-unm-2.test.dataone.org/metacat/d1/mn/v2 [org.dataone.integration.ContextAwareTestCaseDataone]
20151112-05:13:42: [INFO]: SystemMetadata for pid: testUpdateSystemMetadata_ObsoletesFail_2015315211330105
<?xml version="1.0" encoding="UTF-8"?><d1_v2.0:systemMetadata xmlns:d1_v2.0="http://ns.dataone.org/service/types/v2.0" xmlns:d1="http://ns.dataone.org/service/types/v1"><serialVersion>1</serialVersion><identifier>testUpdateSystemMetadata_ObsoletesFail_2015315211330105</identifier><formatId>eml://ecoinformatics.org/eml-2.0.1</formatId><size>17181</size><checksum algorithm="MD5">03ce09c6b4c3efc1681f3023402998a2</checksum><submitter>CN=urn:node:cnDevUNM2,DC=dataone,DC=org</submitter><rightsHolder>CN=testRightsHolder,DC=dataone,DC=org</rightsHolder><accessPolicy><allow><subject>CN=testRightsHolder,DC=dataone,DC=org</subject><permission>changePermission</permission></allow></accessPolicy><dateUploaded>2015-11-12T05:13:42.329+00:00</dateUploaded><dateSysMetadataModified>2015-11-12T05:13:42.329+00:00</dateSysMetadataModified><originMemberNode>urn:node:mnDevUNM2</originMemberNode><authoritativeMemberNode>urn:node:mnDevUNM2</authoritativeMemberNode></d1_v2.0:systemMetadata> [org.dataone.integration.ContextAwareTestCaseDataone]
20151112-05:13:43: [INFO]: rest call info: POST https://mn-dev-unm-2.test.dataone.org/metacat/d1/mn/v2/object; MMP message has: ParamPart:pid = testUpdateSystemMetadata_ObsoletesFail_2015315211330105; FilePart:object = /tmp/mmp.output.7235743458272860920.tmp (17181 bytes); FilePart:sysmeta = /tmp/mmp.output.7568946889106494547.tmp (979 bytes);  [org.dataone.client.rest.RestClient]
20151112-05:13:43: [INFO]: object created.  pid = testUpdateSystemMetadata_ObsoletesFail_2015315211330105 [org.dataone.integration.ContextAwareTestCaseDataone]
20151112-05:13:53: [INFO]: rest call info: GET https://mn-dev-unm-2.test.dataone.org/metacat/d1/mn/v2/meta/testUpdateSystemMetadata_ObsoletesFail_2015315211330104 [org.dataone.client.rest.RestClient]
20151112-05:13:53: [INFO]: rest call info: PUT https://mn-dev-unm-2.test.dataone.org/metacat/d1/mn/v2/meta; MMP message has: ParamPart:pid = testUpdateSystemMetadata_ObsoletesFail_2015315211330104; FilePart:sysmeta = /tmp/mmp.output.1659463175764103601.tmp (914 bytes);  [org.dataone.client.rest.RestClient]
20151112-05:13:53: [INFO]: **************************************************** [org.dataone.integration.ContextAwareTestCaseDataone]
20151112-05:13:53: [INFO]: ***  context label:   DEV2 [org.dataone.integration.ContextAwareTestCaseDataone]
20151112-05:13:53: [INFO]: **************************************************** [org.dataone.integration.ContextAwareTestCaseDataone]
20151112-05:13:53: [INFO]: **************************************************** [org.dataone.integration.ContextAwareTestCaseDataone]
20151112-05:13:53: [INFO]: rest call info: GET https://mn-dev-ucsb-1.test.dataone.org/metacat/d1/mn/v2/monitor/ping [org.dataone.client.rest.RestClient]
20151112-05:13:53: [INFO]: MN excluded from test: https://mn-dev-ucsb-1.test.dataone.org/metacat/d1/mn [org.dataone.integration.ContextAwareTestCaseDataone]
20151112-05:13:53: [INFO]: rest call info: GET https://mn-dev-ucsb-2.test.dataone.org/metacat/d1/mn/v2/monitor/ping [org.dataone.client.rest.RestClient]
20151112-05:13:53: [INFO]: MN included in test: https://mn-dev-ucsb-2.test.dataone.org/metacat/d1/mn [org.dataone.integration.ContextAwareTestCaseDataone]
20151112-05:13:53: [INFO]: rest call info: GET https://mn-dev-unm-1.test.dataone.org/metacat/d1/mn/v2/monitor/ping [org.dataone.client.rest.RestClient]
20151112-05:13:53: [INFO]: MN excluded from test: https://mn-dev-unm-1.test.dataone.org/metacat/d1/mn [org.dataone.integration.ContextAwareTestCaseDataone]
20151112-05:13:53: [INFO]: rest call info: GET https://mn-dev-unm-2.test.dataone.org/metacat/d1/mn/v2/monitor/ping [org.dataone.client.rest.RestClient]
20151112-05:13:53: [INFO]: MN included in test: https://mn-dev-unm-2.test.dataone.org/metacat/d1/mn [org.dataone.integration.ContextAwareTestCaseDataone]
20151112-05:13:53: [INFO]: 
***************** running test for testUpdateSystemMetadata_ObsoletedByFail(...) vs. node: https://mn-dev-ucsb-2.test.dataone.org/metacat/d1/mn ***************** [org.dataone.integration.ContextAwareTestCaseDataone]
20151112-05:13:53: [INFO]: certificate directory: /etc/dataone/client/testClientCerts/ [org.dataone.integration.ContextAwareTestCaseDataone]
20151112-05:13:53: [INFO]: certificate filename: cnDevUNM2 [org.dataone.integration.ContextAwareTestCaseDataone]
20151112-05:13:53: [INFO]: client setup as Subject: CN=urn:node:cnDevUNM2,DC=dataone,DC=org [org.dataone.integration.ContextAwareTestCaseDataone]
20151112-05:13:53: [INFO]: creating a test object.  pid = testUpdateSystemMetadata_ObsoletedByFail_2015315211353848 on https://mn-dev-ucsb-2.test.dataone.org/metacat/d1/mn/v2 [org.dataone.integration.ContextAwareTestCaseDataone]
20151112-05:13:53: [INFO]: SystemMetadata for pid: testUpdateSystemMetadata_ObsoletedByFail_2015315211353848
<?xml version="1.0" encoding="UTF-8"?><d1_v2.0:systemMetadata xmlns:d1_v2.0="http://ns.dataone.org/service/types/v2.0" xmlns:d1="http://ns.dataone.org/service/types/v1"><serialVersion>1</serialVersion><identifier>testUpdateSystemMetadata_ObsoletedByFail_2015315211353848</identifier><formatId>eml://ecoinformatics.org/eml-2.0.1</formatId><size>17181</size><checksum algorithm="MD5">03ce09c6b4c3efc1681f3023402998a2</checksum><submitter>CN=urn:node:cnDevUNM2,DC=dataone,DC=org</submitter><rightsHolder>CN=testRightsHolder,DC=dataone,DC=org</rightsHolder><accessPolicy><allow><subject>CN=testRightsHolder,DC=dataone,DC=org</subject><permission>changePermission</permission></allow></accessPolicy><dateUploaded>2015-11-12T05:13:53.864+00:00</dateUploaded><dateSysMetadataModified>2015-11-12T05:13:53.864+00:00</dateSysMetadataModified><originMemberNode>urn:node:mnDevUCSB2</originMemberNode><authoritativeMemberNode>urn:node:mnDevUCSB2</authoritativeMemberNode></d1_v2.0:systemMetadata> [org.dataone.integration.ContextAwareTestCaseDataone]
20151112-05:13:54: [INFO]: rest call info: POST https://mn-dev-ucsb-2.test.dataone.org/metacat/d1/mn/v2/object; MMP message has: ParamPart:pid = testUpdateSystemMetadata_ObsoletedByFail_2015315211353848; FilePart:object = /tmp/mmp.output.5550138791222043507.tmp (17181 bytes); FilePart:sysmeta = /tmp/mmp.output.6014587572562665995.tmp (983 bytes);  [org.dataone.client.rest.RestClient]
20151112-05:13:54: [INFO]: object created.  pid = testUpdateSystemMetadata_ObsoletedByFail_2015315211353848 [org.dataone.integration.ContextAwareTestCaseDataone]
20151112-05:14:06: [INFO]: rest call info: PUT https://mn-dev-ucsb-2.test.dataone.org/metacat/d1/mn/v2/object/testUpdateSystemMetadata_ObsoletedByFail_2015315211353848; MMP message has: ParamPart:newPid = testUpdateSystemMetadata_ObsoletedByFail_2015315211353849; FilePart:object = /tmp/mmp.output.2625951210351389547.tmp (17181 bytes); FilePart:sysmeta = /tmp/mmp.output.6081932891208142027.tmp (786 bytes);  [org.dataone.client.rest.RestClient]
20151112-05:14:06: [INFO]: certificate directory: /etc/dataone/client/testClientCerts/ [org.dataone.integration.ContextAwareTestCaseDataone]
20151112-05:14:06: [INFO]: certificate filename: cnDevUNM2 [org.dataone.integration.ContextAwareTestCaseDataone]
20151112-05:14:06: [INFO]: client setup as Subject: CN=urn:node:cnDevUNM2,DC=dataone,DC=org [org.dataone.integration.ContextAwareTestCaseDataone]
20151112-05:14:06: [INFO]: creating a test object.  pid = testUpdateSystemMetadata_ObsoletedByFail_2015315211353850 on https://mn-dev-ucsb-2.test.dataone.org/metacat/d1/mn/v2 [org.dataone.integration.ContextAwareTestCaseDataone]
20151112-05:14:06: [INFO]: SystemMetadata for pid: testUpdateSystemMetadata_ObsoletedByFail_2015315211353850
<?xml version="1.0" encoding="UTF-8"?><d1_v2.0:systemMetadata xmlns:d1_v2.0="http://ns.dataone.org/service/types/v2.0" xmlns:d1="http://ns.dataone.org/service/types/v1"><serialVersion>1</serialVersion><identifier>testUpdateSystemMetadata_ObsoletedByFail_2015315211353850</identifier><formatId>eml://ecoinformatics.org/eml-2.0.1</formatId><size>17181</size><checksum algorithm="MD5">03ce09c6b4c3efc1681f3023402998a2</checksum><submitter>CN=urn:node:cnDevUNM2,DC=dataone,DC=org</submitter><rightsHolder>CN=testRightsHolder,DC=dataone,DC=org</rightsHolder><accessPolicy><allow><subject>CN=testRightsHolder,DC=dataone,DC=org</subject><permission>changePermission</permission></allow></accessPolicy><dateUploaded>2015-11-12T05:14:06.498+00:00</dateUploaded><dateSysMetadataModified>2015-11-12T05:14:06.498+00:00</dateSysMetadataModified><originMemberNode>urn:node:mnDevUCSB2</originMemberNode><authoritativeMemberNode>urn:node:mnDevUCSB2</authoritativeMemberNode></d1_v2.0:systemMetadata> [org.dataone.integration.ContextAwareTestCaseDataone]
20151112-05:14:07: [INFO]: rest call info: POST https://mn-dev-ucsb-2.test.dataone.org/metacat/d1/mn/v2/object; MMP message has: ParamPart:pid = testUpdateSystemMetadata_ObsoletedByFail_2015315211353850; FilePart:object = /tmp/mmp.output.928973723562632423.tmp (17181 bytes); FilePart:sysmeta = /tmp/mmp.output.4070769561641837846.tmp (983 bytes);  [org.dataone.client.rest.RestClient]
20151112-05:14:07: [INFO]: object created.  pid = testUpdateSystemMetadata_ObsoletedByFail_2015315211353850 [org.dataone.integration.ContextAwareTestCaseDataone]
20151112-05:14:17: [INFO]: rest call info: GET https://mn-dev-ucsb-2.test.dataone.org/metacat/d1/mn/v2/meta/testUpdateSystemMetadata_ObsoletedByFail_2015315211353848 [org.dataone.client.rest.RestClient]
20151112-05:14:18: [INFO]: rest call info: PUT https://mn-dev-ucsb-2.test.dataone.org/metacat/d1/mn/v2/meta; MMP message has: ParamPart:pid = testUpdateSystemMetadata_ObsoletedByFail_2015315211353848; FilePart:sysmeta = /tmp/mmp.output.7506779605039966357.tmp (1091 bytes);  [org.dataone.client.rest.RestClient]
20151112-05:14:18: [INFO]: 
***************** running test for testUpdateSystemMetadata_ObsoletedByFail(...) vs. node: https://mn-dev-unm-2.test.dataone.org/metacat/d1/mn ***************** [org.dataone.integration.ContextAwareTestCaseDataone]
20151112-05:14:18: [INFO]: certificate directory: /etc/dataone/client/testClientCerts/ [org.dataone.integration.ContextAwareTestCaseDataone]
20151112-05:14:18: [INFO]: certificate filename: cnDevUNM2 [org.dataone.integration.ContextAwareTestCaseDataone]
20151112-05:14:18: [INFO]: client setup as Subject: CN=urn:node:cnDevUNM2,DC=dataone,DC=org [org.dataone.integration.ContextAwareTestCaseDataone]
20151112-05:14:18: [INFO]: creating a test object.  pid = testUpdateSystemMetadata_ObsoletedByFail_2015315211418188 on https://mn-dev-unm-2.test.dataone.org/metacat/d1/mn/v2 [org.dataone.integration.ContextAwareTestCaseDataone]
20151112-05:14:18: [INFO]: SystemMetadata for pid: testUpdateSystemMetadata_ObsoletedByFail_2015315211418188
<?xml version="1.0" encoding="UTF-8"?><d1_v2.0:systemMetadata xmlns:d1_v2.0="http://ns.dataone.org/service/types/v2.0" xmlns:d1="http://ns.dataone.org/service/types/v1"><serialVersion>1</serialVersion><identifier>testUpdateSystemMetadata_ObsoletedByFail_2015315211418188</identifier><formatId>eml://ecoinformatics.org/eml-2.0.1</formatId><size>17181</size><checksum algorithm="MD5">03ce09c6b4c3efc1681f3023402998a2</checksum><submitter>CN=urn:node:cnDevUNM2,DC=dataone,DC=org</submitter><rightsHolder>CN=testRightsHolder,DC=dataone,DC=org</rightsHolder><accessPolicy><allow><subject>CN=testRightsHolder,DC=dataone,DC=org</subject><permission>changePermission</permission></allow></accessPolicy><dateUploaded>2015-11-12T05:14:18.206+00:00</dateUploaded><dateSysMetadataModified>2015-11-12T05:14:18.206+00:00</dateSysMetadataModified><originMemberNode>urn:node:mnDevUNM2</originMemberNode><authoritativeMemberNode>urn:node:mnDevUNM2</authoritativeMemberNode></d1_v2.0:systemMetadata> [org.dataone.integration.ContextAwareTestCaseDataone]
20151112-05:14:19: [INFO]: rest call info: POST https://mn-dev-unm-2.test.dataone.org/metacat/d1/mn/v2/object; MMP message has: ParamPart:pid = testUpdateSystemMetadata_ObsoletedByFail_2015315211418188; FilePart:object = /tmp/mmp.output.7748165947773427898.tmp (17181 bytes); FilePart:sysmeta = /tmp/mmp.output.3078436759532143378.tmp (981 bytes);  [org.dataone.client.rest.RestClient]
20151112-05:14:19: [INFO]: object created.  pid = testUpdateSystemMetadata_ObsoletedByFail_2015315211418188 [org.dataone.integration.ContextAwareTestCaseDataone]
20151112-05:14:30: [INFO]: rest call info: PUT https://mn-dev-unm-2.test.dataone.org/metacat/d1/mn/v2/object/testUpdateSystemMetadata_ObsoletedByFail_2015315211418188; MMP message has: ParamPart:newPid = testUpdateSystemMetadata_ObsoletedByFail_2015315211418190; FilePart:object = /tmp/mmp.output.77252534580353016.tmp (17181 bytes); FilePart:sysmeta = /tmp/mmp.output.3826004192979935409.tmp (786 bytes);  [org.dataone.client.rest.RestClient]
20151112-05:14:30: [INFO]: certificate directory: /etc/dataone/client/testClientCerts/ [org.dataone.integration.ContextAwareTestCaseDataone]
20151112-05:14:30: [INFO]: certificate filename: cnDevUNM2 [org.dataone.integration.ContextAwareTestCaseDataone]
20151112-05:14:30: [INFO]: client setup as Subject: CN=urn:node:cnDevUNM2,DC=dataone,DC=org [org.dataone.integration.ContextAwareTestCaseDataone]
20151112-05:14:30: [INFO]: creating a test object.  pid = testUpdateSystemMetadata_ObsoletedByFail_2015315211418191 on https://mn-dev-unm-2.test.dataone.org/metacat/d1/mn/v2 [org.dataone.integration.ContextAwareTestCaseDataone]
20151112-05:14:30: [INFO]: SystemMetadata for pid: testUpdateSystemMetadata_ObsoletedByFail_2015315211418191
<?xml version="1.0" encoding="UTF-8"?><d1_v2.0:systemMetadata xmlns:d1_v2.0="http://ns.dataone.org/service/types/v2.0" xmlns:d1="http://ns.dataone.org/service/types/v1"><serialVersion>1</serialVersion><identifier>testUpdateSystemMetadata_ObsoletedByFail_2015315211418191</identifier><formatId>eml://ecoinformatics.org/eml-2.0.1</formatId><size>17181</size><checksum algorithm="MD5">03ce09c6b4c3efc1681f3023402998a2</checksum><submitter>CN=urn:node:cnDevUNM2,DC=dataone,DC=org</submitter><rightsHolder>CN=testRightsHolder,DC=dataone,DC=org</rightsHolder><accessPolicy><allow><subject>CN=testRightsHolder,DC=dataone,DC=org</subject><permission>changePermission</permission></allow></accessPolicy><dateUploaded>2015-11-12T05:14:30.451+00:00</dateUploaded><dateSysMetadataModified>2015-11-12T05:14:30.451+00:00</dateSysMetadataModified><originMemberNode>urn:node:mnDevUNM2</originMemberNode><authoritativeMemberNode>urn:node:mnDevUNM2</authoritativeMemberNode></d1_v2.0:systemMetadata> [org.dataone.integration.ContextAwareTestCaseDataone]
20151112-05:14:31: [INFO]: rest call info: POST https://mn-dev-unm-2.test.dataone.org/metacat/d1/mn/v2/object; MMP message has: ParamPart:pid = testUpdateSystemMetadata_ObsoletedByFail_2015315211418191; FilePart:object = /tmp/mmp.output.6253393017745018178.tmp (17181 bytes); FilePart:sysmeta = /tmp/mmp.output.2274851533710869284.tmp (981 bytes);  [org.dataone.client.rest.RestClient]
20151112-05:14:31: [INFO]: object created.  pid = testUpdateSystemMetadata_ObsoletedByFail_2015315211418191 [org.dataone.integration.ContextAwareTestCaseDataone]
20151112-05:14:41: [INFO]: rest call info: GET https://mn-dev-unm-2.test.dataone.org/metacat/d1/mn/v2/meta/testUpdateSystemMetadata_ObsoletedByFail_2015315211418188 [org.dataone.client.rest.RestClient]
20151112-05:14:41: [INFO]: rest call info: PUT https://mn-dev-unm-2.test.dataone.org/metacat/d1/mn/v2/meta; MMP message has: ParamPart:pid = testUpdateSystemMetadata_ObsoletedByFail_2015315211418188; FilePart:sysmeta = /tmp/mmp.output.6637939598762972398.tmp (1089 bytes);  [org.dataone.client.rest.RestClient]
20151112-05:14:41: [INFO]: **************************************************** [org.dataone.integration.ContextAwareTestCaseDataone]
20151112-05:14:41: [INFO]: ***  context label:   DEV2 [org.dataone.integration.ContextAwareTestCaseDataone]
20151112-05:14:41: [INFO]: **************************************************** [org.dataone.integration.ContextAwareTestCaseDataone]
20151112-05:14:41: [INFO]: **************************************************** [org.dataone.integration.ContextAwareTestCaseDataone]
20151112-05:14:41: [INFO]: rest call info: GET https://mn-dev-ucsb-1.test.dataone.org/metacat/d1/mn/v2/monitor/ping [org.dataone.client.rest.RestClient]
20151112-05:14:41: [INFO]: MN excluded from test: https://mn-dev-ucsb-1.test.dataone.org/metacat/d1/mn [org.dataone.integration.ContextAwareTestCaseDataone]
20151112-05:14:41: [INFO]: rest call info: GET https://mn-dev-ucsb-2.test.dataone.org/metacat/d1/mn/v2/monitor/ping [org.dataone.client.rest.RestClient]
20151112-05:14:41: [INFO]: MN included in test: https://mn-dev-ucsb-2.test.dataone.org/metacat/d1/mn [org.dataone.integration.ContextAwareTestCaseDataone]
20151112-05:14:41: [INFO]: rest call info: GET https://mn-dev-unm-1.test.dataone.org/metacat/d1/mn/v2/monitor/ping [org.dataone.client.rest.RestClient]
20151112-05:14:41: [INFO]: MN excluded from test: https://mn-dev-unm-1.test.dataone.org/metacat/d1/mn [org.dataone.integration.ContextAwareTestCaseDataone]
20151112-05:14:41: [INFO]: rest call info: GET https://mn-dev-unm-2.test.dataone.org/metacat/d1/mn/v2/monitor/ping [org.dataone.client.rest.RestClient]
20151112-05:14:41: [INFO]: MN included in test: https://mn-dev-unm-2.test.dataone.org/metacat/d1/mn [org.dataone.integration.ContextAwareTestCaseDataone]
20151112-05:14:41: [INFO]: 
***************** running test for testUpdateSystemMetadata_MutableObsoletedBy(...) vs. node: https://mn-dev-ucsb-2.test.dataone.org/metacat/d1/mn ***************** [org.dataone.integration.ContextAwareTestCaseDataone]
20151112-05:14:41: [INFO]: certificate directory: /etc/dataone/client/testClientCerts/ [org.dataone.integration.ContextAwareTestCaseDataone]
20151112-05:14:41: [INFO]: certificate filename: cnDevUNM2 [org.dataone.integration.ContextAwareTestCaseDataone]
20151112-05:14:41: [INFO]: client setup as Subject: CN=urn:node:cnDevUNM2,DC=dataone,DC=org [org.dataone.integration.ContextAwareTestCaseDataone]
20151112-05:14:41: [INFO]: creating a test object.  pid = testUpdateSystemMetadata_MutableObsoletedBy_2015315211441949 on https://mn-dev-ucsb-2.test.dataone.org/metacat/d1/mn/v2 [org.dataone.integration.ContextAwareTestCaseDataone]
20151112-05:14:41: [INFO]: SystemMetadata for pid: testUpdateSystemMetadata_MutableObsoletedBy_2015315211441949
<?xml version="1.0" encoding="UTF-8"?><d1_v2.0:systemMetadata xmlns:d1_v2.0="http://ns.dataone.org/service/types/v2.0" xmlns:d1="http://ns.dataone.org/service/types/v1"><serialVersion>1</serialVersion><identifier>testUpdateSystemMetadata_MutableObsoletedBy_2015315211441949</identifier><formatId>eml://ecoinformatics.org/eml-2.0.1</formatId><size>17181</size><checksum algorithm="MD5">03ce09c6b4c3efc1681f3023402998a2</checksum><submitter>CN=urn:node:cnDevUNM2,DC=dataone,DC=org</submitter><rightsHolder>CN=testRightsHolder,DC=dataone,DC=org</rightsHolder><accessPolicy><allow><subject>CN=testRightsHolder,DC=dataone,DC=org</subject><permission>changePermission</permission></allow></accessPolicy><dateUploaded>2015-11-12T05:14:41.964+00:00</dateUploaded><dateSysMetadataModified>2015-11-12T05:14:41.964+00:00</dateSysMetadataModified><originMemberNode>urn:node:mnDevUCSB2</originMemberNode><authoritativeMemberNode>urn:node:mnDevUCSB2</authoritativeMemberNode></d1_v2.0:systemMetadata> [org.dataone.integration.ContextAwareTestCaseDataone]
20151112-05:14:42: [INFO]: rest call info: POST https://mn-dev-ucsb-2.test.dataone.org/metacat/d1/mn/v2/object; MMP message has: ParamPart:pid = testUpdateSystemMetadata_MutableObsoletedBy_2015315211441949; FilePart:object = /tmp/mmp.output.7114875478590980826.tmp (17181 bytes); FilePart:sysmeta = /tmp/mmp.output.4969633472226756589.tmp (986 bytes);  [org.dataone.client.rest.RestClient]
20151112-05:14:42: [INFO]: object created.  pid = testUpdateSystemMetadata_MutableObsoletedBy_2015315211441949 [org.dataone.integration.ContextAwareTestCaseDataone]
20151112-05:14:42: [INFO]: certificate directory: /etc/dataone/client/testClientCerts/ [org.dataone.integration.ContextAwareTestCaseDataone]
20151112-05:14:42: [INFO]: certificate filename: cnDevUNM2 [org.dataone.integration.ContextAwareTestCaseDataone]
20151112-05:14:42: [INFO]: client setup as Subject: CN=urn:node:cnDevUNM2,DC=dataone,DC=org [org.dataone.integration.ContextAwareTestCaseDataone]
20151112-05:14:42: [INFO]: creating a test object.  pid = testUpdateSystemMetadata_MutableObsoletedBy_2015315211441950 on https://mn-dev-ucsb-2.test.dataone.org/metacat/d1/mn/v2 [org.dataone.integration.ContextAwareTestCaseDataone]
20151112-05:14:42: [INFO]: SystemMetadata for pid: testUpdateSystemMetadata_MutableObsoletedBy_2015315211441950
<?xml version="1.0" encoding="UTF-8"?><d1_v2.0:systemMetadata xmlns:d1_v2.0="http://ns.dataone.org/service/types/v2.0" xmlns:d1="http://ns.dataone.org/service/types/v1"><serialVersion>1</serialVersion><identifier>testUpdateSystemMetadata_MutableObsoletedBy_2015315211441950</identifier><formatId>eml://ecoinformatics.org/eml-2.0.1</formatId><size>17181</size><checksum algorithm="MD5">03ce09c6b4c3efc1681f3023402998a2</checksum><submitter>CN=urn:node:cnDevUNM2,DC=dataone,DC=org</submitter><rightsHolder>CN=testRightsHolder,DC=dataone,DC=org</rightsHolder><accessPolicy><allow><subject>CN=testRightsHolder,DC=dataone,DC=org</subject><permission>changePermission</permission></allow></accessPolicy><dateUploaded>2015-11-12T05:14:42.905+00:00</dateUploaded><dateSysMetadataModified>2015-11-12T05:14:42.905+00:00</dateSysMetadataModified><originMemberNode>urn:node:mnDevUCSB2</originMemberNode><authoritativeMemberNode>urn:node:mnDevUCSB2</authoritativeMemberNode></d1_v2.0:systemMetadata> [org.dataone.integration.ContextAwareTestCaseDataone]
20151112-05:14:43: [INFO]: rest call info: POST https://mn-dev-ucsb-2.test.dataone.org/metacat/d1/mn/v2/object; MMP message has: ParamPart:pid = testUpdateSystemMetadata_MutableObsoletedBy_2015315211441950; FilePart:object = /tmp/mmp.output.445449681455335018.tmp (17181 bytes); FilePart:sysmeta = /tmp/mmp.output.6924073870368641453.tmp (986 bytes);  [org.dataone.client.rest.RestClient]
20151112-05:14:43: [INFO]: object created.  pid = testUpdateSystemMetadata_MutableObsoletedBy_2015315211441950 [org.dataone.integration.ContextAwareTestCaseDataone]
20151112-05:14:54: [INFO]: rest call info: GET https://mn-dev-ucsb-2.test.dataone.org/metacat/d1/mn/v2/meta/testUpdateSystemMetadata_MutableObsoletedBy_2015315211441949 [org.dataone.client.rest.RestClient]
20151112-05:15:00: [INFO]: rest call info: PUT https://mn-dev-ucsb-2.test.dataone.org/metacat/d1/mn/v2/meta; MMP message has: ParamPart:pid = testUpdateSystemMetadata_MutableObsoletedBy_2015315211441949; FilePart:sysmeta = /tmp/mmp.output.2083385866387007877.tmp (1097 bytes);  [org.dataone.client.rest.RestClient]
20151112-05:15:00: [INFO]: 
***************** running test for testUpdateSystemMetadata_MutableObsoletedBy(...) vs. node: https://mn-dev-unm-2.test.dataone.org/metacat/d1/mn ***************** [org.dataone.integration.ContextAwareTestCaseDataone]
20151112-05:15:00: [INFO]: certificate directory: /etc/dataone/client/testClientCerts/ [org.dataone.integration.ContextAwareTestCaseDataone]
20151112-05:15:00: [INFO]: certificate filename: cnDevUNM2 [org.dataone.integration.ContextAwareTestCaseDataone]
20151112-05:15:00: [INFO]: client setup as Subject: CN=urn:node:cnDevUNM2,DC=dataone,DC=org [org.dataone.integration.ContextAwareTestCaseDataone]
20151112-05:15:00: [INFO]: creating a test object.  pid = testUpdateSystemMetadata_MutableObsoletedBy_20153152115070 on https://mn-dev-unm-2.test.dataone.org/metacat/d1/mn/v2 [org.dataone.integration.ContextAwareTestCaseDataone]
20151112-05:15:00: [INFO]: SystemMetadata for pid: testUpdateSystemMetadata_MutableObsoletedBy_20153152115070
<?xml version="1.0" encoding="UTF-8"?><d1_v2.0:systemMetadata xmlns:d1_v2.0="http://ns.dataone.org/service/types/v2.0" xmlns:d1="http://ns.dataone.org/service/types/v1"><serialVersion>1</serialVersion><identifier>testUpdateSystemMetadata_MutableObsoletedBy_20153152115070</identifier><formatId>eml://ecoinformatics.org/eml-2.0.1</formatId><size>17181</size><checksum algorithm="MD5">03ce09c6b4c3efc1681f3023402998a2</checksum><submitter>CN=urn:node:cnDevUNM2,DC=dataone,DC=org</submitter><rightsHolder>CN=testRightsHolder,DC=dataone,DC=org</rightsHolder><accessPolicy><allow><subject>CN=testRightsHolder,DC=dataone,DC=org</subject><permission>changePermission</permission></allow></accessPolicy><dateUploaded>2015-11-12T05:15:00.085+00:00</dateUploaded><dateSysMetadataModified>2015-11-12T05:15:00.085+00:00</dateSysMetadataModified><originMemberNode>urn:node:mnDevUNM2</originMemberNode><authoritativeMemberNode>urn:node:mnDevUNM2</authoritativeMemberNode></d1_v2.0:systemMetadata> [org.dataone.integration.ContextAwareTestCaseDataone]
20151112-05:15:00: [INFO]: rest call info: POST https://mn-dev-unm-2.test.dataone.org/metacat/d1/mn/v2/object; MMP message has: ParamPart:pid = testUpdateSystemMetadata_MutableObsoletedBy_20153152115070; FilePart:object = /tmp/mmp.output.2711706064754192404.tmp (17181 bytes); FilePart:sysmeta = /tmp/mmp.output.1964951880091837825.tmp (982 bytes);  [org.dataone.client.rest.RestClient]
20151112-05:15:00: [INFO]: object created.  pid = testUpdateSystemMetadata_MutableObsoletedBy_20153152115070 [org.dataone.integration.ContextAwareTestCaseDataone]
20151112-05:15:00: [INFO]: certificate directory: /etc/dataone/client/testClientCerts/ [org.dataone.integration.ContextAwareTestCaseDataone]
20151112-05:15:00: [INFO]: certificate filename: cnDevUNM2 [org.dataone.integration.ContextAwareTestCaseDataone]
20151112-05:15:00: [INFO]: client setup as Subject: CN=urn:node:cnDevUNM2,DC=dataone,DC=org [org.dataone.integration.ContextAwareTestCaseDataone]
20151112-05:15:00: [INFO]: creating a test object.  pid = testUpdateSystemMetadata_MutableObsoletedBy_20153152115072 on https://mn-dev-unm-2.test.dataone.org/metacat/d1/mn/v2 [org.dataone.integration.ContextAwareTestCaseDataone]
20151112-05:15:00: [INFO]: SystemMetadata for pid: testUpdateSystemMetadata_MutableObsoletedBy_20153152115072
<?xml version="1.0" encoding="UTF-8"?><d1_v2.0:systemMetadata xmlns:d1_v2.0="http://ns.dataone.org/service/types/v2.0" xmlns:d1="http://ns.dataone.org/service/types/v1"><serialVersion>1</serialVersion><identifier>testUpdateSystemMetadata_MutableObsoletedBy_20153152115072</identifier><formatId>eml://ecoinformatics.org/eml-2.0.1</formatId><size>17181</size><checksum algorithm="MD5">03ce09c6b4c3efc1681f3023402998a2</checksum><submitter>CN=urn:node:cnDevUNM2,DC=dataone,DC=org</submitter><rightsHolder>CN=testRightsHolder,DC=dataone,DC=org</rightsHolder><accessPolicy><allow><subject>CN=testRightsHolder,DC=dataone,DC=org</subject><permission>changePermission</permission></allow></accessPolicy><dateUploaded>2015-11-12T05:15:00.982+00:00</dateUploaded><dateSysMetadataModified>2015-11-12T05:15:00.982+00:00</dateSysMetadataModified><originMemberNode>urn:node:mnDevUNM2</originMemberNode><authoritativeMemberNode>urn:node:mnDevUNM2</authoritativeMemberNode></d1_v2.0:systemMetadata> [org.dataone.integration.ContextAwareTestCaseDataone]
20151112-05:15:01: [INFO]: rest call info: POST https://mn-dev-unm-2.test.dataone.org/metacat/d1/mn/v2/object; MMP message has: ParamPart:pid = testUpdateSystemMetadata_MutableObsoletedBy_20153152115072; FilePart:object = /tmp/mmp.output.5055542407221464193.tmp (17181 bytes); FilePart:sysmeta = /tmp/mmp.output.8264978667854915893.tmp (982 bytes);  [org.dataone.client.rest.RestClient]
20151112-05:15:01: [INFO]: object created.  pid = testUpdateSystemMetadata_MutableObsoletedBy_20153152115072 [org.dataone.integration.ContextAwareTestCaseDataone]
20151112-05:15:12: [INFO]: rest call info: GET https://mn-dev-unm-2.test.dataone.org/metacat/d1/mn/v2/meta/testUpdateSystemMetadata_MutableObsoletedBy_20153152115070 [org.dataone.client.rest.RestClient]
20151112-05:15:17: [INFO]: rest call info: PUT https://mn-dev-unm-2.test.dataone.org/metacat/d1/mn/v2/meta; MMP message has: ParamPart:pid = testUpdateSystemMetadata_MutableObsoletedBy_20153152115070; FilePart:sysmeta = /tmp/mmp.output.3436831603802780676.tmp (1091 bytes);  [org.dataone.client.rest.RestClient]
20151112-05:15:17: [INFO]: **************************************************** [org.dataone.integration.ContextAwareTestCaseDataone]
20151112-05:15:17: [INFO]: ***  context label:   DEV2 [org.dataone.integration.ContextAwareTestCaseDataone]
20151112-05:15:17: [INFO]: **************************************************** [org.dataone.integration.ContextAwareTestCaseDataone]
20151112-05:15:17: [INFO]: **************************************************** [org.dataone.integration.ContextAwareTestCaseDataone]
20151112-05:15:17: [INFO]: rest call info: GET https://mn-dev-ucsb-1.test.dataone.org/metacat/d1/mn/v2/monitor/ping [org.dataone.client.rest.RestClient]
20151112-05:15:17: [INFO]: MN excluded from test: https://mn-dev-ucsb-1.test.dataone.org/metacat/d1/mn [org.dataone.integration.ContextAwareTestCaseDataone]
20151112-05:15:18: [INFO]: rest call info: GET https://mn-dev-ucsb-2.test.dataone.org/metacat/d1/mn/v2/monitor/ping [org.dataone.client.rest.RestClient]
20151112-05:15:18: [INFO]: MN included in test: https://mn-dev-ucsb-2.test.dataone.org/metacat/d1/mn [org.dataone.integration.ContextAwareTestCaseDataone]
20151112-05:15:18: [INFO]: rest call info: GET https://mn-dev-unm-1.test.dataone.org/metacat/d1/mn/v2/monitor/ping [org.dataone.client.rest.RestClient]
20151112-05:15:18: [INFO]: MN excluded from test: https://mn-dev-unm-1.test.dataone.org/metacat/d1/mn [org.dataone.integration.ContextAwareTestCaseDataone]
20151112-05:15:18: [INFO]: rest call info: GET https://mn-dev-unm-2.test.dataone.org/metacat/d1/mn/v2/monitor/ping [org.dataone.client.rest.RestClient]
20151112-05:15:18: [INFO]: MN included in test: https://mn-dev-unm-2.test.dataone.org/metacat/d1/mn [org.dataone.integration.ContextAwareTestCaseDataone]
20151112-05:15:18: [INFO]: 
***************** running test for testUpdateSystemMetadata_MutableObsoletes(...) vs. node: https://mn-dev-ucsb-2.test.dataone.org/metacat/d1/mn ***************** [org.dataone.integration.ContextAwareTestCaseDataone]
20151112-05:15:18: [INFO]: certificate directory: /etc/dataone/client/testClientCerts/ [org.dataone.integration.ContextAwareTestCaseDataone]
20151112-05:15:18: [INFO]: certificate filename: cnDevUNM2 [org.dataone.integration.ContextAwareTestCaseDataone]
20151112-05:15:18: [INFO]: client setup as Subject: CN=urn:node:cnDevUNM2,DC=dataone,DC=org [org.dataone.integration.ContextAwareTestCaseDataone]
20151112-05:15:18: [INFO]: creating a test object.  pid = testUpdateSystemMetadata_MutableObsoletes_2015315211518551 on https://mn-dev-ucsb-2.test.dataone.org/metacat/d1/mn/v2 [org.dataone.integration.ContextAwareTestCaseDataone]
20151112-05:15:18: [INFO]: SystemMetadata for pid: testUpdateSystemMetadata_MutableObsoletes_2015315211518551
<?xml version="1.0" encoding="UTF-8"?><d1_v2.0:systemMetadata xmlns:d1_v2.0="http://ns.dataone.org/service/types/v2.0" xmlns:d1="http://ns.dataone.org/service/types/v1"><serialVersion>1</serialVersion><identifier>testUpdateSystemMetadata_MutableObsoletes_2015315211518551</identifier><formatId>eml://ecoinformatics.org/eml-2.0.1</formatId><size>17181</size><checksum algorithm="MD5">03ce09c6b4c3efc1681f3023402998a2</checksum><submitter>CN=urn:node:cnDevUNM2,DC=dataone,DC=org</submitter><rightsHolder>CN=testRightsHolder,DC=dataone,DC=org</rightsHolder><accessPolicy><allow><subject>CN=testRightsHolder,DC=dataone,DC=org</subject><permission>changePermission</permission></allow></accessPolicy><dateUploaded>2015-11-12T05:15:18.565+00:00</dateUploaded><dateSysMetadataModified>2015-11-12T05:15:18.565+00:00</dateSysMetadataModified><originMemberNode>urn:node:mnDevUCSB2</originMemberNode><authoritativeMemberNode>urn:node:mnDevUCSB2</authoritativeMemberNode></d1_v2.0:systemMetadata> [org.dataone.integration.ContextAwareTestCaseDataone]
20151112-05:15:19: [INFO]: rest call info: POST https://mn-dev-ucsb-2.test.dataone.org/metacat/d1/mn/v2/object; MMP message has: ParamPart:pid = testUpdateSystemMetadata_MutableObsoletes_2015315211518551; FilePart:object = /tmp/mmp.output.5838166437654908517.tmp (17181 bytes); FilePart:sysmeta = /tmp/mmp.output.935900647435957900.tmp (984 bytes);  [org.dataone.client.rest.RestClient]
20151112-05:15:19: [INFO]: object created.  pid = testUpdateSystemMetadata_MutableObsoletes_2015315211518551 [org.dataone.integration.ContextAwareTestCaseDataone]
20151112-05:15:19: [INFO]: certificate directory: /etc/dataone/client/testClientCerts/ [org.dataone.integration.ContextAwareTestCaseDataone]
20151112-05:15:19: [INFO]: certificate filename: cnDevUNM2 [org.dataone.integration.ContextAwareTestCaseDataone]
20151112-05:15:19: [INFO]: client setup as Subject: CN=urn:node:cnDevUNM2,DC=dataone,DC=org [org.dataone.integration.ContextAwareTestCaseDataone]
20151112-05:15:19: [INFO]: creating a test object.  pid = testUpdateSystemMetadata_MutableObsoletes_2015315211518552 on https://mn-dev-ucsb-2.test.dataone.org/metacat/d1/mn/v2 [org.dataone.integration.ContextAwareTestCaseDataone]
20151112-05:15:19: [INFO]: SystemMetadata for pid: testUpdateSystemMetadata_MutableObsoletes_2015315211518552
<?xml version="1.0" encoding="UTF-8"?><d1_v2.0:systemMetadata xmlns:d1_v2.0="http://ns.dataone.org/service/types/v2.0" xmlns:d1="http://ns.dataone.org/service/types/v1"><serialVersion>1</serialVersion><identifier>testUpdateSystemMetadata_MutableObsoletes_2015315211518552</identifier><formatId>eml://ecoinformatics.org/eml-2.0.1</formatId><size>17181</size><checksum algorithm="MD5">03ce09c6b4c3efc1681f3023402998a2</checksum><submitter>CN=urn:node:cnDevUNM2,DC=dataone,DC=org</submitter><rightsHolder>CN=testRightsHolder,DC=dataone,DC=org</rightsHolder><accessPolicy><allow><subject>CN=testRightsHolder,DC=dataone,DC=org</subject><permission>changePermission</permission></allow></accessPolicy><dateUploaded>2015-11-12T05:15:19.596+00:00</dateUploaded><dateSysMetadataModified>2015-11-12T05:15:19.596+00:00</dateSysMetadataModified><originMemberNode>urn:node:mnDevUCSB2</originMemberNode><authoritativeMemberNode>urn:node:mnDevUCSB2</authoritativeMemberNode></d1_v2.0:systemMetadata> [org.dataone.integration.ContextAwareTestCaseDataone]
20151112-05:15:20: [INFO]: rest call info: POST https://mn-dev-ucsb-2.test.dataone.org/metacat/d1/mn/v2/object; MMP message has: ParamPart:pid = testUpdateSystemMetadata_MutableObsoletes_2015315211518552; FilePart:object = /tmp/mmp.output.5547994910739722503.tmp (17181 bytes); FilePart:sysmeta = /tmp/mmp.output.2348738230260757651.tmp (984 bytes);  [org.dataone.client.rest.RestClient]
20151112-05:15:20: [INFO]: object created.  pid = testUpdateSystemMetadata_MutableObsoletes_2015315211518552 [org.dataone.integration.ContextAwareTestCaseDataone]
20151112-05:15:31: [INFO]: rest call info: GET https://mn-dev-ucsb-2.test.dataone.org/metacat/d1/mn/v2/meta/testUpdateSystemMetadata_MutableObsoletes_2015315211518552 [org.dataone.client.rest.RestClient]
20151112-05:15:36: [INFO]: rest call info: PUT https://mn-dev-ucsb-2.test.dataone.org/metacat/d1/mn/v2/meta; MMP message has: ParamPart:pid = testUpdateSystemMetadata_MutableObsoletes_2015315211518552; FilePart:sysmeta = /tmp/mmp.output.2183676299238781935.tmp (1089 bytes);  [org.dataone.client.rest.RestClient]
20151112-05:15:36: [INFO]: 
***************** running test for testUpdateSystemMetadata_MutableObsoletes(...) vs. node: https://mn-dev-unm-2.test.dataone.org/metacat/d1/mn ***************** [org.dataone.integration.ContextAwareTestCaseDataone]
20151112-05:15:36: [INFO]: certificate directory: /etc/dataone/client/testClientCerts/ [org.dataone.integration.ContextAwareTestCaseDataone]
20151112-05:15:36: [INFO]: certificate filename: cnDevUNM2 [org.dataone.integration.ContextAwareTestCaseDataone]
20151112-05:15:36: [INFO]: client setup as Subject: CN=urn:node:cnDevUNM2,DC=dataone,DC=org [org.dataone.integration.ContextAwareTestCaseDataone]
20151112-05:15:36: [INFO]: creating a test object.  pid = testUpdateSystemMetadata_MutableObsoletes_2015315211536798 on https://mn-dev-unm-2.test.dataone.org/metacat/d1/mn/v2 [org.dataone.integration.ContextAwareTestCaseDataone]
20151112-05:15:36: [INFO]: SystemMetadata for pid: testUpdateSystemMetadata_MutableObsoletes_2015315211536798
<?xml version="1.0" encoding="UTF-8"?><d1_v2.0:systemMetadata xmlns:d1_v2.0="http://ns.dataone.org/service/types/v2.0" xmlns:d1="http://ns.dataone.org/service/types/v1"><serialVersion>1</serialVersion><identifier>testUpdateSystemMetadata_MutableObsoletes_2015315211536798</identifier><formatId>eml://ecoinformatics.org/eml-2.0.1</formatId><size>17181</size><checksum algorithm="MD5">03ce09c6b4c3efc1681f3023402998a2</checksum><submitter>CN=urn:node:cnDevUNM2,DC=dataone,DC=org</submitter><rightsHolder>CN=testRightsHolder,DC=dataone,DC=org</rightsHolder><accessPolicy><allow><subject>CN=testRightsHolder,DC=dataone,DC=org</subject><permission>changePermission</permission></allow></accessPolicy><dateUploaded>2015-11-12T05:15:36.811+00:00</dateUploaded><dateSysMetadataModified>2015-11-12T05:15:36.811+00:00</dateSysMetadataModified><originMemberNode>urn:node:mnDevUNM2</originMemberNode><authoritativeMemberNode>urn:node:mnDevUNM2</authoritativeMemberNode></d1_v2.0:systemMetadata> [org.dataone.integration.ContextAwareTestCaseDataone]
20151112-05:15:37: [INFO]: rest call info: POST https://mn-dev-unm-2.test.dataone.org/metacat/d1/mn/v2/object; MMP message has: ParamPart:pid = testUpdateSystemMetadata_MutableObsoletes_2015315211536798; FilePart:object = /tmp/mmp.output.5885893599335110668.tmp (17181 bytes); FilePart:sysmeta = /tmp/mmp.output.7909823525318086073.tmp (982 bytes);  [org.dataone.client.rest.RestClient]
20151112-05:15:37: [INFO]: object created.  pid = testUpdateSystemMetadata_MutableObsoletes_2015315211536798 [org.dataone.integration.ContextAwareTestCaseDataone]
20151112-05:15:37: [INFO]: certificate directory: /etc/dataone/client/testClientCerts/ [org.dataone.integration.ContextAwareTestCaseDataone]
20151112-05:15:37: [INFO]: certificate filename: cnDevUNM2 [org.dataone.integration.ContextAwareTestCaseDataone]
20151112-05:15:37: [INFO]: client setup as Subject: CN=urn:node:cnDevUNM2,DC=dataone,DC=org [org.dataone.integration.ContextAwareTestCaseDataone]
20151112-05:15:37: [INFO]: creating a test object.  pid = testUpdateSystemMetadata_MutableObsoletes_2015315211536799 on https://mn-dev-unm-2.test.dataone.org/metacat/d1/mn/v2 [org.dataone.integration.ContextAwareTestCaseDataone]
20151112-05:15:37: [INFO]: SystemMetadata for pid: testUpdateSystemMetadata_MutableObsoletes_2015315211536799
<?xml version="1.0" encoding="UTF-8"?><d1_v2.0:systemMetadata xmlns:d1_v2.0="http://ns.dataone.org/service/types/v2.0" xmlns:d1="http://ns.dataone.org/service/types/v1"><serialVersion>1</serialVersion><identifier>testUpdateSystemMetadata_MutableObsoletes_2015315211536799</identifier><formatId>eml://ecoinformatics.org/eml-2.0.1</formatId><size>17181</size><checksum algorithm="MD5">03ce09c6b4c3efc1681f3023402998a2</checksum><submitter>CN=urn:node:cnDevUNM2,DC=dataone,DC=org</submitter><rightsHolder>CN=testRightsHolder,DC=dataone,DC=org</rightsHolder><accessPolicy><allow><subject>CN=testRightsHolder,DC=dataone,DC=org</subject><permission>changePermission</permission></allow></accessPolicy><dateUploaded>2015-11-12T05:15:37.817+00:00</dateUploaded><dateSysMetadataModified>2015-11-12T05:15:37.817+00:00</dateSysMetadataModified><originMemberNode>urn:node:mnDevUNM2</originMemberNode><authoritativeMemberNode>urn:node:mnDevUNM2</authoritativeMemberNode></d1_v2.0:systemMetadata> [org.dataone.integration.ContextAwareTestCaseDataone]
20151112-05:15:38: [INFO]: rest call info: POST https://mn-dev-unm-2.test.dataone.org/metacat/d1/mn/v2/object; MMP message has: ParamPart:pid = testUpdateSystemMetadata_MutableObsoletes_2015315211536799; FilePart:object = /tmp/mmp.output.7375566486015311371.tmp (17181 bytes); FilePart:sysmeta = /tmp/mmp.output.7635941990663059656.tmp (982 bytes);  [org.dataone.client.rest.RestClient]
20151112-05:15:38: [INFO]: object created.  pid = testUpdateSystemMetadata_MutableObsoletes_2015315211536799 [org.dataone.integration.ContextAwareTestCaseDataone]
20151112-05:15:48: [INFO]: rest call info: GET https://mn-dev-unm-2.test.dataone.org/metacat/d1/mn/v2/meta/testUpdateSystemMetadata_MutableObsoletes_2015315211536799 [org.dataone.client.rest.RestClient]
20151112-05:15:54: [INFO]: rest call info: PUT https://mn-dev-unm-2.test.dataone.org/metacat/d1/mn/v2/meta; MMP message has: ParamPart:pid = testUpdateSystemMetadata_MutableObsoletes_2015315211536799; FilePart:sysmeta = /tmp/mmp.output.2777260766060045631.tmp (1087 bytes);  [org.dataone.client.rest.RestClient]
20151112-05:15:54: [INFO]: **************************************************** [org.dataone.integration.ContextAwareTestCaseDataone]
20151112-05:15:54: [INFO]: ***  context label:   DEV2 [org.dataone.integration.ContextAwareTestCaseDataone]
20151112-05:15:54: [INFO]: **************************************************** [org.dataone.integration.ContextAwareTestCaseDataone]
20151112-05:15:54: [INFO]: **************************************************** [org.dataone.integration.ContextAwareTestCaseDataone]
20151112-05:15:54: [INFO]: rest call info: GET https://mn-dev-ucsb-1.test.dataone.org/metacat/d1/mn/v2/monitor/ping [org.dataone.client.rest.RestClient]
20151112-05:15:54: [INFO]: MN excluded from test: https://mn-dev-ucsb-1.test.dataone.org/metacat/d1/mn [org.dataone.integration.ContextAwareTestCaseDataone]
20151112-05:15:54: [INFO]: rest call info: GET https://mn-dev-ucsb-2.test.dataone.org/metacat/d1/mn/v2/monitor/ping [org.dataone.client.rest.RestClient]
20151112-05:15:54: [INFO]: MN included in test: https://mn-dev-ucsb-2.test.dataone.org/metacat/d1/mn [org.dataone.integration.ContextAwareTestCaseDataone]
20151112-05:15:54: [INFO]: rest call info: GET https://mn-dev-unm-1.test.dataone.org/metacat/d1/mn/v2/monitor/ping [org.dataone.client.rest.RestClient]
20151112-05:15:54: [INFO]: MN excluded from test: https://mn-dev-unm-1.test.dataone.org/metacat/d1/mn [org.dataone.integration.ContextAwareTestCaseDataone]
20151112-05:15:54: [INFO]: rest call info: GET https://mn-dev-unm-2.test.dataone.org/metacat/d1/mn/v2/monitor/ping [org.dataone.client.rest.RestClient]
20151112-05:15:54: [INFO]: MN included in test: https://mn-dev-unm-2.test.dataone.org/metacat/d1/mn [org.dataone.integration.ContextAwareTestCaseDataone]
20151112-05:15:54: [INFO]: 
***************** running test for testUpdateSystemMetadata_CNCertNonAuthMN(...) vs. node: https://mn-dev-ucsb-2.test.dataone.org/metacat/d1/mn ***************** [org.dataone.integration.ContextAwareTestCaseDataone]
20151112-05:15:54: [INFO]: rest call info: GET https://cn-dev-ucsb-2.test.dataone.org/cn/v2/node [org.dataone.client.rest.RestClient]
Tests run: 14, Failures: 1, Errors: 0, Skipped: 1, Time elapsed: 369.151 sec <<< FAILURE!

Results :

Failed tests: 
  testSetReplicationStatus_dateModified(org.dataone.integration.it.apiTests.MNSystemMetadataMutabilityIt): Unable to fetch node list from CN: https://cn-dev-ucsb-2.test.dataone.org/cn/v2
  testSetReplicationMetadata_dateModified(org.dataone.integration.it.apiTests.MNSystemMetadataMutabilityIt): Unable to fetch node list from CN: https://cn-dev-ucsb-2.test.dataone.org/cn/v2
  testDeleteReplicationMetadata_dateModified(org.dataone.integration.it.apiTests.MNSystemMetadataMutabilityIt): Unable to fetch node list from CN: https://cn-dev-ucsb-2.test.dataone.org/cn/v2
  testRegisterSystemMetadata_dateModified(org.dataone.integration.it.apiTests.MNSystemMetadataMutabilityIt): Unable to fetch node list from CN: https://cn-dev-ucsb-2.test.dataone.org/cn/v2
  testUpdateSystemMetadata_CNCertNonAuthMN(org.dataone.integration.it.apiTests.MNUpdateSystemMetadataIT): Test setup failed. Couldn't create object: GET https://cn-dev-ucsb-2.test.dataone.org/cn/v2/node : ServiceFailure: -1: 500: Internal Server Error: Deserializing Text/Plain: Just providing message body:

Tests run: 18, Failures: 5, Errors: 0, Skipped: 1

[WARNING] File encoding has not been set, using platform encoding UTF-8, i.e. build is platform dependent!
[JENKINS] Recording test results
[INFO] 
[INFO] --- maven-failsafe-plugin:2.8.1:verify (verify) @ d1_integration ---
[INFO] Failsafe report directory: /var/lib/jenkins/jobs/d1_integration_DEV2_mn_sysmeta_mutability/workspace/target/failsafe-reports
[WARNING] File encoding has not been set, using platform encoding UTF-8, i.e. build is platform dependent!
[ERROR] There are test failures.

Please refer to /var/lib/jenkins/jobs/d1_integration_DEV2_mn_sysmeta_mutability/workspace/target/failsafe-reports for the individual test results.
[JENKINS] Recording test results
Notifying upstream projects of job completion
Join notifier requires a CauseAction
[INFO] ------------------------------------------------------------------------
[INFO] BUILD SUCCESS
[INFO] ------------------------------------------------------------------------
[INFO] Total time: 6:44.637s
[INFO] Finished at: Thu Nov 12 05:15:54 UTC 2015
[INFO] Final Memory: 43M/363M
[INFO] ------------------------------------------------------------------------
Waiting for Jenkins to finish collecting data
[JENKINS] Archiving /var/lib/jenkins/jobs/d1_integration_DEV2_mn_sysmeta_mutability/workspace/pom.xml to org.dataone/d1_integration/2.0-SNAPSHOT/d1_integration-2.0-SNAPSHOT.pom
channel stopped
Notifying upstream projects of job completion
Warning: you have no plugins providing access control for builds, so falling back to legacy behavior of permitting any downstream builds to be triggered
Finished: UNSTABLE