UnstableConsole Output

Skipping 186 KB.. Full Log
ckJUnit4ClassRunner.runChild(BlockJUnit4ClassRunner.java:76)
	at org.junit.runners.BlockJUnit4ClassRunner.runChild(BlockJUnit4ClassRunner.java:50)
	at org.junit.runners.ParentRunner$3.run(ParentRunner.java:193)
	at org.junit.runners.ParentRunner$1.schedule(ParentRunner.java:52)
	at org.junit.runners.ParentRunner.runChildren(ParentRunner.java:191)
	at org.junit.runners.ParentRunner.access$000(ParentRunner.java:42)
	at org.junit.runners.ParentRunner$2.evaluate(ParentRunner.java:184)
	at org.junit.runners.ParentRunner.run(ParentRunner.java:236)
	at org.apache.maven.surefire.junit4.JUnit4TestSet.execute(JUnit4TestSet.java:53)
	at org.apache.maven.surefire.junit4.JUnit4Provider.executeTestSet(JUnit4Provider.java:123)
	at org.apache.maven.surefire.junit4.JUnit4Provider.invoke(JUnit4Provider.java:104)
	at sun.reflect.NativeMethodAccessorImpl.invoke0(Native Method)
	at sun.reflect.NativeMethodAccessorImpl.invoke(NativeMethodAccessorImpl.java:57)
	at sun.reflect.DelegatingMethodAccessorImpl.invoke(DelegatingMethodAccessorImpl.java:43)
	at java.lang.reflect.Method.invoke(Method.java:606)
	at org.apache.maven.surefire.util.ReflectionUtils.invokeMethodWithArray(ReflectionUtils.java:164)
	at org.apache.maven.surefire.booter.ProviderFactory$ProviderProxy.invoke(ProviderFactory.java:110)
	at org.apache.maven.surefire.booter.SurefireStarter.invokeProvider(SurefireStarter.java:175)
	at org.apache.maven.surefire.booter.SurefireStarter.runSuitesInProcessWhenForked(SurefireStarter.java:107)
	at org.apache.maven.surefire.booter.ForkedBooter.main(ForkedBooter.java:68)
Caused by: org.apache.commons.configuration.ConfigurationException: Cannot locate configuration source null
	at org.apache.commons.configuration.AbstractFileConfiguration.load(AbstractFileConfiguration.java:217)
	at org.apache.commons.configuration.AbstractFileConfiguration.load(AbstractFileConfiguration.java:197)
	at org.apache.commons.configuration.AbstractFileConfiguration.<init>(AbstractFileConfiguration.java:181)
	at org.apache.commons.configuration.PropertiesConfiguration.<init>(PropertiesConfiguration.java:269)
	at org.dataone.configuration.TestSettings.loadConfigurationFile(TestSettings.java:199)
	at org.dataone.configuration.TestSettings.getConfiguration(TestSettings.java:69)
	... 38 more
20151111-05:09:28: [ERROR]: Problem loading testing configuration at: 'null':: Cannot locate configuration source null [org.dataone.configuration.TestSettings]
20151111-05:09:28: [ERROR]: General Problem loading TestSettings. InvocationTargetException: null [org.dataone.configuration.Settings]
java.lang.reflect.InvocationTargetException
	at sun.reflect.NativeMethodAccessorImpl.invoke0(Native Method)
	at sun.reflect.NativeMethodAccessorImpl.invoke(NativeMethodAccessorImpl.java:57)
	at sun.reflect.DelegatingMethodAccessorImpl.invoke(DelegatingMethodAccessorImpl.java:43)
	at java.lang.reflect.Method.invoke(Method.java:606)
	at org.dataone.configuration.Settings.loadTestConfigurations(Settings.java:151)
	at org.dataone.configuration.Settings.getConfiguration(Settings.java:87)
	at org.dataone.configuration.Settings.getResetConfiguration(Settings.java:123)
	at org.dataone.configuration.TestSettingsTest.testContextSafetyOnError(TestSettingsTest.java:209)
	at sun.reflect.NativeMethodAccessorImpl.invoke0(Native Method)
	at sun.reflect.NativeMethodAccessorImpl.invoke(NativeMethodAccessorImpl.java:57)
	at sun.reflect.DelegatingMethodAccessorImpl.invoke(DelegatingMethodAccessorImpl.java:43)
	at java.lang.reflect.Method.invoke(Method.java:606)
	at org.junit.runners.model.FrameworkMethod$1.runReflectiveCall(FrameworkMethod.java:44)
	at org.junit.internal.runners.model.ReflectiveCallable.run(ReflectiveCallable.java:15)
	at org.junit.runners.model.FrameworkMethod.invokeExplosively(FrameworkMethod.java:41)
	at org.junit.internal.runners.statements.InvokeMethod.evaluate(InvokeMethod.java:20)
	at org.junit.internal.runners.statements.RunBefores.evaluate(RunBefores.java:28)
	at org.junit.internal.runners.statements.RunAfters.evaluate(RunAfters.java:31)
	at org.junit.runners.BlockJUnit4ClassRunner.runChild(BlockJUnit4ClassRunner.java:76)
	at org.junit.runners.BlockJUnit4ClassRunner.runChild(BlockJUnit4ClassRunner.java:50)
	at org.junit.runners.ParentRunner$3.run(ParentRunner.java:193)
	at org.junit.runners.ParentRunner$1.schedule(ParentRunner.java:52)
	at org.junit.runners.ParentRunner.runChildren(ParentRunner.java:191)
	at org.junit.runners.ParentRunner.access$000(ParentRunner.java:42)
	at org.junit.runners.ParentRunner$2.evaluate(ParentRunner.java:184)
	at org.junit.runners.ParentRunner.run(ParentRunner.java:236)
	at org.apache.maven.surefire.junit4.JUnit4TestSet.execute(JUnit4TestSet.java:53)
	at org.apache.maven.surefire.junit4.JUnit4Provider.executeTestSet(JUnit4Provider.java:123)
	at org.apache.maven.surefire.junit4.JUnit4Provider.invoke(JUnit4Provider.java:104)
	at sun.reflect.NativeMethodAccessorImpl.invoke0(Native Method)
	at sun.reflect.NativeMethodAccessorImpl.invoke(NativeMethodAccessorImpl.java:57)
	at sun.reflect.DelegatingMethodAccessorImpl.invoke(DelegatingMethodAccessorImpl.java:43)
	at java.lang.reflect.Method.invoke(Method.java:606)
	at org.apache.maven.surefire.util.ReflectionUtils.invokeMethodWithArray(ReflectionUtils.java:164)
	at org.apache.maven.surefire.booter.ProviderFactory$ProviderProxy.invoke(ProviderFactory.java:110)
	at org.apache.maven.surefire.booter.SurefireStarter.invokeProvider(SurefireStarter.java:175)
	at org.apache.maven.surefire.booter.SurefireStarter.runSuitesInProcessWhenForked(SurefireStarter.java:107)
	at org.apache.maven.surefire.booter.ForkedBooter.main(ForkedBooter.java:68)
Caused by: org.apache.commons.configuration.ConfigurationException: Cannot locate configuration source null
	at org.apache.commons.configuration.AbstractFileConfiguration.load(AbstractFileConfiguration.java:217)
	at org.apache.commons.configuration.AbstractFileConfiguration.load(AbstractFileConfiguration.java:197)
	at org.apache.commons.configuration.AbstractFileConfiguration.<init>(AbstractFileConfiguration.java:181)
	at org.apache.commons.configuration.PropertiesConfiguration.<init>(PropertiesConfiguration.java:269)
	at org.dataone.configuration.TestSettings.loadConfigurationFile(TestSettings.java:199)
	at org.dataone.configuration.TestSettings.getConfiguration(TestSettings.java:69)
	... 38 more
20151111-05:09:28: [ERROR]: Problem loading testing configuration at: 'null':: Cannot locate configuration source null [org.dataone.configuration.TestSettings]
20151111-05:09:28: [ERROR]: General Problem loading TestSettings. InvocationTargetException: null [org.dataone.configuration.Settings]
java.lang.reflect.InvocationTargetException
	at sun.reflect.NativeMethodAccessorImpl.invoke0(Native Method)
	at sun.reflect.NativeMethodAccessorImpl.invoke(NativeMethodAccessorImpl.java:57)
	at sun.reflect.DelegatingMethodAccessorImpl.invoke(DelegatingMethodAccessorImpl.java:43)
	at java.lang.reflect.Method.invoke(Method.java:606)
	at org.dataone.configuration.Settings.loadTestConfigurations(Settings.java:151)
	at org.dataone.configuration.Settings.getConfiguration(Settings.java:87)
	at org.dataone.configuration.Settings.getResetConfiguration(Settings.java:123)
	at org.dataone.configuration.TestSettingsTest.testContextSafetyOnError(TestSettingsTest.java:211)
	at sun.reflect.NativeMethodAccessorImpl.invoke0(Native Method)
	at sun.reflect.NativeMethodAccessorImpl.invoke(NativeMethodAccessorImpl.java:57)
	at sun.reflect.DelegatingMethodAccessorImpl.invoke(DelegatingMethodAccessorImpl.java:43)
	at java.lang.reflect.Method.invoke(Method.java:606)
	at org.junit.runners.model.FrameworkMethod$1.runReflectiveCall(FrameworkMethod.java:44)
	at org.junit.internal.runners.model.ReflectiveCallable.run(ReflectiveCallable.java:15)
	at org.junit.runners.model.FrameworkMethod.invokeExplosively(FrameworkMethod.java:41)
	at org.junit.internal.runners.statements.InvokeMethod.evaluate(InvokeMethod.java:20)
	at org.junit.internal.runners.statements.RunBefores.evaluate(RunBefores.java:28)
	at org.junit.internal.runners.statements.RunAfters.evaluate(RunAfters.java:31)
	at org.junit.runners.BlockJUnit4ClassRunner.runChild(BlockJUnit4ClassRunner.java:76)
	at org.junit.runners.BlockJUnit4ClassRunner.runChild(BlockJUnit4ClassRunner.java:50)
	at org.junit.runners.ParentRunner$3.run(ParentRunner.java:193)
	at org.junit.runners.ParentRunner$1.schedule(ParentRunner.java:52)
	at org.junit.runners.ParentRunner.runChildren(ParentRunner.java:191)
	at org.junit.runners.ParentRunner.access$000(ParentRunner.java:42)
	at org.junit.runners.ParentRunner$2.evaluate(ParentRunner.java:184)
	at org.junit.runners.ParentRunner.run(ParentRunner.java:236)
	at org.apache.maven.surefire.junit4.JUnit4TestSet.execute(JUnit4TestSet.java:53)
	at org.apache.maven.surefire.junit4.JUnit4Provider.executeTestSet(JUnit4Provider.java:123)
	at org.apache.maven.surefire.junit4.JUnit4Provider.invoke(JUnit4Provider.java:104)
	at sun.reflect.NativeMethodAccessorImpl.invoke0(Native Method)
	at sun.reflect.NativeMethodAccessorImpl.invoke(NativeMethodAccessorImpl.java:57)
	at sun.reflect.DelegatingMethodAccessorImpl.invoke(DelegatingMethodAccessorImpl.java:43)
	at java.lang.reflect.Method.invoke(Method.java:606)
	at org.apache.maven.surefire.util.ReflectionUtils.invokeMethodWithArray(ReflectionUtils.java:164)
	at org.apache.maven.surefire.booter.ProviderFactory$ProviderProxy.invoke(ProviderFactory.java:110)
	at org.apache.maven.surefire.booter.SurefireStarter.invokeProvider(SurefireStarter.java:175)
	at org.apache.maven.surefire.booter.SurefireStarter.runSuitesInProcessWhenForked(SurefireStarter.java:107)
	at org.apache.maven.surefire.booter.ForkedBooter.main(ForkedBooter.java:68)
Caused by: org.apache.commons.configuration.ConfigurationException: Cannot locate configuration source null
	at org.apache.commons.configuration.AbstractFileConfiguration.load(AbstractFileConfiguration.java:217)
	at org.apache.commons.configuration.AbstractFileConfiguration.load(AbstractFileConfiguration.java:197)
	at org.apache.commons.configuration.AbstractFileConfiguration.<init>(AbstractFileConfiguration.java:181)
	at org.apache.commons.configuration.PropertiesConfiguration.<init>(PropertiesConfiguration.java:269)
	at org.dataone.configuration.TestSettings.loadConfigurationFile(TestSettings.java:199)
	at org.dataone.configuration.TestSettings.getConfiguration(TestSettings.java:69)
	... 38 more
Tests run: 11, Failures: 0, Errors: 0, Skipped: 1, Time elapsed: 0.098 sec
Running org.dataone.client.PoolingHttpClientConnectionManagerTest
Tests run: 2, Failures: 0, Errors: 0, Skipped: 1, Time elapsed: 0 sec
Running org.dataone.client.CNRestURLTest
Tests run: 9, Failures: 0, Errors: 0, Skipped: 8, Time elapsed: 0.014 sec

Results :

Tests run: 35, Failures: 0, Errors: 0, Skipped: 12

[JENKINS] Recording test results
[INFO] 
[INFO] --- maven-antrun-plugin:1.3:run (execution1) @ d1_integration ---
[INFO] Executing tasks
     [copy] Copying 236 files to /var/lib/jenkins/jobs/d1_integration_DEV2_mn_sysmeta_mutability/workspace/target/classes
     [copy] Copying 3 files to /var/lib/jenkins/jobs/d1_integration_DEV2_mn_sysmeta_mutability/workspace/target/d1_integration-2.0-SNAPSHOT/org/dataone/integration/webTest
[INFO] Executed tasks
[INFO] 
[INFO] --- maven-dependency-plugin:2.3:unpack-dependencies (jetty-classpath) @ d1_integration ---
[INFO] Unpacking /var/lib/jenkins/.m2/repository/org/eclipse/jetty/orbit/org.apache.jasper.glassfish/2.2.2.v201112011158/org.apache.jasper.glassfish-2.2.2.v201112011158.jar to /var/lib/jenkins/jobs/d1_integration_DEV2_mn_sysmeta_mutability/workspace/target/d1_integration-2.0-SNAPSHOT with includes "" and excludes ""
[INFO] Unpacking /var/lib/jenkins/.m2/repository/org/slf4j/slf4j-simple/1.6.4/slf4j-simple-1.6.4.jar to /var/lib/jenkins/jobs/d1_integration_DEV2_mn_sysmeta_mutability/workspace/target/d1_integration-2.0-SNAPSHOT with includes "" and excludes ""
[INFO] Unpacking /var/lib/jenkins/.m2/repository/org/eclipse/jetty/jetty-websocket/8.1.15.v20140411/jetty-websocket-8.1.15.v20140411.jar to /var/lib/jenkins/jobs/d1_integration_DEV2_mn_sysmeta_mutability/workspace/target/d1_integration-2.0-SNAPSHOT with includes "" and excludes ""
[INFO] Unpacking /var/lib/jenkins/.m2/repository/org/eclipse/jetty/orbit/javax.security.auth.message/1.0.0.v201108011116/javax.security.auth.message-1.0.0.v201108011116.jar to /var/lib/jenkins/jobs/d1_integration_DEV2_mn_sysmeta_mutability/workspace/target/d1_integration-2.0-SNAPSHOT with includes "" and excludes ""
[INFO] Unpacking /var/lib/jenkins/.m2/repository/org/eclipse/jetty/orbit/javax.servlet.jsp.jstl/1.2.0.v201105211821/javax.servlet.jsp.jstl-1.2.0.v201105211821.jar to /var/lib/jenkins/jobs/d1_integration_DEV2_mn_sysmeta_mutability/workspace/target/d1_integration-2.0-SNAPSHOT with includes "" and excludes ""
[INFO] Unpacking /var/lib/jenkins/.m2/repository/org/eclipse/jetty/orbit/com.sun.el/2.2.0.v201108011116/com.sun.el-2.2.0.v201108011116.jar to /var/lib/jenkins/jobs/d1_integration_DEV2_mn_sysmeta_mutability/workspace/target/d1_integration-2.0-SNAPSHOT with includes "" and excludes ""
[INFO] Unpacking /var/lib/jenkins/.m2/repository/org/eclipse/jetty/orbit/javax.mail.glassfish/1.4.1.v201005082020/javax.mail.glassfish-1.4.1.v201005082020.jar to /var/lib/jenkins/jobs/d1_integration_DEV2_mn_sysmeta_mutability/workspace/target/d1_integration-2.0-SNAPSHOT with includes "" and excludes ""
[INFO] Unpacking /var/lib/jenkins/.m2/repository/org/slf4j/slf4j-api/1.6.4/slf4j-api-1.6.4.jar to /var/lib/jenkins/jobs/d1_integration_DEV2_mn_sysmeta_mutability/workspace/target/d1_integration-2.0-SNAPSHOT with includes "" and excludes ""
[INFO] Unpacking /var/lib/jenkins/.m2/repository/org/eclipse/jetty/jetty-io/8.1.15.v20140411/jetty-io-8.1.15.v20140411.jar to /var/lib/jenkins/jobs/d1_integration_DEV2_mn_sysmeta_mutability/workspace/target/d1_integration-2.0-SNAPSHOT with includes "" and excludes ""
[INFO] Unpacking /var/lib/jenkins/.m2/repository/org/eclipse/jetty/orbit/javax.servlet.jsp/2.2.0.v201112011158/javax.servlet.jsp-2.2.0.v201112011158.jar to /var/lib/jenkins/jobs/d1_integration_DEV2_mn_sysmeta_mutability/workspace/target/d1_integration-2.0-SNAPSHOT with includes "" and excludes ""
[INFO] Unpacking /var/lib/jenkins/.m2/repository/org/eclipse/jetty/aggregate/jetty-all-server/8.1.15.v20140411/jetty-all-server-8.1.15.v20140411.jar to /var/lib/jenkins/jobs/d1_integration_DEV2_mn_sysmeta_mutability/workspace/target/d1_integration-2.0-SNAPSHOT with includes "" and excludes ""
[INFO] Unpacking /var/lib/jenkins/.m2/repository/org/eclipse/jetty/jetty-jsp/8.1.15.v20140411/jetty-jsp-8.1.15.v20140411.jar to /var/lib/jenkins/jobs/d1_integration_DEV2_mn_sysmeta_mutability/workspace/target/d1_integration-2.0-SNAPSHOT with includes "" and excludes ""
[INFO] Unpacking /var/lib/jenkins/.m2/repository/org/eclipse/jetty/orbit/org.apache.taglibs.standard.glassfish/1.2.0.v201112081803/org.apache.taglibs.standard.glassfish-1.2.0.v201112081803.jar to /var/lib/jenkins/jobs/d1_integration_DEV2_mn_sysmeta_mutability/workspace/target/d1_integration-2.0-SNAPSHOT with includes "" and excludes ""
[INFO] Unpacking /var/lib/jenkins/.m2/repository/javax/servlet/servlet-api/2.5/servlet-api-2.5.jar to /var/lib/jenkins/jobs/d1_integration_DEV2_mn_sysmeta_mutability/workspace/target/d1_integration-2.0-SNAPSHOT with includes "" and excludes ""
[INFO] Unpacking /var/lib/jenkins/.m2/repository/org/eclipse/jetty/orbit/javax.activation/1.1.0.v201105071233/javax.activation-1.1.0.v201105071233.jar to /var/lib/jenkins/jobs/d1_integration_DEV2_mn_sysmeta_mutability/workspace/target/d1_integration-2.0-SNAPSHOT with includes "" and excludes ""
[INFO] Unpacking /var/lib/jenkins/.m2/repository/org/eclipse/jetty/orbit/javax.annotation/1.1.0.v201108011116/javax.annotation-1.1.0.v201108011116.jar to /var/lib/jenkins/jobs/d1_integration_DEV2_mn_sysmeta_mutability/workspace/target/d1_integration-2.0-SNAPSHOT with includes "" and excludes ""
[INFO] Unpacking /var/lib/jenkins/.m2/repository/org/eclipse/jetty/jetty-http/8.1.15.v20140411/jetty-http-8.1.15.v20140411.jar to /var/lib/jenkins/jobs/d1_integration_DEV2_mn_sysmeta_mutability/workspace/target/d1_integration-2.0-SNAPSHOT with includes "" and excludes ""
[INFO] Unpacking /var/lib/jenkins/.m2/repository/org/eclipse/jetty/jetty-util/8.1.15.v20140411/jetty-util-8.1.15.v20140411.jar to /var/lib/jenkins/jobs/d1_integration_DEV2_mn_sysmeta_mutability/workspace/target/d1_integration-2.0-SNAPSHOT with includes "" and excludes ""
[INFO] Unpacking /var/lib/jenkins/.m2/repository/org/eclipse/jetty/orbit/org.eclipse.jdt.core/3.7.1/org.eclipse.jdt.core-3.7.1.jar to /var/lib/jenkins/jobs/d1_integration_DEV2_mn_sysmeta_mutability/workspace/target/d1_integration-2.0-SNAPSHOT with includes "" and excludes ""
[INFO] Unpacking /var/lib/jenkins/.m2/repository/org/eclipse/jetty/orbit/javax.servlet/3.0.0.v201112011016/javax.servlet-3.0.0.v201112011016.jar to /var/lib/jenkins/jobs/d1_integration_DEV2_mn_sysmeta_mutability/workspace/target/d1_integration-2.0-SNAPSHOT with includes "" and excludes ""
[INFO] Unpacking /var/lib/jenkins/.m2/repository/org/eclipse/jetty/orbit/javax.el/2.2.0.v201108011116/javax.el-2.2.0.v201108011116.jar to /var/lib/jenkins/jobs/d1_integration_DEV2_mn_sysmeta_mutability/workspace/target/d1_integration-2.0-SNAPSHOT with includes "" and excludes ""
[INFO] 
[INFO] --- maven-war-plugin:2.1.1:war (default-war) @ d1_integration ---
[INFO] Packaging webapp
[INFO] Assembling webapp [d1_integration] in [/var/lib/jenkins/jobs/d1_integration_DEV2_mn_sysmeta_mutability/workspace/target/d1_integration-2.0-SNAPSHOT]
[INFO] Processing war project
[INFO] Copying webapp resources [/var/lib/jenkins/jobs/d1_integration_DEV2_mn_sysmeta_mutability/workspace/src/main/webapp]
[INFO] Webapp assembled in [475 msecs]
[INFO] Building war: /var/lib/jenkins/jobs/d1_integration_DEV2_mn_sysmeta_mutability/workspace/target/d1_integration-2.0-SNAPSHOT.war
[INFO] WEB-INF/web.xml already added, skipping
[INFO] 
[INFO] --- maven-antrun-plugin:1.3:run (execution2) @ d1_integration ---
[INFO] Executing tasks
     [move] Moving 1 file to /var/lib/jenkins/jobs/d1_integration_DEV2_mn_sysmeta_mutability/workspace/target
[INFO] Executed tasks
[INFO] 
[INFO] --- maven-failsafe-plugin:2.8.1:integration-test (integration-test) @ d1_integration ---
[INFO] Failsafe report directory: /var/lib/jenkins/jobs/d1_integration_DEV2_mn_sysmeta_mutability/workspace/target/failsafe-reports

-------------------------------------------------------
 T E S T S
-------------------------------------------------------
Running org.dataone.integration.it.apiTests.MNSystemMetadataMutabilityIt
20151111-05:09:42: [INFO]: **************************************************** [org.dataone.integration.ContextAwareTestCaseDataone]
20151111-05:09:42: [INFO]: ***  context label:   DEV2 [org.dataone.integration.ContextAwareTestCaseDataone]
20151111-05:09:42: [INFO]: **************************************************** [org.dataone.integration.ContextAwareTestCaseDataone]
~~~ Context is from d1client.properties: https://cn-dev-2.test.dataone.org/cn
20151111-05:09:43: [INFO]: rest call info: GET https://cn-dev-2.test.dataone.org/cn/v1/node [org.dataone.client.rest.RestClient]
20151111-05:09:43: [INFO]: isNodeAlive for Node: https://cn-dev-2.test.dataone.org/cn ... [org.dataone.integration.ContextAwareTestCaseDataone]
20151111-05:09:43: [INFO]: ... calling node ... [org.dataone.integration.ContextAwareTestCaseDataone]
20151111-05:09:43: [INFO]: rest call info: GET https://cn-dev-2.test.dataone.org/cn [org.dataone.client.rest.RestClient]
20151111-05:09:43: [INFO]: ... called node [org.dataone.integration.ContextAwareTestCaseDataone]
20151111-05:09:43: [INFO]: *** Adding CN to list: cn-dev-2 [ https://cn-dev-2.test.dataone.org/cn ] [org.dataone.integration.ContextAwareTestCaseDataone]
20151111-05:09:43: [INFO]: isNodeAlive for Node: https://cn-dev-ucsb-2.test.dataone.org/cn ... [org.dataone.integration.ContextAwareTestCaseDataone]
20151111-05:09:43: [INFO]: ... calling node ... [org.dataone.integration.ContextAwareTestCaseDataone]
20151111-05:09:43: [INFO]: rest call info: GET https://cn-dev-ucsb-2.test.dataone.org/cn [org.dataone.client.rest.RestClient]
20151111-05:09:43: [INFO]: ... called node [org.dataone.integration.ContextAwareTestCaseDataone]
20151111-05:09:43: [INFO]: *** Adding CN to list: cn-dev-ucsb-2 [ https://cn-dev-ucsb-2.test.dataone.org/cn ] [org.dataone.integration.ContextAwareTestCaseDataone]
20151111-05:09:43: [INFO]: isNodeAlive for Node: https://cn-dev-unm-2.test.dataone.org/cn ... [org.dataone.integration.ContextAwareTestCaseDataone]
20151111-05:09:43: [INFO]: ... calling node ... [org.dataone.integration.ContextAwareTestCaseDataone]
20151111-05:09:44: [INFO]: rest call info: GET https://cn-dev-unm-2.test.dataone.org/cn [org.dataone.client.rest.RestClient]
20151111-05:09:44: [INFO]: ... called node [org.dataone.integration.ContextAwareTestCaseDataone]
20151111-05:09:44: [INFO]: *** Adding CN to list: cn-dev-unm-2 [ https://cn-dev-unm-2.test.dataone.org/cn ] [org.dataone.integration.ContextAwareTestCaseDataone]
20151111-05:09:44: [INFO]: isNodeAlive for Node: https://mn-dev-ucsb-1.test.dataone.org/metacat/d1/mn ... [org.dataone.integration.ContextAwareTestCaseDataone]
20151111-05:09:44: [INFO]: ... calling node ... [org.dataone.integration.ContextAwareTestCaseDataone]
20151111-05:09:44: [INFO]: rest call info: GET https://mn-dev-ucsb-1.test.dataone.org/metacat/d1/mn [org.dataone.client.rest.RestClient]
20151111-05:09:44: [INFO]: ... called node [org.dataone.integration.ContextAwareTestCaseDataone]
20151111-05:09:44: [INFO]: *** Adding MN to list: mn-dev-ucsb-1 [ https://mn-dev-ucsb-1.test.dataone.org/metacat/d1/mn ] [org.dataone.integration.ContextAwareTestCaseDataone]
20151111-05:09:44: [INFO]: isNodeAlive for Node: https://mn-dev-ucsb-2.test.dataone.org/metacat/d1/mn ... [org.dataone.integration.ContextAwareTestCaseDataone]
20151111-05:09:44: [INFO]: ... calling node ... [org.dataone.integration.ContextAwareTestCaseDataone]
20151111-05:09:44: [INFO]: rest call info: GET https://mn-dev-ucsb-2.test.dataone.org/metacat/d1/mn [org.dataone.client.rest.RestClient]
20151111-05:09:44: [INFO]: ... called node [org.dataone.integration.ContextAwareTestCaseDataone]
20151111-05:09:44: [INFO]: *** Adding MN to list: mn-dev-ucsb-2 [ https://mn-dev-ucsb-2.test.dataone.org/metacat/d1/mn ] [org.dataone.integration.ContextAwareTestCaseDataone]
20151111-05:09:44: [INFO]: isNodeAlive for Node: https://mn-dev-unm-1.test.dataone.org/metacat/d1/mn ... [org.dataone.integration.ContextAwareTestCaseDataone]
20151111-05:09:44: [INFO]: ... calling node ... [org.dataone.integration.ContextAwareTestCaseDataone]
20151111-05:09:44: [INFO]: rest call info: GET https://mn-dev-unm-1.test.dataone.org/metacat/d1/mn [org.dataone.client.rest.RestClient]
20151111-05:09:44: [INFO]: ... called node [org.dataone.integration.ContextAwareTestCaseDataone]
20151111-05:09:44: [INFO]: *** Adding MN to list: mn-dev-unm-1 [ https://mn-dev-unm-1.test.dataone.org/metacat/d1/mn ] [org.dataone.integration.ContextAwareTestCaseDataone]
20151111-05:09:44: [INFO]: isNodeAlive for Node: https://mn-dev-unm-2.test.dataone.org/metacat/d1/mn ... [org.dataone.integration.ContextAwareTestCaseDataone]
20151111-05:09:44: [INFO]: ... calling node ... [org.dataone.integration.ContextAwareTestCaseDataone]
20151111-05:09:44: [INFO]: rest call info: GET https://mn-dev-unm-2.test.dataone.org/metacat/d1/mn [org.dataone.client.rest.RestClient]
20151111-05:09:44: [INFO]: ... called node [org.dataone.integration.ContextAwareTestCaseDataone]
20151111-05:09:44: [INFO]: *** Adding MN to list: mn-dev-unm-2 [ https://mn-dev-unm-2.test.dataone.org/metacat/d1/mn ] [org.dataone.integration.ContextAwareTestCaseDataone]
20151111-05:09:44: [INFO]: trying to filter CN list for the round robin CN... original size: 3, includes nodes: [org.dataone.integration.ContextAwareTestCaseDataone]
20151111-05:09:44: [INFO]:     CN: https://cn-dev-2.test.dataone.org/cn "Development 2 Round Robin Router Node" [org.dataone.integration.ContextAwareTestCaseDataone]
20151111-05:09:44: [INFO]:     CN: https://cn-dev-ucsb-2.test.dataone.org/cn "UCSB Development 2 Protocol Coordinating Node" [org.dataone.integration.ContextAwareTestCaseDataone]
20151111-05:09:44: [INFO]:     CN: https://cn-dev-unm-2.test.dataone.org/cn "UNM Development 2 Protocol Coordinating Node" [org.dataone.integration.ContextAwareTestCaseDataone]
20151111-05:09:44: [INFO]: excluding round robin CN: https://cn-dev-2.test.dataone.org/cn "Development 2 Round Robin Router Node" [org.dataone.integration.ContextAwareTestCaseDataone]
20151111-05:09:44: [INFO]: including CN: https://cn-dev-ucsb-2.test.dataone.org/cn "UCSB Development 2 Protocol Coordinating Node" [org.dataone.integration.ContextAwareTestCaseDataone]
20151111-05:09:44: [INFO]: including CN: https://cn-dev-unm-2.test.dataone.org/cn "UNM Development 2 Protocol Coordinating Node" [org.dataone.integration.ContextAwareTestCaseDataone]
20151111-05:09:44: [INFO]: filtered CN list without round robin CN. size: 2, including nodes: [org.dataone.integration.ContextAwareTestCaseDataone]
20151111-05:09:44: [INFO]:     CN: https://cn-dev-ucsb-2.test.dataone.org/cn "UCSB Development 2 Protocol Coordinating Node" [org.dataone.integration.ContextAwareTestCaseDataone]
20151111-05:09:44: [INFO]:     CN: https://cn-dev-unm-2.test.dataone.org/cn "UNM Development 2 Protocol Coordinating Node" [org.dataone.integration.ContextAwareTestCaseDataone]
20151111-05:09:44: [INFO]: **************************************************** [org.dataone.integration.ContextAwareTestCaseDataone]
20151111-05:09:44: [INFO]: certificate directory: /etc/dataone/client/testClientCerts/ [org.dataone.integration.ContextAwareTestCaseDataone]
20151111-05:09:44: [INFO]: certificate filename: cnDevUNM2 [org.dataone.integration.ContextAwareTestCaseDataone]
20151111-05:09:44: [INFO]: client setup as Subject: CN=urn:node:cnDevUNM2,DC=dataone,DC=org [org.dataone.integration.ContextAwareTestCaseDataone]
20151111-05:09:45: [INFO]: rest call info: GET https://cn-dev-ucsb-2.test.dataone.org/cn/v2/node [org.dataone.client.rest.RestClient]
20151111-05:09:45: [INFO]: **************************************************** [org.dataone.integration.ContextAwareTestCaseDataone]
20151111-05:09:45: [INFO]: ***  context label:   DEV2 [org.dataone.integration.ContextAwareTestCaseDataone]
20151111-05:09:45: [INFO]: **************************************************** [org.dataone.integration.ContextAwareTestCaseDataone]
20151111-05:09:45: [INFO]: **************************************************** [org.dataone.integration.ContextAwareTestCaseDataone]
20151111-05:09:45: [INFO]: rest call info: GET https://cn-dev-ucsb-2.test.dataone.org/cn/v2/node [org.dataone.client.rest.RestClient]
20151111-05:09:45: [INFO]: **************************************************** [org.dataone.integration.ContextAwareTestCaseDataone]
20151111-05:09:45: [INFO]: ***  context label:   DEV2 [org.dataone.integration.ContextAwareTestCaseDataone]
20151111-05:09:45: [INFO]: **************************************************** [org.dataone.integration.ContextAwareTestCaseDataone]
20151111-05:09:45: [INFO]: **************************************************** [org.dataone.integration.ContextAwareTestCaseDataone]
20151111-05:09:45: [INFO]: rest call info: GET https://cn-dev-ucsb-2.test.dataone.org/cn/v2/node [org.dataone.client.rest.RestClient]
20151111-05:09:45: [INFO]: **************************************************** [org.dataone.integration.ContextAwareTestCaseDataone]
20151111-05:09:45: [INFO]: ***  context label:   DEV2 [org.dataone.integration.ContextAwareTestCaseDataone]
20151111-05:09:45: [INFO]: **************************************************** [org.dataone.integration.ContextAwareTestCaseDataone]
20151111-05:09:45: [INFO]: **************************************************** [org.dataone.integration.ContextAwareTestCaseDataone]
20151111-05:09:45: [INFO]: rest call info: GET https://cn-dev-ucsb-2.test.dataone.org/cn/v2/node [org.dataone.client.rest.RestClient]
Tests run: 4, Failures: 4, Errors: 0, Skipped: 0, Time elapsed: 4.116 sec <<< FAILURE!
Running org.dataone.integration.it.apiTests.MNUpdateSystemMetadataIT
20151111-05:09:45: [INFO]: **************************************************** [org.dataone.integration.ContextAwareTestCaseDataone]
20151111-05:09:45: [INFO]: ***  context label:   DEV2 [org.dataone.integration.ContextAwareTestCaseDataone]
20151111-05:09:45: [INFO]: **************************************************** [org.dataone.integration.ContextAwareTestCaseDataone]
20151111-05:09:45: [INFO]: **************************************************** [org.dataone.integration.ContextAwareTestCaseDataone]
20151111-05:09:45: [INFO]: rest call info: GET https://mn-dev-ucsb-1.test.dataone.org/metacat/d1/mn/v2/monitor/ping [org.dataone.client.rest.RestClient]
20151111-05:09:45: [INFO]: MN excluded from test: https://mn-dev-ucsb-1.test.dataone.org/metacat/d1/mn [org.dataone.integration.ContextAwareTestCaseDataone]
20151111-05:09:45: [INFO]: rest call info: GET https://mn-dev-ucsb-2.test.dataone.org/metacat/d1/mn/v2/monitor/ping [org.dataone.client.rest.RestClient]
20151111-05:09:45: [INFO]: MN included in test: https://mn-dev-ucsb-2.test.dataone.org/metacat/d1/mn [org.dataone.integration.ContextAwareTestCaseDataone]
20151111-05:09:46: [INFO]: rest call info: GET https://mn-dev-unm-1.test.dataone.org/metacat/d1/mn/v2/monitor/ping [org.dataone.client.rest.RestClient]
20151111-05:09:46: [INFO]: MN excluded from test: https://mn-dev-unm-1.test.dataone.org/metacat/d1/mn [org.dataone.integration.ContextAwareTestCaseDataone]
20151111-05:09:46: [INFO]: rest call info: GET https://mn-dev-unm-2.test.dataone.org/metacat/d1/mn/v2/monitor/ping [org.dataone.client.rest.RestClient]
20151111-05:09:46: [INFO]: MN included in test: https://mn-dev-unm-2.test.dataone.org/metacat/d1/mn [org.dataone.integration.ContextAwareTestCaseDataone]
20151111-05:09:46: [INFO]: certificate directory: /etc/dataone/client/testClientCerts/ [org.dataone.integration.ContextAwareTestCaseDataone]
20151111-05:09:46: [INFO]: certificate filename: testRightsHolder [org.dataone.integration.ContextAwareTestCaseDataone]
20151111-05:09:46: [INFO]: client setup as Subject: CN=testRightsHolder,DC=dataone,DC=org [org.dataone.integration.ContextAwareTestCaseDataone]
20151111-05:09:46: [INFO]: 
***************** running test for testUpdateSystemMetadata_RightsHolder(...) vs. node: https://mn-dev-ucsb-2.test.dataone.org/metacat/d1/mn ***************** [org.dataone.integration.ContextAwareTestCaseDataone]
20151111-05:09:46: [INFO]: certificate directory: /etc/dataone/client/testClientCerts/ [org.dataone.integration.ContextAwareTestCaseDataone]
20151111-05:09:46: [INFO]: certificate filename: cnDevUNM2 [org.dataone.integration.ContextAwareTestCaseDataone]
20151111-05:09:46: [INFO]: client setup as Subject: CN=urn:node:cnDevUNM2,DC=dataone,DC=org [org.dataone.integration.ContextAwareTestCaseDataone]
20151111-05:09:46: [INFO]: refreshing objectFormatCache from cn: null [org.dataone.client.v2.formats.ObjectFormatCache]
20151111-05:09:46: [INFO]: rest call info: GET https://cn-dev-2.test.dataone.org/cn/v2/formats [org.dataone.client.rest.RestClient]
20151111-05:09:46: [INFO]: successful cache refresh from cn.listFormats() [org.dataone.client.v2.formats.ObjectFormatCache]
20151111-05:09:46: [INFO]: creating a test object.  pid = testUpdateSystemMetadata_RightsHolder_201531421946387 on https://mn-dev-ucsb-2.test.dataone.org/metacat/d1/mn/v2 [org.dataone.integration.ContextAwareTestCaseDataone]
20151111-05:09:46: [INFO]: SystemMetadata for pid: testUpdateSystemMetadata_RightsHolder_201531421946387
<?xml version="1.0" encoding="UTF-8"?><d1_v2.0:systemMetadata xmlns:d1_v2.0="http://ns.dataone.org/service/types/v2.0" xmlns:d1="http://ns.dataone.org/service/types/v1"><serialVersion>1</serialVersion><identifier>testUpdateSystemMetadata_RightsHolder_201531421946387</identifier><formatId>eml://ecoinformatics.org/eml-2.0.1</formatId><size>17181</size><checksum algorithm="MD5">03ce09c6b4c3efc1681f3023402998a2</checksum><submitter>CN=urn:node:cnDevUNM2,DC=dataone,DC=org</submitter><rightsHolder>CN=testRightsHolder,DC=dataone,DC=org</rightsHolder><accessPolicy><allow><subject>CN=testRightsHolder,DC=dataone,DC=org</subject><permission>changePermission</permission></allow></accessPolicy><dateUploaded>2015-11-11T05:09:46.776+00:00</dateUploaded><dateSysMetadataModified>2015-11-11T05:09:46.776+00:00</dateSysMetadataModified><originMemberNode>urn:node:mnDevUCSB2</originMemberNode><authoritativeMemberNode>urn:node:mnDevUCSB2</authoritativeMemberNode></d1_v2.0:systemMetadata> [org.dataone.integration.ContextAwareTestCaseDataone]
20151111-05:09:48: [INFO]: rest call info: POST https://mn-dev-ucsb-2.test.dataone.org/metacat/d1/mn/v2/object; MMP message has: ParamPart:pid = testUpdateSystemMetadata_RightsHolder_201531421946387; FilePart:object = /tmp/mmp.output.4767465742598942521.tmp (17181 bytes); FilePart:sysmeta = /tmp/mmp.output.2370917479733305808.tmp (979 bytes);  [org.dataone.client.rest.RestClient]
20151111-05:09:48: [INFO]: object created.  pid = testUpdateSystemMetadata_RightsHolder_201531421946387 [org.dataone.integration.ContextAwareTestCaseDataone]
20151111-05:09:48: [INFO]: rest call info: GET https://mn-dev-ucsb-2.test.dataone.org/metacat/d1/mn/v2/meta/testUpdateSystemMetadata_RightsHolder_201531421946387 [org.dataone.client.rest.RestClient]
20151111-05:09:54: [INFO]: rest call info: PUT https://mn-dev-ucsb-2.test.dataone.org/metacat/d1/mn/v2/meta; MMP message has: ParamPart:pid = testUpdateSystemMetadata_RightsHolder_201531421946387; FilePart:sysmeta = /tmp/mmp.output.5167895136546677576.tmp (1003 bytes);  [org.dataone.client.rest.RestClient]
20151111-05:10:04: [INFO]: rest call info: GET https://mn-dev-ucsb-2.test.dataone.org/metacat/d1/mn/v2/meta/testUpdateSystemMetadata_RightsHolder_201531421946387 [org.dataone.client.rest.RestClient]
20151111-05:10:04: [INFO]: 
***************** running test for testUpdateSystemMetadata_RightsHolder(...) vs. node: https://mn-dev-unm-2.test.dataone.org/metacat/d1/mn ***************** [org.dataone.integration.ContextAwareTestCaseDataone]
20151111-05:10:04: [INFO]: certificate directory: /etc/dataone/client/testClientCerts/ [org.dataone.integration.ContextAwareTestCaseDataone]
20151111-05:10:04: [INFO]: certificate filename: cnDevUNM2 [org.dataone.integration.ContextAwareTestCaseDataone]
20151111-05:10:04: [INFO]: client setup as Subject: CN=urn:node:cnDevUNM2,DC=dataone,DC=org [org.dataone.integration.ContextAwareTestCaseDataone]
20151111-05:10:04: [INFO]: creating a test object.  pid = testUpdateSystemMetadata_RightsHolder_201531421104845 on https://mn-dev-unm-2.test.dataone.org/metacat/d1/mn/v2 [org.dataone.integration.ContextAwareTestCaseDataone]
20151111-05:10:04: [INFO]: SystemMetadata for pid: testUpdateSystemMetadata_RightsHolder_201531421104845
<?xml version="1.0" encoding="UTF-8"?><d1_v2.0:systemMetadata xmlns:d1_v2.0="http://ns.dataone.org/service/types/v2.0" xmlns:d1="http://ns.dataone.org/service/types/v1"><serialVersion>1</serialVersion><identifier>testUpdateSystemMetadata_RightsHolder_201531421104845</identifier><formatId>eml://ecoinformatics.org/eml-2.0.1</formatId><size>17181</size><checksum algorithm="MD5">03ce09c6b4c3efc1681f3023402998a2</checksum><submitter>CN=urn:node:cnDevUNM2,DC=dataone,DC=org</submitter><rightsHolder>CN=testRightsHolder,DC=dataone,DC=org</rightsHolder><accessPolicy><allow><subject>CN=testRightsHolder,DC=dataone,DC=org</subject><permission>changePermission</permission></allow></accessPolicy><dateUploaded>2015-11-11T05:10:04.877+00:00</dateUploaded><dateSysMetadataModified>2015-11-11T05:10:04.877+00:00</dateSysMetadataModified><originMemberNode>urn:node:mnDevUNM2</originMemberNode><authoritativeMemberNode>urn:node:mnDevUNM2</authoritativeMemberNode></d1_v2.0:systemMetadata> [org.dataone.integration.ContextAwareTestCaseDataone]
20151111-05:10:05: [INFO]: rest call info: POST https://mn-dev-unm-2.test.dataone.org/metacat/d1/mn/v2/object; MMP message has: ParamPart:pid = testUpdateSystemMetadata_RightsHolder_201531421104845; FilePart:object = /tmp/mmp.output.5636604497359351133.tmp (17181 bytes); FilePart:sysmeta = /tmp/mmp.output.4351301874899221840.tmp (977 bytes);  [org.dataone.client.rest.RestClient]
20151111-05:10:05: [INFO]: object created.  pid = testUpdateSystemMetadata_RightsHolder_201531421104845 [org.dataone.integration.ContextAwareTestCaseDataone]
20151111-05:10:06: [INFO]: rest call info: GET https://mn-dev-unm-2.test.dataone.org/metacat/d1/mn/v2/meta/testUpdateSystemMetadata_RightsHolder_201531421104845 [org.dataone.client.rest.RestClient]
20151111-05:10:11: [INFO]: rest call info: PUT https://mn-dev-unm-2.test.dataone.org/metacat/d1/mn/v2/meta; MMP message has: ParamPart:pid = testUpdateSystemMetadata_RightsHolder_201531421104845; FilePart:sysmeta = /tmp/mmp.output.6273625961699958052.tmp (1001 bytes);  [org.dataone.client.rest.RestClient]
20151111-05:10:21: [INFO]: rest call info: GET https://mn-dev-unm-2.test.dataone.org/metacat/d1/mn/v2/meta/testUpdateSystemMetadata_RightsHolder_201531421104845 [org.dataone.client.rest.RestClient]
20151111-05:10:21: [INFO]: **************************************************** [org.dataone.integration.ContextAwareTestCaseDataone]
20151111-05:10:21: [INFO]: ***  context label:   DEV2 [org.dataone.integration.ContextAwareTestCaseDataone]
20151111-05:10:21: [INFO]: **************************************************** [org.dataone.integration.ContextAwareTestCaseDataone]
20151111-05:10:21: [INFO]: **************************************************** [org.dataone.integration.ContextAwareTestCaseDataone]
20151111-05:10:21: [INFO]: rest call info: GET https://mn-dev-ucsb-1.test.dataone.org/metacat/d1/mn/v2/monitor/ping [org.dataone.client.rest.RestClient]
20151111-05:10:21: [INFO]: MN excluded from test: https://mn-dev-ucsb-1.test.dataone.org/metacat/d1/mn [org.dataone.integration.ContextAwareTestCaseDataone]
20151111-05:10:21: [INFO]: rest call info: GET https://mn-dev-ucsb-2.test.dataone.org/metacat/d1/mn/v2/monitor/ping [org.dataone.client.rest.RestClient]
20151111-05:10:21: [INFO]: MN included in test: https://mn-dev-ucsb-2.test.dataone.org/metacat/d1/mn [org.dataone.integration.ContextAwareTestCaseDataone]
20151111-05:10:21: [INFO]: rest call info: GET https://mn-dev-unm-1.test.dataone.org/metacat/d1/mn/v2/monitor/ping [org.dataone.client.rest.RestClient]
20151111-05:10:21: [INFO]: MN excluded from test: https://mn-dev-unm-1.test.dataone.org/metacat/d1/mn [org.dataone.integration.ContextAwareTestCaseDataone]
20151111-05:10:21: [INFO]: rest call info: GET https://mn-dev-unm-2.test.dataone.org/metacat/d1/mn/v2/monitor/ping [org.dataone.client.rest.RestClient]
20151111-05:10:21: [INFO]: MN included in test: https://mn-dev-unm-2.test.dataone.org/metacat/d1/mn [org.dataone.integration.ContextAwareTestCaseDataone]
20151111-05:10:21: [INFO]: 
***************** running test for testUpdateSystemMetadata_MutableRightsHolder(...) vs. node: https://mn-dev-ucsb-2.test.dataone.org/metacat/d1/mn ***************** [org.dataone.integration.ContextAwareTestCaseDataone]
20151111-05:10:21: [INFO]: certificate directory: /etc/dataone/client/testClientCerts/ [org.dataone.integration.ContextAwareTestCaseDataone]
20151111-05:10:21: [INFO]: certificate filename: cnDevUNM2 [org.dataone.integration.ContextAwareTestCaseDataone]
20151111-05:10:21: [INFO]: client setup as Subject: CN=urn:node:cnDevUNM2,DC=dataone,DC=org [org.dataone.integration.ContextAwareTestCaseDataone]
20151111-05:10:21: [INFO]: creating a test object.  pid = testUpdateSystemMetadata_MutableRightsHolder_2015314211021863 on https://mn-dev-ucsb-2.test.dataone.org/metacat/d1/mn/v2 [org.dataone.integration.ContextAwareTestCaseDataone]
20151111-05:10:21: [INFO]: SystemMetadata for pid: testUpdateSystemMetadata_MutableRightsHolder_2015314211021863
<?xml version="1.0" encoding="UTF-8"?><d1_v2.0:systemMetadata xmlns:d1_v2.0="http://ns.dataone.org/service/types/v2.0" xmlns:d1="http://ns.dataone.org/service/types/v1"><serialVersion>1</serialVersion><identifier>testUpdateSystemMetadata_MutableRightsHolder_2015314211021863</identifier><formatId>eml://ecoinformatics.org/eml-2.0.1</formatId><size>17181</size><checksum algorithm="MD5">03ce09c6b4c3efc1681f3023402998a2</checksum><submitter>CN=urn:node:cnDevUNM2,DC=dataone,DC=org</submitter><rightsHolder>CN=testRightsHolder,DC=dataone,DC=org</rightsHolder><accessPolicy><allow><subject>CN=testRightsHolder,DC=dataone,DC=org</subject><permission>changePermission</permission></allow></accessPolicy><dateUploaded>2015-11-11T05:10:21.881+00:00</dateUploaded><dateSysMetadataModified>2015-11-11T05:10:21.881+00:00</dateSysMetadataModified><originMemberNode>urn:node:mnDevUCSB2</originMemberNode><authoritativeMemberNode>urn:node:mnDevUCSB2</authoritativeMemberNode></d1_v2.0:systemMetadata> [org.dataone.integration.ContextAwareTestCaseDataone]
20151111-05:10:23: [INFO]: rest call info: POST https://mn-dev-ucsb-2.test.dataone.org/metacat/d1/mn/v2/object; MMP message has: ParamPart:pid = testUpdateSystemMetadata_MutableRightsHolder_2015314211021863; FilePart:object = /tmp/mmp.output.5225567212831282058.tmp (17181 bytes); FilePart:sysmeta = /tmp/mmp.output.2273937720188399829.tmp (987 bytes);  [org.dataone.client.rest.RestClient]
20151111-05:10:23: [INFO]: object created.  pid = testUpdateSystemMetadata_MutableRightsHolder_2015314211021863 [org.dataone.integration.ContextAwareTestCaseDataone]
20151111-05:10:23: [INFO]: rest call info: GET https://mn-dev-ucsb-2.test.dataone.org/metacat/d1/mn/v2/meta/testUpdateSystemMetadata_MutableRightsHolder_2015314211021863 [org.dataone.client.rest.RestClient]
20151111-05:10:23: [INFO]: certificate directory: /etc/dataone/client/testClientCerts/ [org.dataone.integration.ContextAwareTestCaseDataone]
20151111-05:10:23: [INFO]: certificate filename: testPerson [org.dataone.integration.ContextAwareTestCaseDataone]
20151111-05:10:23: [INFO]: client setup as Subject: CN=testPerson,DC=dataone,DC=org [org.dataone.integration.ContextAwareTestCaseDataone]
20151111-05:10:29: [INFO]: rest call info: PUT https://mn-dev-ucsb-2.test.dataone.org/metacat/d1/mn/v2/meta; MMP message has: ParamPart:pid = testUpdateSystemMetadata_MutableRightsHolder_2015314211021863; FilePart:sysmeta = /tmp/mmp.output.5881651191634501376.tmp (1005 bytes);  [org.dataone.client.rest.RestClient]
20151111-05:10:39: [INFO]: rest call info: GET https://mn-dev-ucsb-2.test.dataone.org/metacat/d1/mn/v2/meta/testUpdateSystemMetadata_MutableRightsHolder_2015314211021863 [org.dataone.client.rest.RestClient]
20151111-05:10:39: [INFO]: 
***************** running test for testUpdateSystemMetadata_MutableRightsHolder(...) vs. node: https://mn-dev-unm-2.test.dataone.org/metacat/d1/mn ***************** [org.dataone.integration.ContextAwareTestCaseDataone]
20151111-05:10:39: [INFO]: certificate directory: /etc/dataone/client/testClientCerts/ [org.dataone.integration.ContextAwareTestCaseDataone]
20151111-05:10:39: [INFO]: certificate filename: cnDevUNM2 [org.dataone.integration.ContextAwareTestCaseDataone]
20151111-05:10:39: [INFO]: client setup as Subject: CN=urn:node:cnDevUNM2,DC=dataone,DC=org [org.dataone.integration.ContextAwareTestCaseDataone]
20151111-05:10:39: [INFO]: creating a test object.  pid = testUpdateSystemMetadata_MutableRightsHolder_2015314211039713 on https://mn-dev-unm-2.test.dataone.org/metacat/d1/mn/v2 [org.dataone.integration.ContextAwareTestCaseDataone]
20151111-05:10:39: [INFO]: SystemMetadata for pid: testUpdateSystemMetadata_MutableRightsHolder_2015314211039713
<?xml version="1.0" encoding="UTF-8"?><d1_v2.0:systemMetadata xmlns:d1_v2.0="http://ns.dataone.org/service/types/v2.0" xmlns:d1="http://ns.dataone.org/service/types/v1"><serialVersion>1</serialVersion><identifier>testUpdateSystemMetadata_MutableRightsHolder_2015314211039713</identifier><formatId>eml://ecoinformatics.org/eml-2.0.1</formatId><size>17181</size><checksum algorithm="MD5">03ce09c6b4c3efc1681f3023402998a2</checksum><submitter>CN=urn:node:cnDevUNM2,DC=dataone,DC=org</submitter><rightsHolder>CN=testRightsHolder,DC=dataone,DC=org</rightsHolder><accessPolicy><allow><subject>CN=testRightsHolder,DC=dataone,DC=org</subject><permission>changePermission</permission></allow></accessPolicy><dateUploaded>2015-11-11T05:10:39.731+00:00</dateUploaded><dateSysMetadataModified>2015-11-11T05:10:39.731+00:00</dateSysMetadataModified><originMemberNode>urn:node:mnDevUNM2</originMemberNode><authoritativeMemberNode>urn:node:mnDevUNM2</authoritativeMemberNode></d1_v2.0:systemMetadata> [org.dataone.integration.ContextAwareTestCaseDataone]
20151111-05:10:40: [INFO]: rest call info: POST https://mn-dev-unm-2.test.dataone.org/metacat/d1/mn/v2/object; MMP message has: ParamPart:pid = testUpdateSystemMetadata_MutableRightsHolder_2015314211039713; FilePart:object = /tmp/mmp.output.2439530116457072308.tmp (17181 bytes); FilePart:sysmeta = /tmp/mmp.output.4244439738632593984.tmp (985 bytes);  [org.dataone.client.rest.RestClient]
20151111-05:10:40: [INFO]: object created.  pid = testUpdateSystemMetadata_MutableRightsHolder_2015314211039713 [org.dataone.integration.ContextAwareTestCaseDataone]
20151111-05:10:40: [INFO]: rest call info: GET https://mn-dev-unm-2.test.dataone.org/metacat/d1/mn/v2/meta/testUpdateSystemMetadata_MutableRightsHolder_2015314211039713 [org.dataone.client.rest.RestClient]
20151111-05:10:46: [INFO]: rest call info: PUT https://mn-dev-unm-2.test.dataone.org/metacat/d1/mn/v2/meta; MMP message has: ParamPart:pid = testUpdateSystemMetadata_MutableRightsHolder_2015314211039713; FilePart:sysmeta = /tmp/mmp.output.7408114358809524339.tmp (1003 bytes);  [org.dataone.client.rest.RestClient]
20151111-05:10:56: [INFO]: rest call info: GET https://mn-dev-unm-2.test.dataone.org/metacat/d1/mn/v2/meta/testUpdateSystemMetadata_MutableRightsHolder_2015314211039713 [org.dataone.client.rest.RestClient]
20151111-05:10:56: [INFO]: **************************************************** [org.dataone.integration.ContextAwareTestCaseDataone]
20151111-05:10:56: [INFO]: ***  context label:   DEV2 [org.dataone.integration.ContextAwareTestCaseDataone]
20151111-05:10:56: [INFO]: **************************************************** [org.dataone.integration.ContextAwareTestCaseDataone]
20151111-05:10:56: [INFO]: **************************************************** [org.dataone.integration.ContextAwareTestCaseDataone]
20151111-05:10:56: [INFO]: rest call info: GET https://mn-dev-ucsb-1.test.dataone.org/metacat/d1/mn/v2/monitor/ping [org.dataone.client.rest.RestClient]
20151111-05:10:56: [INFO]: MN excluded from test: https://mn-dev-ucsb-1.test.dataone.org/metacat/d1/mn [org.dataone.integration.ContextAwareTestCaseDataone]
20151111-05:10:56: [INFO]: rest call info: GET https://mn-dev-ucsb-2.test.dataone.org/metacat/d1/mn/v2/monitor/ping [org.dataone.client.rest.RestClient]
20151111-05:10:56: [INFO]: MN included in test: https://mn-dev-ucsb-2.test.dataone.org/metacat/d1/mn [org.dataone.integration.ContextAwareTestCaseDataone]
20151111-05:10:56: [INFO]: rest call info: GET https://mn-dev-unm-1.test.dataone.org/metacat/d1/mn/v2/monitor/ping [org.dataone.client.rest.RestClient]
20151111-05:10:56: [INFO]: MN excluded from test: https://mn-dev-unm-1.test.dataone.org/metacat/d1/mn [org.dataone.integration.ContextAwareTestCaseDataone]
20151111-05:10:56: [INFO]: rest call info: GET https://mn-dev-unm-2.test.dataone.org/metacat/d1/mn/v2/monitor/ping [org.dataone.client.rest.RestClient]
20151111-05:10:56: [INFO]: MN included in test: https://mn-dev-unm-2.test.dataone.org/metacat/d1/mn [org.dataone.integration.ContextAwareTestCaseDataone]
20151111-05:10:56: [INFO]: 
***************** running test for testUpdateSystemMetadata_MutableFormat(...) vs. node: https://mn-dev-ucsb-2.test.dataone.org/metacat/d1/mn ***************** [org.dataone.integration.ContextAwareTestCaseDataone]
20151111-05:10:56: [INFO]: certificate directory: /etc/dataone/client/testClientCerts/ [org.dataone.integration.ContextAwareTestCaseDataone]
20151111-05:10:56: [INFO]: certificate filename: cnDevUNM2 [org.dataone.integration.ContextAwareTestCaseDataone]
20151111-05:10:56: [INFO]: client setup as Subject: CN=urn:node:cnDevUNM2,DC=dataone,DC=org [org.dataone.integration.ContextAwareTestCaseDataone]
20151111-05:10:56: [INFO]: creating a test object.  pid = testUpdateSystemMetadata_MutableFormat_2015314211056556 on https://mn-dev-ucsb-2.test.dataone.org/metacat/d1/mn/v2 [org.dataone.integration.ContextAwareTestCaseDataone]
20151111-05:10:56: [INFO]: SystemMetadata for pid: testUpdateSystemMetadata_MutableFormat_2015314211056556
<?xml version="1.0" encoding="UTF-8"?><d1_v2.0:systemMetadata xmlns:d1_v2.0="http://ns.dataone.org/service/types/v2.0" xmlns:d1="http://ns.dataone.org/service/types/v1"><serialVersion>1</serialVersion><identifier>testUpdateSystemMetadata_MutableFormat_2015314211056556</identifier><formatId>eml://ecoinformatics.org/eml-2.0.1</formatId><size>17181</size><checksum algorithm="MD5">03ce09c6b4c3efc1681f3023402998a2</checksum><submitter>CN=urn:node:cnDevUNM2,DC=dataone,DC=org</submitter><rightsHolder>CN=testRightsHolder,DC=dataone,DC=org</rightsHolder><accessPolicy><allow><subject>CN=testRightsHolder,DC=dataone,DC=org</subject><permission>changePermission</permission></allow></accessPolicy><dateUploaded>2015-11-11T05:10:56.578+00:00</dateUploaded><dateSysMetadataModified>2015-11-11T05:10:56.578+00:00</dateSysMetadataModified><originMemberNode>urn:node:mnDevUCSB2</originMemberNode><authoritativeMemberNode>urn:node:mnDevUCSB2</authoritativeMemberNode></d1_v2.0:systemMetadata> [org.dataone.integration.ContextAwareTestCaseDataone]
20151111-05:10:57: [INFO]: rest call info: POST https://mn-dev-ucsb-2.test.dataone.org/metacat/d1/mn/v2/object; MMP message has: ParamPart:pid = testUpdateSystemMetadata_MutableFormat_2015314211056556; FilePart:object = /tmp/mmp.output.1429718924832923068.tmp (17181 bytes); FilePart:sysmeta = /tmp/mmp.output.2674952514295324485.tmp (981 bytes);  [org.dataone.client.rest.RestClient]
20151111-05:10:57: [INFO]: object created.  pid = testUpdateSystemMetadata_MutableFormat_2015314211056556 [org.dataone.integration.ContextAwareTestCaseDataone]
20151111-05:10:58: [INFO]: rest call info: GET https://mn-dev-ucsb-2.test.dataone.org/metacat/d1/mn/v2/meta/testUpdateSystemMetadata_MutableFormat_2015314211056556 [org.dataone.client.rest.RestClient]
20151111-05:11:03: [INFO]: rest call info: PUT https://mn-dev-ucsb-2.test.dataone.org/metacat/d1/mn/v2/meta; MMP message has: ParamPart:pid = testUpdateSystemMetadata_MutableFormat_2015314211056556; FilePart:sysmeta = /tmp/mmp.output.6106965716021286126.tmp (980 bytes);  [org.dataone.client.rest.RestClient]
20151111-05:11:14: [INFO]: rest call info: GET https://mn-dev-ucsb-2.test.dataone.org/metacat/d1/mn/v2/meta/testUpdateSystemMetadata_MutableFormat_2015314211056556 [org.dataone.client.rest.RestClient]
20151111-05:11:14: [INFO]: 
***************** running test for testUpdateSystemMetadata_MutableFormat(...) vs. node: https://mn-dev-unm-2.test.dataone.org/metacat/d1/mn ***************** [org.dataone.integration.ContextAwareTestCaseDataone]
20151111-05:11:14: [INFO]: certificate directory: /etc/dataone/client/testClientCerts/ [org.dataone.integration.ContextAwareTestCaseDataone]
20151111-05:11:14: [INFO]: certificate filename: cnDevUNM2 [org.dataone.integration.ContextAwareTestCaseDataone]
20151111-05:11:14: [INFO]: client setup as Subject: CN=urn:node:cnDevUNM2,DC=dataone,DC=org [org.dataone.integration.ContextAwareTestCaseDataone]
20151111-05:11:14: [INFO]: creating a test object.  pid = testUpdateSystemMetadata_MutableFormat_2015314211114171 on https://mn-dev-unm-2.test.dataone.org/metacat/d1/mn/v2 [org.dataone.integration.ContextAwareTestCaseDataone]
20151111-05:11:14: [INFO]: SystemMetadata for pid: testUpdateSystemMetadata_MutableFormat_2015314211114171
<?xml version="1.0" encoding="UTF-8"?><d1_v2.0:systemMetadata xmlns:d1_v2.0="http://ns.dataone.org/service/types/v2.0" xmlns:d1="http://ns.dataone.org/service/types/v1"><serialVersion>1</serialVersion><identifier>testUpdateSystemMetadata_MutableFormat_2015314211114171</identifier><formatId>eml://ecoinformatics.org/eml-2.0.1</formatId><size>17181</size><checksum algorithm="MD5">03ce09c6b4c3efc1681f3023402998a2</checksum><submitter>CN=urn:node:cnDevUNM2,DC=dataone,DC=org</submitter><rightsHolder>CN=testRightsHolder,DC=dataone,DC=org</rightsHolder><accessPolicy><allow><subject>CN=testRightsHolder,DC=dataone,DC=org</subject><permission>changePermission</permission></allow></accessPolicy><dateUploaded>2015-11-11T05:11:14.191+00:00</dateUploaded><dateSysMetadataModified>2015-11-11T05:11:14.191+00:00</dateSysMetadataModified><originMemberNode>urn:node:mnDevUNM2</originMemberNode><authoritativeMemberNode>urn:node:mnDevUNM2</authoritativeMemberNode></d1_v2.0:systemMetadata> [org.dataone.integration.ContextAwareTestCaseDataone]
20151111-05:11:15: [INFO]: rest call info: POST https://mn-dev-unm-2.test.dataone.org/metacat/d1/mn/v2/object; MMP message has: ParamPart:pid = testUpdateSystemMetadata_MutableFormat_2015314211114171; FilePart:object = /tmp/mmp.output.4645591482386653426.tmp (17181 bytes); FilePart:sysmeta = /tmp/mmp.output.4620724204698275871.tmp (979 bytes);  [org.dataone.client.rest.RestClient]
20151111-05:11:15: [INFO]: object created.  pid = testUpdateSystemMetadata_MutableFormat_2015314211114171 [org.dataone.integration.ContextAwareTestCaseDataone]
20151111-05:11:15: [INFO]: rest call info: GET https://mn-dev-unm-2.test.dataone.org/metacat/d1/mn/v2/meta/testUpdateSystemMetadata_MutableFormat_2015314211114171 [org.dataone.client.rest.RestClient]
20151111-05:11:20: [INFO]: rest call info: PUT https://mn-dev-unm-2.test.dataone.org/metacat/d1/mn/v2/meta; MMP message has: ParamPart:pid = testUpdateSystemMetadata_MutableFormat_2015314211114171; FilePart:sysmeta = /tmp/mmp.output.8175979363261757625.tmp (978 bytes);  [org.dataone.client.rest.RestClient]
20151111-05:11:30: [INFO]: rest call info: GET https://mn-dev-unm-2.test.dataone.org/metacat/d1/mn/v2/meta/testUpdateSystemMetadata_MutableFormat_2015314211114171 [org.dataone.client.rest.RestClient]
20151111-05:11:30: [INFO]: **************************************************** [org.dataone.integration.ContextAwareTestCaseDataone]
20151111-05:11:30: [INFO]: ***  context label:   DEV2 [org.dataone.integration.ContextAwareTestCaseDataone]
20151111-05:11:30: [INFO]: **************************************************** [org.dataone.integration.ContextAwareTestCaseDataone]
20151111-05:11:30: [INFO]: **************************************************** [org.dataone.integration.ContextAwareTestCaseDataone]
20151111-05:11:30: [INFO]: rest call info: GET https://mn-dev-ucsb-1.test.dataone.org/metacat/d1/mn/v2/monitor/ping [org.dataone.client.rest.RestClient]
20151111-05:11:30: [INFO]: MN excluded from test: https://mn-dev-ucsb-1.test.dataone.org/metacat/d1/mn [org.dataone.integration.ContextAwareTestCaseDataone]
20151111-05:11:30: [INFO]: rest call info: GET https://mn-dev-ucsb-2.test.dataone.org/metacat/d1/mn/v2/monitor/ping [org.dataone.client.rest.RestClient]
20151111-05:11:30: [INFO]: MN included in test: https://mn-dev-ucsb-2.test.dataone.org/metacat/d1/mn [org.dataone.integration.ContextAwareTestCaseDataone]
20151111-05:11:30: [INFO]: rest call info: GET https://mn-dev-unm-1.test.dataone.org/metacat/d1/mn/v2/monitor/ping [org.dataone.client.rest.RestClient]
20151111-05:11:30: [INFO]: MN excluded from test: https://mn-dev-unm-1.test.dataone.org/metacat/d1/mn [org.dataone.integration.ContextAwareTestCaseDataone]
20151111-05:11:30: [INFO]: rest call info: GET https://mn-dev-unm-2.test.dataone.org/metacat/d1/mn/v2/monitor/ping [org.dataone.client.rest.RestClient]
20151111-05:11:30: [INFO]: MN included in test: https://mn-dev-unm-2.test.dataone.org/metacat/d1/mn [org.dataone.integration.ContextAwareTestCaseDataone]
20151111-05:11:30: [INFO]: 
***************** running test for testUpdateSystemMetadata_MutableAccessPolicy(...) vs. node: https://mn-dev-ucsb-2.test.dataone.org/metacat/d1/mn ***************** [org.dataone.integration.ContextAwareTestCaseDataone]
20151111-05:11:30: [INFO]: certificate directory: /etc/dataone/client/testClientCerts/ [org.dataone.integration.ContextAwareTestCaseDataone]
20151111-05:11:30: [INFO]: certificate filename: cnDevUNM2 [org.dataone.integration.ContextAwareTestCaseDataone]
20151111-05:11:30: [INFO]: client setup as Subject: CN=urn:node:cnDevUNM2,DC=dataone,DC=org [org.dataone.integration.ContextAwareTestCaseDataone]
20151111-05:11:31: [INFO]: creating a test object.  pid = testUpdateSystemMetadata_MutableAccessPolicy_2015314211130987 on https://mn-dev-ucsb-2.test.dataone.org/metacat/d1/mn/v2 [org.dataone.integration.ContextAwareTestCaseDataone]
20151111-05:11:31: [INFO]: SystemMetadata for pid: testUpdateSystemMetadata_MutableAccessPolicy_2015314211130987
<?xml version="1.0" encoding="UTF-8"?><d1_v2.0:systemMetadata xmlns:d1_v2.0="http://ns.dataone.org/service/types/v2.0" xmlns:d1="http://ns.dataone.org/service/types/v1"><serialVersion>1</serialVersion><identifier>testUpdateSystemMetadata_MutableAccessPolicy_2015314211130987</identifier><formatId>eml://ecoinformatics.org/eml-2.0.1</formatId><size>17181</size><checksum algorithm="MD5">03ce09c6b4c3efc1681f3023402998a2</checksum><submitter>CN=urn:node:cnDevUNM2,DC=dataone,DC=org</submitter><rightsHolder>CN=testRightsHolder,DC=dataone,DC=org</rightsHolder><accessPolicy><allow><subject>CN=testRightsHolder,DC=dataone,DC=org</subject><permission>changePermission</permission></allow></accessPolicy><dateUploaded>2015-11-11T05:11:31.003+00:00</dateUploaded><dateSysMetadataModified>2015-11-11T05:11:31.003+00:00</dateSysMetadataModified><originMemberNode>urn:node:mnDevUCSB2</originMemberNode><authoritativeMemberNode>urn:node:mnDevUCSB2</authoritativeMemberNode></d1_v2.0:systemMetadata> [org.dataone.integration.ContextAwareTestCaseDataone]
20151111-05:11:32: [INFO]: rest call info: POST https://mn-dev-ucsb-2.test.dataone.org/metacat/d1/mn/v2/object; MMP message has: ParamPart:pid = testUpdateSystemMetadata_MutableAccessPolicy_2015314211130987; FilePart:object = /tmp/mmp.output.2014667182941628776.tmp (17181 bytes); FilePart:sysmeta = /tmp/mmp.output.6854932533503694886.tmp (987 bytes);  [org.dataone.client.rest.RestClient]
20151111-05:11:32: [INFO]: object created.  pid = testUpdateSystemMetadata_MutableAccessPolicy_2015314211130987 [org.dataone.integration.ContextAwareTestCaseDataone]
20151111-05:11:32: [INFO]: rest call info: GET https://mn-dev-ucsb-2.test.dataone.org/metacat/d1/mn/v2/meta/testUpdateSystemMetadata_MutableAccessPolicy_2015314211130987 [org.dataone.client.rest.RestClient]
20151111-05:11:32: [INFO]: certificate directory: /etc/dataone/client/testClientCerts/ [org.dataone.integration.ContextAwareTestCaseDataone]
20151111-05:11:32: [INFO]: certificate filename: testGroup [org.dataone.integration.ContextAwareTestCaseDataone]
20151111-05:11:32: [INFO]: client setup as Subject: public [org.dataone.integration.ContextAwareTestCaseDataone]
20151111-05:11:38: [INFO]: rest call info: PUT https://mn-dev-ucsb-2.test.dataone.org/metacat/d1/mn/v2/meta; MMP message has: ParamPart:pid = testUpdateSystemMetadata_MutableAccessPolicy_2015314211130987; FilePart:sysmeta = /tmp/mmp.output.5954837669483173293.tmp (980 bytes);  [org.dataone.client.rest.RestClient]
20151111-05:11:48: [INFO]: rest call info: GET https://mn-dev-ucsb-2.test.dataone.org/metacat/d1/mn/v2/meta/testUpdateSystemMetadata_MutableAccessPolicy_2015314211130987 [org.dataone.client.rest.RestClient]
20151111-05:11:48: [INFO]: 
***************** running test for testUpdateSystemMetadata_MutableAccessPolicy(...) vs. node: https://mn-dev-unm-2.test.dataone.org/metacat/d1/mn ***************** [org.dataone.integration.ContextAwareTestCaseDataone]
20151111-05:11:48: [INFO]: certificate directory: /etc/dataone/client/testClientCerts/ [org.dataone.integration.ContextAwareTestCaseDataone]
20151111-05:11:48: [INFO]: certificate filename: cnDevUNM2 [org.dataone.integration.ContextAwareTestCaseDataone]
20151111-05:11:48: [INFO]: client setup as Subject: CN=urn:node:cnDevUNM2,DC=dataone,DC=org [org.dataone.integration.ContextAwareTestCaseDataone]
20151111-05:11:48: [INFO]: creating a test object.  pid = testUpdateSystemMetadata_MutableAccessPolicy_2015314211148578 on https://mn-dev-unm-2.test.dataone.org/metacat/d1/mn/v2 [org.dataone.integration.ContextAwareTestCaseDataone]
20151111-05:11:48: [INFO]: SystemMetadata for pid: testUpdateSystemMetadata_MutableAccessPolicy_2015314211148578
<?xml version="1.0" encoding="UTF-8"?><d1_v2.0:systemMetadata xmlns:d1_v2.0="http://ns.dataone.org/service/types/v2.0" xmlns:d1="http://ns.dataone.org/service/types/v1"><serialVersion>1</serialVersion><identifier>testUpdateSystemMetadata_MutableAccessPolicy_2015314211148578</identifier><formatId>eml://ecoinformatics.org/eml-2.0.1</formatId><size>17181</size><checksum algorithm="MD5">03ce09c6b4c3efc1681f3023402998a2</checksum><submitter>CN=urn:node:cnDevUNM2,DC=dataone,DC=org</submitter><rightsHolder>CN=testRightsHolder,DC=dataone,DC=org</rightsHolder><accessPolicy><allow><subject>CN=testRightsHolder,DC=dataone,DC=org</subject><permission>changePermission</permission></allow></accessPolicy><dateUploaded>2015-11-11T05:11:48.596+00:00</dateUploaded><dateSysMetadataModified>2015-11-11T05:11:48.596+00:00</dateSysMetadataModified><originMemberNode>urn:node:mnDevUNM2</originMemberNode><authoritativeMemberNode>urn:node:mnDevUNM2</authoritativeMemberNode></d1_v2.0:systemMetadata> [org.dataone.integration.ContextAwareTestCaseDataone]
20151111-05:11:49: [INFO]: rest call info: POST https://mn-dev-unm-2.test.dataone.org/metacat/d1/mn/v2/object; MMP message has: ParamPart:pid = testUpdateSystemMetadata_MutableAccessPolicy_2015314211148578; FilePart:object = /tmp/mmp.output.414861704731221265.tmp (17181 bytes); FilePart:sysmeta = /tmp/mmp.output.5844239860238166458.tmp (985 bytes);  [org.dataone.client.rest.RestClient]
20151111-05:11:49: [INFO]: object created.  pid = testUpdateSystemMetadata_MutableAccessPolicy_2015314211148578 [org.dataone.integration.ContextAwareTestCaseDataone]
20151111-05:11:49: [INFO]: rest call info: GET https://mn-dev-unm-2.test.dataone.org/metacat/d1/mn/v2/meta/testUpdateSystemMetadata_MutableAccessPolicy_2015314211148578 [org.dataone.client.rest.RestClient]
20151111-05:11:54: [INFO]: rest call info: PUT https://mn-dev-unm-2.test.dataone.org/metacat/d1/mn/v2/meta; MMP message has: ParamPart:pid = testUpdateSystemMetadata_MutableAccessPolicy_2015314211148578; FilePart:sysmeta = /tmp/mmp.output.8735840791944854608.tmp (978 bytes);  [org.dataone.client.rest.RestClient]
20151111-05:12:05: [INFO]: rest call info: GET https://mn-dev-unm-2.test.dataone.org/metacat/d1/mn/v2/meta/testUpdateSystemMetadata_MutableAccessPolicy_2015314211148578 [org.dataone.client.rest.RestClient]
20151111-05:12:05: [INFO]: **************************************************** [org.dataone.integration.ContextAwareTestCaseDataone]
20151111-05:12:05: [INFO]: ***  context label:   DEV2 [org.dataone.integration.ContextAwareTestCaseDataone]
20151111-05:12:05: [INFO]: **************************************************** [org.dataone.integration.ContextAwareTestCaseDataone]
20151111-05:12:05: [INFO]: **************************************************** [org.dataone.integration.ContextAwareTestCaseDataone]
20151111-05:12:05: [INFO]: rest call info: GET https://mn-dev-ucsb-1.test.dataone.org/metacat/d1/mn/v2/monitor/ping [org.dataone.client.rest.RestClient]
20151111-05:12:05: [INFO]: MN excluded from test: https://mn-dev-ucsb-1.test.dataone.org/metacat/d1/mn [org.dataone.integration.ContextAwareTestCaseDataone]
20151111-05:12:05: [INFO]: rest call info: GET https://mn-dev-ucsb-2.test.dataone.org/metacat/d1/mn/v2/monitor/ping [org.dataone.client.rest.RestClient]
20151111-05:12:05: [INFO]: MN included in test: https://mn-dev-ucsb-2.test.dataone.org/metacat/d1/mn [org.dataone.integration.ContextAwareTestCaseDataone]
20151111-05:12:05: [INFO]: rest call info: GET https://mn-dev-unm-1.test.dataone.org/metacat/d1/mn/v2/monitor/ping [org.dataone.client.rest.RestClient]
20151111-05:12:05: [INFO]: MN excluded from test: https://mn-dev-unm-1.test.dataone.org/metacat/d1/mn [org.dataone.integration.ContextAwareTestCaseDataone]
20151111-05:12:05: [INFO]: rest call info: GET https://mn-dev-unm-2.test.dataone.org/metacat/d1/mn/v2/monitor/ping [org.dataone.client.rest.RestClient]
20151111-05:12:05: [INFO]: MN included in test: https://mn-dev-unm-2.test.dataone.org/metacat/d1/mn [org.dataone.integration.ContextAwareTestCaseDataone]
20151111-05:12:05: [INFO]: 
***************** running test for testUpdateSystemMetadata_MutableReplPolicy(...) vs. node: https://mn-dev-ucsb-2.test.dataone.org/metacat/d1/mn ***************** [org.dataone.integration.ContextAwareTestCaseDataone]
20151111-05:12:05: [INFO]: certificate directory: /etc/dataone/client/testClientCerts/ [org.dataone.integration.ContextAwareTestCaseDataone]
20151111-05:12:05: [INFO]: certificate filename: cnDevUNM2 [org.dataone.integration.ContextAwareTestCaseDataone]
20151111-05:12:05: [INFO]: client setup as Subject: CN=urn:node:cnDevUNM2,DC=dataone,DC=org [org.dataone.integration.ContextAwareTestCaseDataone]
20151111-05:12:05: [INFO]: creating a test object.  pid = testUpdateSystemMetadata_MutableReplPolicy_201531421125404 on https://mn-dev-ucsb-2.test.dataone.org/metacat/d1/mn/v2 [org.dataone.integration.ContextAwareTestCaseDataone]
20151111-05:12:05: [INFO]: SystemMetadata for pid: testUpdateSystemMetadata_MutableReplPolicy_201531421125404
<?xml version="1.0" encoding="UTF-8"?><d1_v2.0:systemMetadata xmlns:d1_v2.0="http://ns.dataone.org/service/types/v2.0" xmlns:d1="http://ns.dataone.org/service/types/v1"><serialVersion>1</serialVersion><identifier>testUpdateSystemMetadata_MutableReplPolicy_201531421125404</identifier><formatId>eml://ecoinformatics.org/eml-2.0.1</formatId><size>17181</size><checksum algorithm="MD5">03ce09c6b4c3efc1681f3023402998a2</checksum><submitter>CN=urn:node:cnDevUNM2,DC=dataone,DC=org</submitter><rightsHolder>CN=testRightsHolder,DC=dataone,DC=org</rightsHolder><accessPolicy><allow><subject>CN=testRightsHolder,DC=dataone,DC=org</subject><permission>changePermission</permission></allow></accessPolicy><dateUploaded>2015-11-11T05:12:05.423+00:00</dateUploaded><dateSysMetadataModified>2015-11-11T05:12:05.423+00:00</dateSysMetadataModified><originMemberNode>urn:node:mnDevUCSB2</originMemberNode><authoritativeMemberNode>urn:node:mnDevUCSB2</authoritativeMemberNode></d1_v2.0:systemMetadata> [org.dataone.integration.ContextAwareTestCaseDataone]
20151111-05:12:06: [INFO]: rest call info: POST https://mn-dev-ucsb-2.test.dataone.org/metacat/d1/mn/v2/object; MMP message has: ParamPart:pid = testUpdateSystemMetadata_MutableReplPolicy_201531421125404; FilePart:object = /tmp/mmp.output.4183623958719226121.tmp (17181 bytes); FilePart:sysmeta = /tmp/mmp.output.8157563933454871662.tmp (984 bytes);  [org.dataone.client.rest.RestClient]
20151111-05:12:06: [INFO]: object created.  pid = testUpdateSystemMetadata_MutableReplPolicy_201531421125404 [org.dataone.integration.ContextAwareTestCaseDataone]
20151111-05:12:06: [INFO]: rest call info: GET https://mn-dev-ucsb-2.test.dataone.org/metacat/d1/mn/v2/meta/testUpdateSystemMetadata_MutableReplPolicy_201531421125404 [org.dataone.client.rest.RestClient]
20151111-05:12:12: [INFO]: rest call info: PUT https://mn-dev-ucsb-2.test.dataone.org/metacat/d1/mn/v2/meta; MMP message has: ParamPart:pid = testUpdateSystemMetadata_MutableReplPolicy_201531421125404; FilePart:sysmeta = /tmp/mmp.output.281744023952442879.tmp (1075 bytes);  [org.dataone.client.rest.RestClient]
20151111-05:12:22: [INFO]: rest call info: GET https://mn-dev-ucsb-2.test.dataone.org/metacat/d1/mn/v2/meta/testUpdateSystemMetadata_MutableReplPolicy_201531421125404 [org.dataone.client.rest.RestClient]
20151111-05:12:22: [INFO]: 
***************** running test for testUpdateSystemMetadata_MutableReplPolicy(...) vs. node: https://mn-dev-unm-2.test.dataone.org/metacat/d1/mn ***************** [org.dataone.integration.ContextAwareTestCaseDataone]
20151111-05:12:22: [INFO]: certificate directory: /etc/dataone/client/testClientCerts/ [org.dataone.integration.ContextAwareTestCaseDataone]
20151111-05:12:22: [INFO]: certificate filename: cnDevUNM2 [org.dataone.integration.ContextAwareTestCaseDataone]
20151111-05:12:22: [INFO]: client setup as Subject: CN=urn:node:cnDevUNM2,DC=dataone,DC=org [org.dataone.integration.ContextAwareTestCaseDataone]
20151111-05:12:22: [INFO]: creating a test object.  pid = testUpdateSystemMetadata_MutableReplPolicy_2015314211222650 on https://mn-dev-unm-2.test.dataone.org/metacat/d1/mn/v2 [org.dataone.integration.ContextAwareTestCaseDataone]
20151111-05:12:22: [INFO]: SystemMetadata for pid: testUpdateSystemMetadata_MutableReplPolicy_2015314211222650
<?xml version="1.0" encoding="UTF-8"?><d1_v2.0:systemMetadata xmlns:d1_v2.0="http://ns.dataone.org/service/types/v2.0" xmlns:d1="http://ns.dataone.org/service/types/v1"><serialVersion>1</serialVersion><identifier>testUpdateSystemMetadata_MutableReplPolicy_2015314211222650</identifier><formatId>eml://ecoinformatics.org/eml-2.0.1</formatId><size>17181</size><checksum algorithm="MD5">03ce09c6b4c3efc1681f3023402998a2</checksum><submitter>CN=urn:node:cnDevUNM2,DC=dataone,DC=org</submitter><rightsHolder>CN=testRightsHolder,DC=dataone,DC=org</rightsHolder><accessPolicy><allow><subject>CN=testRightsHolder,DC=dataone,DC=org</subject><permission>changePermission</permission></allow></accessPolicy><dateUploaded>2015-11-11T05:12:22.667+00:00</dateUploaded><dateSysMetadataModified>2015-11-11T05:12:22.667+00:00</dateSysMetadataModified><originMemberNode>urn:node:mnDevUNM2</originMemberNode><authoritativeMemberNode>urn:node:mnDevUNM2</authoritativeMemberNode></d1_v2.0:systemMetadata> [org.dataone.integration.ContextAwareTestCaseDataone]
20151111-05:12:23: [INFO]: rest call info: POST https://mn-dev-unm-2.test.dataone.org/metacat/d1/mn/v2/object; MMP message has: ParamPart:pid = testUpdateSystemMetadata_MutableReplPolicy_2015314211222650; FilePart:object = /tmp/mmp.output.8243221878731134603.tmp (17181 bytes); FilePart:sysmeta = /tmp/mmp.output.6357854469116824320.tmp (983 bytes);  [org.dataone.client.rest.RestClient]
20151111-05:12:23: [INFO]: object created.  pid = testUpdateSystemMetadata_MutableReplPolicy_2015314211222650 [org.dataone.integration.ContextAwareTestCaseDataone]
20151111-05:12:23: [INFO]: rest call info: GET https://mn-dev-unm-2.test.dataone.org/metacat/d1/mn/v2/meta/testUpdateSystemMetadata_MutableReplPolicy_2015314211222650 [org.dataone.client.rest.RestClient]
20151111-05:12:29: [INFO]: rest call info: PUT https://mn-dev-unm-2.test.dataone.org/metacat/d1/mn/v2/meta; MMP message has: ParamPart:pid = testUpdateSystemMetadata_MutableReplPolicy_2015314211222650; FilePart:sysmeta = /tmp/mmp.output.6164604356972476461.tmp (1074 bytes);  [org.dataone.client.rest.RestClient]
20151111-05:12:39: [INFO]: rest call info: GET https://mn-dev-unm-2.test.dataone.org/metacat/d1/mn/v2/meta/testUpdateSystemMetadata_MutableReplPolicy_2015314211222650 [org.dataone.client.rest.RestClient]
20151111-05:12:39: [INFO]: **************************************************** [org.dataone.integration.ContextAwareTestCaseDataone]
20151111-05:12:39: [INFO]: ***  context label:   DEV2 [org.dataone.integration.ContextAwareTestCaseDataone]
20151111-05:12:39: [INFO]: **************************************************** [org.dataone.integration.ContextAwareTestCaseDataone]
20151111-05:12:39: [INFO]: **************************************************** [org.dataone.integration.ContextAwareTestCaseDataone]
20151111-05:12:39: [INFO]: rest call info: GET https://mn-dev-ucsb-1.test.dataone.org/metacat/d1/mn/v2/monitor/ping [org.dataone.client.rest.RestClient]
20151111-05:12:39: [INFO]: MN excluded from test: https://mn-dev-ucsb-1.test.dataone.org/metacat/d1/mn [org.dataone.integration.ContextAwareTestCaseDataone]
20151111-05:12:39: [INFO]: rest call info: GET https://mn-dev-ucsb-2.test.dataone.org/metacat/d1/mn/v2/monitor/ping [org.dataone.client.rest.RestClient]
20151111-05:12:39: [INFO]: MN included in test: https://mn-dev-ucsb-2.test.dataone.org/metacat/d1/mn [org.dataone.integration.ContextAwareTestCaseDataone]
20151111-05:12:39: [INFO]: rest call info: GET https://mn-dev-unm-1.test.dataone.org/metacat/d1/mn/v2/monitor/ping [org.dataone.client.rest.RestClient]
20151111-05:12:39: [INFO]: MN excluded from test: https://mn-dev-unm-1.test.dataone.org/metacat/d1/mn [org.dataone.integration.ContextAwareTestCaseDataone]
20151111-05:12:39: [INFO]: rest call info: GET https://mn-dev-unm-2.test.dataone.org/metacat/d1/mn/v2/monitor/ping [org.dataone.client.rest.RestClient]
20151111-05:12:39: [INFO]: MN included in test: https://mn-dev-unm-2.test.dataone.org/metacat/d1/mn [org.dataone.integration.ContextAwareTestCaseDataone]
20151111-05:12:39: [INFO]: 
***************** running test for testUpdateSystemMetadata_MutableAuthMN(...) vs. node: https://mn-dev-ucsb-2.test.dataone.org/metacat/d1/mn ***************** [org.dataone.integration.ContextAwareTestCaseDataone]
20151111-05:12:39: [INFO]: certificate directory: /etc/dataone/client/testClientCerts/ [org.dataone.integration.ContextAwareTestCaseDataone]
20151111-05:12:39: [INFO]: certificate filename: cnDevUNM2 [org.dataone.integration.ContextAwareTestCaseDataone]
20151111-05:12:39: [INFO]: client setup as Subject: CN=urn:node:cnDevUNM2,DC=dataone,DC=org [org.dataone.integration.ContextAwareTestCaseDataone]
20151111-05:12:39: [INFO]: creating a test object.  pid = testUpdateSystemMetadata_MutableAuthMN_2015314211239544 on https://mn-dev-ucsb-2.test.dataone.org/metacat/d1/mn/v2 [org.dataone.integration.ContextAwareTestCaseDataone]
20151111-05:12:39: [INFO]: SystemMetadata for pid: testUpdateSystemMetadata_MutableAuthMN_2015314211239544
<?xml version="1.0" encoding="UTF-8"?><d1_v2.0:systemMetadata xmlns:d1_v2.0="http://ns.dataone.org/service/types/v2.0" xmlns:d1="http://ns.dataone.org/service/types/v1"><serialVersion>1</serialVersion><identifier>testUpdateSystemMetadata_MutableAuthMN_2015314211239544</identifier><formatId>eml://ecoinformatics.org/eml-2.0.1</formatId><size>17181</size><checksum algorithm="MD5">03ce09c6b4c3efc1681f3023402998a2</checksum><submitter>CN=urn:node:cnDevUNM2,DC=dataone,DC=org</submitter><rightsHolder>CN=testRightsHolder,DC=dataone,DC=org</rightsHolder><accessPolicy><allow><subject>CN=testRightsHolder,DC=dataone,DC=org</subject><permission>changePermission</permission></allow></accessPolicy><dateUploaded>2015-11-11T05:12:39.560+00:00</dateUploaded><dateSysMetadataModified>2015-11-11T05:12:39.560+00:00</dateSysMetadataModified><originMemberNode>urn:node:mnDevUCSB2</originMemberNode><authoritativeMemberNode>urn:node:mnDevUCSB2</authoritativeMemberNode></d1_v2.0:systemMetadata> [org.dataone.integration.ContextAwareTestCaseDataone]
20151111-05:12:40: [INFO]: rest call info: POST https://mn-dev-ucsb-2.test.dataone.org/metacat/d1/mn/v2/object; MMP message has: ParamPart:pid = testUpdateSystemMetadata_MutableAuthMN_2015314211239544; FilePart:object = /tmp/mmp.output.8897630901987445526.tmp (17181 bytes); FilePart:sysmeta = /tmp/mmp.output.1561150423869225152.tmp (981 bytes);  [org.dataone.client.rest.RestClient]
20151111-05:12:40: [INFO]: object created.  pid = testUpdateSystemMetadata_MutableAuthMN_2015314211239544 [org.dataone.integration.ContextAwareTestCaseDataone]
20151111-05:12:41: [INFO]: rest call info: GET https://mn-dev-ucsb-2.test.dataone.org/metacat/d1/mn/v2/meta/testUpdateSystemMetadata_MutableAuthMN_2015314211239544 [org.dataone.client.rest.RestClient]
20151111-05:12:41: [INFO]: rest call info: GET https://cn-dev-ucsb-2.test.dataone.org/cn/v2/node [org.dataone.client.rest.RestClient]
20151111-05:12:41: [WARN]: MN.updateSystemMetadata() returned a ServiceFailure. [org.dataone.integration.it.ContextAwareAdapter]
20151111-05:12:41: [INFO]: 
***************** running test for testUpdateSystemMetadata_MutableAuthMN(...) vs. node: https://mn-dev-unm-2.test.dataone.org/metacat/d1/mn ***************** [org.dataone.integration.ContextAwareTestCaseDataone]
20151111-05:12:41: [INFO]: certificate directory: /etc/dataone/client/testClientCerts/ [org.dataone.integration.ContextAwareTestCaseDataone]
20151111-05:12:41: [INFO]: certificate filename: cnDevUNM2 [org.dataone.integration.ContextAwareTestCaseDataone]
20151111-05:12:41: [INFO]: client setup as Subject: CN=urn:node:cnDevUNM2,DC=dataone,DC=org [org.dataone.integration.ContextAwareTestCaseDataone]
20151111-05:12:41: [INFO]: creating a test object.  pid = testUpdateSystemMetadata_MutableAuthMN_2015314211241104 on https://mn-dev-unm-2.test.dataone.org/metacat/d1/mn/v2 [org.dataone.integration.ContextAwareTestCaseDataone]
20151111-05:12:41: [INFO]: SystemMetadata for pid: testUpdateSystemMetadata_MutableAuthMN_2015314211241104
<?xml version="1.0" encoding="UTF-8"?><d1_v2.0:systemMetadata xmlns:d1_v2.0="http://ns.dataone.org/service/types/v2.0" xmlns:d1="http://ns.dataone.org/service/types/v1"><serialVersion>1</serialVersion><identifier>testUpdateSystemMetadata_MutableAuthMN_2015314211241104</identifier><formatId>eml://ecoinformatics.org/eml-2.0.1</formatId><size>17181</size><checksum algorithm="MD5">03ce09c6b4c3efc1681f3023402998a2</checksum><submitter>CN=urn:node:cnDevUNM2,DC=dataone,DC=org</submitter><rightsHolder>CN=testRightsHolder,DC=dataone,DC=org</rightsHolder><accessPolicy><allow><subject>CN=testRightsHolder,DC=dataone,DC=org</subject><permission>changePermission</permission></allow></accessPolicy><dateUploaded>2015-11-11T05:12:41.118+00:00</dateUploaded><dateSysMetadataModified>2015-11-11T05:12:41.118+00:00</dateSysMetadataModified><originMemberNode>urn:node:mnDevUNM2</originMemberNode><authoritativeMemberNode>urn:node:mnDevUNM2</authoritativeMemberNode></d1_v2.0:systemMetadata> [org.dataone.integration.ContextAwareTestCaseDataone]
20151111-05:12:42: [INFO]: rest call info: POST https://mn-dev-unm-2.test.dataone.org/metacat/d1/mn/v2/object; MMP message has: ParamPart:pid = testUpdateSystemMetadata_MutableAuthMN_2015314211241104; FilePart:object = /tmp/mmp.output.3150373645424895732.tmp (17181 bytes); FilePart:sysmeta = /tmp/mmp.output.332125610806964078.tmp (979 bytes);  [org.dataone.client.rest.RestClient]
20151111-05:12:42: [INFO]: object created.  pid = testUpdateSystemMetadata_MutableAuthMN_2015314211241104 [org.dataone.integration.ContextAwareTestCaseDataone]
20151111-05:12:42: [INFO]: rest call info: GET https://mn-dev-unm-2.test.dataone.org/metacat/d1/mn/v2/meta/testUpdateSystemMetadata_MutableAuthMN_2015314211241104 [org.dataone.client.rest.RestClient]
20151111-05:12:42: [INFO]: rest call info: GET https://cn-dev-ucsb-2.test.dataone.org/cn/v2/node [org.dataone.client.rest.RestClient]
20151111-05:12:42: [WARN]: MN.updateSystemMetadata() returned a ServiceFailure. [org.dataone.integration.it.ContextAwareAdapter]
20151111-05:12:42: [INFO]: **************************************************** [org.dataone.integration.ContextAwareTestCaseDataone]
20151111-05:12:42: [INFO]: ***  context label:   DEV2 [org.dataone.integration.ContextAwareTestCaseDataone]
20151111-05:12:42: [INFO]: **************************************************** [org.dataone.integration.ContextAwareTestCaseDataone]
20151111-05:12:42: [INFO]: **************************************************** [org.dataone.integration.ContextAwareTestCaseDataone]
20151111-05:12:42: [INFO]: rest call info: GET https://mn-dev-ucsb-1.test.dataone.org/metacat/d1/mn/v2/monitor/ping [org.dataone.client.rest.RestClient]
20151111-05:12:42: [INFO]: MN excluded from test: https://mn-dev-ucsb-1.test.dataone.org/metacat/d1/mn [org.dataone.integration.ContextAwareTestCaseDataone]
20151111-05:12:42: [INFO]: rest call info: GET https://mn-dev-ucsb-2.test.dataone.org/metacat/d1/mn/v2/monitor/ping [org.dataone.client.rest.RestClient]
20151111-05:12:42: [INFO]: MN included in test: https://mn-dev-ucsb-2.test.dataone.org/metacat/d1/mn [org.dataone.integration.ContextAwareTestCaseDataone]
20151111-05:12:42: [INFO]: rest call info: GET https://mn-dev-unm-1.test.dataone.org/metacat/d1/mn/v2/monitor/ping [org.dataone.client.rest.RestClient]
20151111-05:12:42: [INFO]: MN excluded from test: https://mn-dev-unm-1.test.dataone.org/metacat/d1/mn [org.dataone.integration.ContextAwareTestCaseDataone]
20151111-05:12:42: [INFO]: rest call info: GET https://mn-dev-unm-2.test.dataone.org/metacat/d1/mn/v2/monitor/ping [org.dataone.client.rest.RestClient]
20151111-05:12:42: [INFO]: MN included in test: https://mn-dev-unm-2.test.dataone.org/metacat/d1/mn [org.dataone.integration.ContextAwareTestCaseDataone]
20151111-05:12:42: [INFO]: 
***************** running test for testUpdateSystemMetadata_MutableArchived(...) vs. node: https://mn-dev-ucsb-2.test.dataone.org/metacat/d1/mn ***************** [org.dataone.integration.ContextAwareTestCaseDataone]
20151111-05:12:42: [INFO]: certificate directory: /etc/dataone/client/testClientCerts/ [org.dataone.integration.ContextAwareTestCaseDataone]
20151111-05:12:42: [INFO]: certificate filename: cnDevUNM2 [org.dataone.integration.ContextAwareTestCaseDataone]
20151111-05:12:42: [INFO]: client setup as Subject: CN=urn:node:cnDevUNM2,DC=dataone,DC=org [org.dataone.integration.ContextAwareTestCaseDataone]
20151111-05:12:42: [INFO]: creating a test object.  pid = testUpdateSystemMetadata_MutableArchived_2015314211242527 on https://mn-dev-ucsb-2.test.dataone.org/metacat/d1/mn/v2 [org.dataone.integration.ContextAwareTestCaseDataone]
20151111-05:12:42: [INFO]: SystemMetadata for pid: testUpdateSystemMetadata_MutableArchived_2015314211242527
<?xml version="1.0" encoding="UTF-8"?><d1_v2.0:systemMetadata xmlns:d1_v2.0="http://ns.dataone.org/service/types/v2.0" xmlns:d1="http://ns.dataone.org/service/types/v1"><serialVersion>1</serialVersion><identifier>testUpdateSystemMetadata_MutableArchived_2015314211242527</identifier><formatId>eml://ecoinformatics.org/eml-2.0.1</formatId><size>17181</size><checksum algorithm="MD5">03ce09c6b4c3efc1681f3023402998a2</checksum><submitter>CN=urn:node:cnDevUNM2,DC=dataone,DC=org</submitter><rightsHolder>CN=testRightsHolder,DC=dataone,DC=org</rightsHolder><accessPolicy><allow><subject>CN=testRightsHolder,DC=dataone,DC=org</subject><permission>changePermission</permission></allow></accessPolicy><dateUploaded>2015-11-11T05:12:42.541+00:00</dateUploaded><dateSysMetadataModified>2015-11-11T05:12:42.541+00:00</dateSysMetadataModified><originMemberNode>urn:node:mnDevUCSB2</originMemberNode><authoritativeMemberNode>urn:node:mnDevUCSB2</authoritativeMemberNode></d1_v2.0:systemMetadata> [org.dataone.integration.ContextAwareTestCaseDataone]
20151111-05:12:43: [INFO]: rest call info: POST https://mn-dev-ucsb-2.test.dataone.org/metacat/d1/mn/v2/object; MMP message has: ParamPart:pid = testUpdateSystemMetadata_MutableArchived_2015314211242527; FilePart:object = /tmp/mmp.output.1235735418333836713.tmp (17181 bytes); FilePart:sysmeta = /tmp/mmp.output.4525434591904467582.tmp (983 bytes);  [org.dataone.client.rest.RestClient]
20151111-05:12:43: [INFO]: object created.  pid = testUpdateSystemMetadata_MutableArchived_2015314211242527 [org.dataone.integration.ContextAwareTestCaseDataone]
20151111-05:12:43: [INFO]: rest call info: GET https://mn-dev-ucsb-2.test.dataone.org/metacat/d1/mn/v2/meta/testUpdateSystemMetadata_MutableArchived_2015314211242527 [org.dataone.client.rest.RestClient]
20151111-05:12:49: [INFO]: rest call info: PUT https://mn-dev-ucsb-2.test.dataone.org/metacat/d1/mn/v2/meta; MMP message has: ParamPart:pid = testUpdateSystemMetadata_MutableArchived_2015314211242527; FilePart:sysmeta = /tmp/mmp.output.2400188018130646137.tmp (1006 bytes);  [org.dataone.client.rest.RestClient]
20151111-05:12:59: [INFO]: rest call info: GET https://mn-dev-ucsb-2.test.dataone.org/metacat/d1/mn/v2/meta/testUpdateSystemMetadata_MutableArchived_2015314211242527 [org.dataone.client.rest.RestClient]
20151111-05:12:59: [INFO]: 
***************** running test for testUpdateSystemMetadata_MutableArchived(...) vs. node: https://mn-dev-unm-2.test.dataone.org/metacat/d1/mn ***************** [org.dataone.integration.ContextAwareTestCaseDataone]
20151111-05:12:59: [INFO]: certificate directory: /etc/dataone/client/testClientCerts/ [org.dataone.integration.ContextAwareTestCaseDataone]
20151111-05:12:59: [INFO]: certificate filename: cnDevUNM2 [org.dataone.integration.ContextAwareTestCaseDataone]
20151111-05:12:59: [INFO]: client setup as Subject: CN=urn:node:cnDevUNM2,DC=dataone,DC=org [org.dataone.integration.ContextAwareTestCaseDataone]
20151111-05:12:59: [INFO]: creating a test object.  pid = testUpdateSystemMetadata_MutableArchived_2015314211259982 on https://mn-dev-unm-2.test.dataone.org/metacat/d1/mn/v2 [org.dataone.integration.ContextAwareTestCaseDataone]
20151111-05:13:00: [INFO]: SystemMetadata for pid: testUpdateSystemMetadata_MutableArchived_2015314211259982
<?xml version="1.0" encoding="UTF-8"?><d1_v2.0:systemMetadata xmlns:d1_v2.0="http://ns.dataone.org/service/types/v2.0" xmlns:d1="http://ns.dataone.org/service/types/v1"><serialVersion>1</serialVersion><identifier>testUpdateSystemMetadata_MutableArchived_2015314211259982</identifier><formatId>eml://ecoinformatics.org/eml-2.0.1</formatId><size>17181</size><checksum algorithm="MD5">03ce09c6b4c3efc1681f3023402998a2</checksum><submitter>CN=urn:node:cnDevUNM2,DC=dataone,DC=org</submitter><rightsHolder>CN=testRightsHolder,DC=dataone,DC=org</rightsHolder><accessPolicy><allow><subject>CN=testRightsHolder,DC=dataone,DC=org</subject><permission>changePermission</permission></allow></accessPolicy><dateUploaded>2015-11-11T05:12:59.997+00:00</dateUploaded><dateSysMetadataModified>2015-11-11T05:12:59.997+00:00</dateSysMetadataModified><originMemberNode>urn:node:mnDevUNM2</originMemberNode><authoritativeMemberNode>urn:node:mnDevUNM2</authoritativeMemberNode></d1_v2.0:systemMetadata> [org.dataone.integration.ContextAwareTestCaseDataone]
20151111-05:13:00: [INFO]: rest call info: POST https://mn-dev-unm-2.test.dataone.org/metacat/d1/mn/v2/object; MMP message has: ParamPart:pid = testUpdateSystemMetadata_MutableArchived_2015314211259982; FilePart:object = /tmp/mmp.output.8655195165521305190.tmp (17181 bytes); FilePart:sysmeta = /tmp/mmp.output.3375738317393632297.tmp (981 bytes);  [org.dataone.client.rest.RestClient]
20151111-05:13:00: [INFO]: object created.  pid = testUpdateSystemMetadata_MutableArchived_2015314211259982 [org.dataone.integration.ContextAwareTestCaseDataone]
20151111-05:13:01: [INFO]: rest call info: GET https://mn-dev-unm-2.test.dataone.org/metacat/d1/mn/v2/meta/testUpdateSystemMetadata_MutableArchived_2015314211259982 [org.dataone.client.rest.RestClient]
20151111-05:13:01: [INFO]: rest call info: PUT https://mn-dev-unm-2.test.dataone.org/metacat/d1/mn/v2/meta; MMP message has: ParamPart:pid = testUpdateSystemMetadata_MutableArchived_2015314211259982; FilePart:sysmeta = /tmp/mmp.output.2112829097625712358.tmp (1004 bytes);  [org.dataone.client.rest.RestClient]
20151111-05:13:01: [WARN]: MN.updateSystemMetadata() returned a ServiceFailure. [org.dataone.integration.it.ContextAwareAdapter]
20151111-05:13:01: [INFO]: **************************************************** [org.dataone.integration.ContextAwareTestCaseDataone]
20151111-05:13:01: [INFO]: ***  context label:   DEV2 [org.dataone.integration.ContextAwareTestCaseDataone]
20151111-05:13:01: [INFO]: **************************************************** [org.dataone.integration.ContextAwareTestCaseDataone]
20151111-05:13:01: [INFO]: **************************************************** [org.dataone.integration.ContextAwareTestCaseDataone]
20151111-05:13:01: [INFO]: rest call info: GET https://mn-dev-ucsb-1.test.dataone.org/metacat/d1/mn/v2/monitor/ping [org.dataone.client.rest.RestClient]
20151111-05:13:01: [INFO]: MN excluded from test: https://mn-dev-ucsb-1.test.dataone.org/metacat/d1/mn [org.dataone.integration.ContextAwareTestCaseDataone]
20151111-05:13:02: [INFO]: rest call info: GET https://mn-dev-ucsb-2.test.dataone.org/metacat/d1/mn/v2/monitor/ping [org.dataone.client.rest.RestClient]
20151111-05:13:02: [INFO]: MN included in test: https://mn-dev-ucsb-2.test.dataone.org/metacat/d1/mn [org.dataone.integration.ContextAwareTestCaseDataone]
20151111-05:13:02: [INFO]: rest call info: GET https://mn-dev-unm-1.test.dataone.org/metacat/d1/mn/v2/monitor/ping [org.dataone.client.rest.RestClient]
20151111-05:13:02: [INFO]: MN excluded from test: https://mn-dev-unm-1.test.dataone.org/metacat/d1/mn [org.dataone.integration.ContextAwareTestCaseDataone]
20151111-05:13:02: [INFO]: rest call info: GET https://mn-dev-unm-2.test.dataone.org/metacat/d1/mn/v2/monitor/ping [org.dataone.client.rest.RestClient]
20151111-05:13:02: [INFO]: MN included in test: https://mn-dev-unm-2.test.dataone.org/metacat/d1/mn [org.dataone.integration.ContextAwareTestCaseDataone]
20151111-05:13:02: [INFO]: 
***************** running test for testUpdateSystemMetadata_MutableAuthMN(...) vs. node: https://mn-dev-ucsb-2.test.dataone.org/metacat/d1/mn ***************** [org.dataone.integration.ContextAwareTestCaseDataone]
20151111-05:13:02: [INFO]: certificate directory: /etc/dataone/client/testClientCerts/ [org.dataone.integration.ContextAwareTestCaseDataone]
20151111-05:13:02: [INFO]: certificate filename: cnDevUNM2 [org.dataone.integration.ContextAwareTestCaseDataone]
20151111-05:13:02: [INFO]: client setup as Subject: CN=urn:node:cnDevUNM2,DC=dataone,DC=org [org.dataone.integration.ContextAwareTestCaseDataone]
20151111-05:13:02: [INFO]: creating a test object.  pid = testUpdateSystemMetadata_MutableAuthMN_20153142113257 on https://mn-dev-ucsb-2.test.dataone.org/metacat/d1/mn/v2 [org.dataone.integration.ContextAwareTestCaseDataone]
20151111-05:13:02: [INFO]: SystemMetadata for pid: testUpdateSystemMetadata_MutableAuthMN_20153142113257
<?xml version="1.0" encoding="UTF-8"?><d1_v2.0:systemMetadata xmlns:d1_v2.0="http://ns.dataone.org/service/types/v2.0" xmlns:d1="http://ns.dataone.org/service/types/v1"><serialVersion>1</serialVersion><identifier>testUpdateSystemMetadata_MutableAuthMN_20153142113257</identifier><formatId>eml://ecoinformatics.org/eml-2.0.1</formatId><size>17181</size><checksum algorithm="MD5">03ce09c6b4c3efc1681f3023402998a2</checksum><submitter>CN=urn:node:cnDevUNM2,DC=dataone,DC=org</submitter><rightsHolder>CN=testRightsHolder,DC=dataone,DC=org</rightsHolder><accessPolicy><allow><subject>CN=testRightsHolder,DC=dataone,DC=org</subject><permission>changePermission</permission></allow></accessPolicy><dateUploaded>2015-11-11T05:13:02.071+00:00</dateUploaded><dateSysMetadataModified>2015-11-11T05:13:02.071+00:00</dateSysMetadataModified><originMemberNode>urn:node:mnDevUCSB2</originMemberNode><authoritativeMemberNode>urn:node:mnDevUCSB2</authoritativeMemberNode></d1_v2.0:systemMetadata> [org.dataone.integration.ContextAwareTestCaseDataone]
20151111-05:13:03: [INFO]: rest call info: POST https://mn-dev-ucsb-2.test.dataone.org/metacat/d1/mn/v2/object; MMP message has: ParamPart:pid = testUpdateSystemMetadata_MutableAuthMN_20153142113257; FilePart:object = /tmp/mmp.output.2184651612729702153.tmp (17181 bytes); FilePart:sysmeta = /tmp/mmp.output.4368264018347910363.tmp (979 bytes);  [org.dataone.client.rest.RestClient]
20151111-05:13:03: [INFO]: object created.  pid = testUpdateSystemMetadata_MutableAuthMN_20153142113257 [org.dataone.integration.ContextAwareTestCaseDataone]
20151111-05:13:03: [INFO]: rest call info: GET https://mn-dev-ucsb-2.test.dataone.org/metacat/d1/mn/v2/meta/testUpdateSystemMetadata_MutableAuthMN_20153142113257 [org.dataone.client.rest.RestClient]
20151111-05:13:03: [INFO]: rest call info: GET https://cn-dev-ucsb-2.test.dataone.org/cn/v2/node [org.dataone.client.rest.RestClient]
20151111-05:13:03: [WARN]: MN.updateSystemMetadata() returned a ServiceFailure, was expecting an InvalidRequest or NotAuthorized. [org.dataone.integration.it.ContextAwareAdapter]
20151111-05:13:03: [INFO]: 
***************** running test for testUpdateSystemMetadata_MutableAuthMN(...) vs. node: https://mn-dev-unm-2.test.dataone.org/metacat/d1/mn ***************** [org.dataone.integration.ContextAwareTestCaseDataone]
20151111-05:13:03: [INFO]: certificate directory: /etc/dataone/client/testClientCerts/ [org.dataone.integration.ContextAwareTestCaseDataone]
20151111-05:13:03: [INFO]: certificate filename: cnDevUNM2 [org.dataone.integration.ContextAwareTestCaseDataone]
20151111-05:13:03: [INFO]: client setup as Subject: CN=urn:node:cnDevUNM2,DC=dataone,DC=org [org.dataone.integration.ContextAwareTestCaseDataone]
20151111-05:13:03: [INFO]: creating a test object.  pid = testUpdateSystemMetadata_MutableAuthMN_201531421133731 on https://mn-dev-unm-2.test.dataone.org/metacat/d1/mn/v2 [org.dataone.integration.ContextAwareTestCaseDataone]
20151111-05:13:03: [INFO]: SystemMetadata for pid: testUpdateSystemMetadata_MutableAuthMN_201531421133731
<?xml version="1.0" encoding="UTF-8"?><d1_v2.0:systemMetadata xmlns:d1_v2.0="http://ns.dataone.org/service/types/v2.0" xmlns:d1="http://ns.dataone.org/service/types/v1"><serialVersion>1</serialVersion><identifier>testUpdateSystemMetadata_MutableAuthMN_201531421133731</identifier><formatId>eml://ecoinformatics.org/eml-2.0.1</formatId><size>17181</size><checksum algorithm="MD5">03ce09c6b4c3efc1681f3023402998a2</checksum><submitter>CN=urn:node:cnDevUNM2,DC=dataone,DC=org</submitter><rightsHolder>CN=testRightsHolder,DC=dataone,DC=org</rightsHolder><accessPolicy><allow><subject>CN=testRightsHolder,DC=dataone,DC=org</subject><permission>changePermission</permission></allow></accessPolicy><dateUploaded>2015-11-11T05:13:03.744+00:00</dateUploaded><dateSysMetadataModified>2015-11-11T05:13:03.744+00:00</dateSysMetadataModified><originMemberNode>urn:node:mnDevUNM2</originMemberNode><authoritativeMemberNode>urn:node:mnDevUNM2</authoritativeMemberNode></d1_v2.0:systemMetadata> [org.dataone.integration.ContextAwareTestCaseDataone]
20151111-05:13:04: [INFO]: rest call info: POST https://mn-dev-unm-2.test.dataone.org/metacat/d1/mn/v2/object; MMP message has: ParamPart:pid = testUpdateSystemMetadata_MutableAuthMN_201531421133731; FilePart:object = /tmp/mmp.output.734675874537849297.tmp (17181 bytes); FilePart:sysmeta = /tmp/mmp.output.559080831827018259.tmp (978 bytes);  [org.dataone.client.rest.RestClient]
20151111-05:13:04: [INFO]: object created.  pid = testUpdateSystemMetadata_MutableAuthMN_201531421133731 [org.dataone.integration.ContextAwareTestCaseDataone]
20151111-05:13:04: [INFO]: rest call info: GET https://mn-dev-unm-2.test.dataone.org/metacat/d1/mn/v2/meta/testUpdateSystemMetadata_MutableAuthMN_201531421133731 [org.dataone.client.rest.RestClient]
20151111-05:13:04: [INFO]: rest call info: GET https://cn-dev-ucsb-2.test.dataone.org/cn/v2/node [org.dataone.client.rest.RestClient]
20151111-05:13:04: [WARN]: MN.updateSystemMetadata() returned a ServiceFailure, was expecting an InvalidRequest or NotAuthorized. [org.dataone.integration.it.ContextAwareAdapter]
20151111-05:13:04: [INFO]: **************************************************** [org.dataone.integration.ContextAwareTestCaseDataone]
20151111-05:13:04: [INFO]: ***  context label:   DEV2 [org.dataone.integration.ContextAwareTestCaseDataone]
20151111-05:13:04: [INFO]: **************************************************** [org.dataone.integration.ContextAwareTestCaseDataone]
20151111-05:13:04: [INFO]: **************************************************** [org.dataone.integration.ContextAwareTestCaseDataone]
20151111-05:13:05: [INFO]: rest call info: GET https://mn-dev-ucsb-1.test.dataone.org/metacat/d1/mn/v2/monitor/ping [org.dataone.client.rest.RestClient]
20151111-05:13:05: [INFO]: MN excluded from test: https://mn-dev-ucsb-1.test.dataone.org/metacat/d1/mn [org.dataone.integration.ContextAwareTestCaseDataone]
20151111-05:13:05: [INFO]: rest call info: GET https://mn-dev-ucsb-2.test.dataone.org/metacat/d1/mn/v2/monitor/ping [org.dataone.client.rest.RestClient]
20151111-05:13:05: [INFO]: MN included in test: https://mn-dev-ucsb-2.test.dataone.org/metacat/d1/mn [org.dataone.integration.ContextAwareTestCaseDataone]
20151111-05:13:05: [INFO]: rest call info: GET https://mn-dev-unm-1.test.dataone.org/metacat/d1/mn/v2/monitor/ping [org.dataone.client.rest.RestClient]
20151111-05:13:05: [INFO]: MN excluded from test: https://mn-dev-unm-1.test.dataone.org/metacat/d1/mn [org.dataone.integration.ContextAwareTestCaseDataone]
20151111-05:13:05: [INFO]: rest call info: GET https://mn-dev-unm-2.test.dataone.org/metacat/d1/mn/v2/monitor/ping [org.dataone.client.rest.RestClient]
20151111-05:13:05: [INFO]: MN included in test: https://mn-dev-unm-2.test.dataone.org/metacat/d1/mn [org.dataone.integration.ContextAwareTestCaseDataone]
20151111-05:13:05: [INFO]: 
***************** running test for testUpdateSystemMetadata_ObsoletesFail(...) vs. node: https://mn-dev-ucsb-2.test.dataone.org/metacat/d1/mn ***************** [org.dataone.integration.ContextAwareTestCaseDataone]
20151111-05:13:05: [INFO]: certificate directory: /etc/dataone/client/testClientCerts/ [org.dataone.integration.ContextAwareTestCaseDataone]
20151111-05:13:05: [INFO]: certificate filename: cnDevUNM2 [org.dataone.integration.ContextAwareTestCaseDataone]
20151111-05:13:05: [INFO]: client setup as Subject: CN=urn:node:cnDevUNM2,DC=dataone,DC=org [org.dataone.integration.ContextAwareTestCaseDataone]
20151111-05:13:05: [INFO]: creating a test object.  pid = testUpdateSystemMetadata_ObsoletesFail_201531421135158 on https://mn-dev-ucsb-2.test.dataone.org/metacat/d1/mn/v2 [org.dataone.integration.ContextAwareTestCaseDataone]
20151111-05:13:05: [INFO]: SystemMetadata for pid: testUpdateSystemMetadata_ObsoletesFail_201531421135158
<?xml version="1.0" encoding="UTF-8"?><d1_v2.0:systemMetadata xmlns:d1_v2.0="http://ns.dataone.org/service/types/v2.0" xmlns:d1="http://ns.dataone.org/service/types/v1"><serialVersion>1</serialVersion><identifier>testUpdateSystemMetadata_ObsoletesFail_201531421135158</identifier><formatId>eml://ecoinformatics.org/eml-2.0.1</formatId><size>17181</size><checksum algorithm="MD5">03ce09c6b4c3efc1681f3023402998a2</checksum><submitter>CN=urn:node:cnDevUNM2,DC=dataone,DC=org</submitter><rightsHolder>CN=testRightsHolder,DC=dataone,DC=org</rightsHolder><accessPolicy><allow><subject>CN=testRightsHolder,DC=dataone,DC=org</subject><permission>changePermission</permission></allow></accessPolicy><dateUploaded>2015-11-11T05:13:05.176+00:00</dateUploaded><dateSysMetadataModified>2015-11-11T05:13:05.176+00:00</dateSysMetadataModified><originMemberNode>urn:node:mnDevUCSB2</originMemberNode><authoritativeMemberNode>urn:node:mnDevUCSB2</authoritativeMemberNode></d1_v2.0:systemMetadata> [org.dataone.integration.ContextAwareTestCaseDataone]
20151111-05:13:06: [INFO]: rest call info: POST https://mn-dev-ucsb-2.test.dataone.org/metacat/d1/mn/v2/object; MMP message has: ParamPart:pid = testUpdateSystemMetadata_ObsoletesFail_201531421135158; FilePart:object = /tmp/mmp.output.5660278760765559239.tmp (17181 bytes); FilePart:sysmeta = /tmp/mmp.output.7529159485569843744.tmp (980 bytes);  [org.dataone.client.rest.RestClient]
20151111-05:13:06: [INFO]: object created.  pid = testUpdateSystemMetadata_ObsoletesFail_201531421135158 [org.dataone.integration.ContextAwareTestCaseDataone]
20151111-05:13:17: [INFO]: rest call info: PUT https://mn-dev-ucsb-2.test.dataone.org/metacat/d1/mn/v2/object/testUpdateSystemMetadata_ObsoletesFail_201531421135158; MMP message has: ParamPart:newPid = testUpdateSystemMetadata_ObsoletesFail_201531421135160; FilePart:object = /tmp/mmp.output.1170786081932547659.tmp (17181 bytes); FilePart:sysmeta = /tmp/mmp.output.1539066306689322940.tmp (780 bytes);  [org.dataone.client.rest.RestClient]
20151111-05:13:17: [INFO]: certificate directory: /etc/dataone/client/testClientCerts/ [org.dataone.integration.ContextAwareTestCaseDataone]
20151111-05:13:17: [INFO]: certificate filename: cnDevUNM2 [org.dataone.integration.ContextAwareTestCaseDataone]
20151111-05:13:17: [INFO]: client setup as Subject: CN=urn:node:cnDevUNM2,DC=dataone,DC=org [org.dataone.integration.ContextAwareTestCaseDataone]
20151111-05:13:17: [INFO]: creating a test object.  pid = testUpdateSystemMetadata_ObsoletesFail_201531421135161 on https://mn-dev-ucsb-2.test.dataone.org/metacat/d1/mn/v2 [org.dataone.integration.ContextAwareTestCaseDataone]
20151111-05:13:17: [INFO]: SystemMetadata for pid: testUpdateSystemMetadata_ObsoletesFail_201531421135161
<?xml version="1.0" encoding="UTF-8"?><d1_v2.0:systemMetadata xmlns:d1_v2.0="http://ns.dataone.org/service/types/v2.0" xmlns:d1="http://ns.dataone.org/service/types/v1"><serialVersion>1</serialVersion><identifier>testUpdateSystemMetadata_ObsoletesFail_201531421135161</identifier><formatId>eml://ecoinformatics.org/eml-2.0.1</formatId><size>17181</size><checksum algorithm="MD5">03ce09c6b4c3efc1681f3023402998a2</checksum><submitter>CN=urn:node:cnDevUNM2,DC=dataone,DC=org</submitter><rightsHolder>CN=testRightsHolder,DC=dataone,DC=org</rightsHolder><accessPolicy><allow><subject>CN=testRightsHolder,DC=dataone,DC=org</subject><permission>changePermission</permission></allow></accessPolicy><dateUploaded>2015-11-11T05:13:17.661+00:00</dateUploaded><dateSysMetadataModified>2015-11-11T05:13:17.661+00:00</dateSysMetadataModified><originMemberNode>urn:node:mnDevUCSB2</originMemberNode><authoritativeMemberNode>urn:node:mnDevUCSB2</authoritativeMemberNode></d1_v2.0:systemMetadata> [org.dataone.integration.ContextAwareTestCaseDataone]
20151111-05:13:18: [INFO]: rest call info: POST https://mn-dev-ucsb-2.test.dataone.org/metacat/d1/mn/v2/object; MMP message has: ParamPart:pid = testUpdateSystemMetadata_ObsoletesFail_201531421135161; FilePart:object = /tmp/mmp.output.6416602798352367200.tmp (17181 bytes); FilePart:sysmeta = /tmp/mmp.output.4950648009052327908.tmp (980 bytes);  [org.dataone.client.rest.RestClient]
20151111-05:13:18: [INFO]: object created.  pid = testUpdateSystemMetadata_ObsoletesFail_201531421135161 [org.dataone.integration.ContextAwareTestCaseDataone]
20151111-05:13:29: [INFO]: rest call info: GET https://mn-dev-ucsb-2.test.dataone.org/metacat/d1/mn/v2/meta/testUpdateSystemMetadata_ObsoletesFail_201531421135160 [org.dataone.client.rest.RestClient]
20151111-05:13:29: [INFO]: rest call info: PUT https://mn-dev-ucsb-2.test.dataone.org/metacat/d1/mn/v2/meta; MMP message has: ParamPart:pid = testUpdateSystemMetadata_ObsoletesFail_201531421135160; FilePart:sysmeta = /tmp/mmp.output.995050055092965405.tmp (914 bytes);  [org.dataone.client.rest.RestClient]
20151111-05:13:29: [INFO]: 
***************** running test for testUpdateSystemMetadata_ObsoletesFail(...) vs. node: https://mn-dev-unm-2.test.dataone.org/metacat/d1/mn ***************** [org.dataone.integration.ContextAwareTestCaseDataone]
20151111-05:13:29: [INFO]: certificate directory: /etc/dataone/client/testClientCerts/ [org.dataone.integration.ContextAwareTestCaseDataone]
20151111-05:13:29: [INFO]: certificate filename: cnDevUNM2 [org.dataone.integration.ContextAwareTestCaseDataone]
20151111-05:13:29: [INFO]: client setup as Subject: CN=urn:node:cnDevUNM2,DC=dataone,DC=org [org.dataone.integration.ContextAwareTestCaseDataone]
20151111-05:13:29: [INFO]: creating a test object.  pid = testUpdateSystemMetadata_ObsoletesFail_2015314211329474 on https://mn-dev-unm-2.test.dataone.org/metacat/d1/mn/v2 [org.dataone.integration.ContextAwareTestCaseDataone]
20151111-05:13:29: [INFO]: SystemMetadata for pid: testUpdateSystemMetadata_ObsoletesFail_2015314211329474
<?xml version="1.0" encoding="UTF-8"?><d1_v2.0:systemMetadata xmlns:d1_v2.0="http://ns.dataone.org/service/types/v2.0" xmlns:d1="http://ns.dataone.org/service/types/v1"><serialVersion>1</serialVersion><identifier>testUpdateSystemMetadata_ObsoletesFail_2015314211329474</identifier><formatId>eml://ecoinformatics.org/eml-2.0.1</formatId><size>17181</size><checksum algorithm="MD5">03ce09c6b4c3efc1681f3023402998a2</checksum><submitter>CN=urn:node:cnDevUNM2,DC=dataone,DC=org</submitter><rightsHolder>CN=testRightsHolder,DC=dataone,DC=org</rightsHolder><accessPolicy><allow><subject>CN=testRightsHolder,DC=dataone,DC=org</subject><permission>changePermission</permission></allow></accessPolicy><dateUploaded>2015-11-11T05:13:29.491+00:00</dateUploaded><dateSysMetadataModified>2015-11-11T05:13:29.491+00:00</dateSysMetadataModified><originMemberNode>urn:node:mnDevUNM2</originMemberNode><authoritativeMemberNode>urn:node:mnDevUNM2</authoritativeMemberNode></d1_v2.0:systemMetadata> [org.dataone.integration.ContextAwareTestCaseDataone]
20151111-05:13:30: [INFO]: rest call info: POST https://mn-dev-unm-2.test.dataone.org/metacat/d1/mn/v2/object; MMP message has: ParamPart:pid = testUpdateSystemMetadata_ObsoletesFail_2015314211329474; FilePart:object = /tmp/mmp.output.5672946838509224517.tmp (17181 bytes); FilePart:sysmeta = /tmp/mmp.output.7473763821756074266.tmp (979 bytes);  [org.dataone.client.rest.RestClient]
20151111-05:13:30: [INFO]: object created.  pid = testUpdateSystemMetadata_ObsoletesFail_2015314211329474 [org.dataone.integration.ContextAwareTestCaseDataone]
20151111-05:13:41: [INFO]: rest call info: PUT https://mn-dev-unm-2.test.dataone.org/metacat/d1/mn/v2/object/testUpdateSystemMetadata_ObsoletesFail_2015314211329474; MMP message has: ParamPart:newPid = testUpdateSystemMetadata_ObsoletesFail_2015314211329475; FilePart:object = /tmp/mmp.output.7716282469510038070.tmp (17181 bytes); FilePart:sysmeta = /tmp/mmp.output.4440787208986519714.tmp (780 bytes);  [org.dataone.client.rest.RestClient]
20151111-05:13:41: [INFO]: certificate directory: /etc/dataone/client/testClientCerts/ [org.dataone.integration.ContextAwareTestCaseDataone]
20151111-05:13:41: [INFO]: certificate filename: cnDevUNM2 [org.dataone.integration.ContextAwareTestCaseDataone]
20151111-05:13:41: [INFO]: client setup as Subject: CN=urn:node:cnDevUNM2,DC=dataone,DC=org [org.dataone.integration.ContextAwareTestCaseDataone]
20151111-05:13:41: [INFO]: creating a test object.  pid = testUpdateSystemMetadata_ObsoletesFail_2015314211329477 on https://mn-dev-unm-2.test.dataone.org/metacat/d1/mn/v2 [org.dataone.integration.ContextAwareTestCaseDataone]
20151111-05:13:41: [INFO]: SystemMetadata for pid: testUpdateSystemMetadata_ObsoletesFail_2015314211329477
<?xml version="1.0" encoding="UTF-8"?><d1_v2.0:systemMetadata xmlns:d1_v2.0="http://ns.dataone.org/service/types/v2.0" xmlns:d1="http://ns.dataone.org/service/types/v1"><serialVersion>1</serialVersion><identifier>testUpdateSystemMetadata_ObsoletesFail_2015314211329477</identifier><formatId>eml://ecoinformatics.org/eml-2.0.1</formatId><size>17181</size><checksum algorithm="MD5">03ce09c6b4c3efc1681f3023402998a2</checksum><submitter>CN=urn:node:cnDevUNM2,DC=dataone,DC=org</submitter><rightsHolder>CN=testRightsHolder,DC=dataone,DC=org</rightsHolder><accessPolicy><allow><subject>CN=testRightsHolder,DC=dataone,DC=org</subject><permission>changePermission</permission></allow></accessPolicy><dateUploaded>2015-11-11T05:13:41.653+00:00</dateUploaded><dateSysMetadataModified>2015-11-11T05:13:41.653+00:00</dateSysMetadataModified><originMemberNode>urn:node:mnDevUNM2</originMemberNode><authoritativeMemberNode>urn:node:mnDevUNM2</authoritativeMemberNode></d1_v2.0:systemMetadata> [org.dataone.integration.ContextAwareTestCaseDataone]
20151111-05:13:42: [INFO]: rest call info: POST https://mn-dev-unm-2.test.dataone.org/metacat/d1/mn/v2/object; MMP message has: ParamPart:pid = testUpdateSystemMetadata_ObsoletesFail_2015314211329477; FilePart:object = /tmp/mmp.output.6547037068777617750.tmp (17181 bytes); FilePart:sysmeta = /tmp/mmp.output.377248993277627555.tmp (979 bytes);  [org.dataone.client.rest.RestClient]
20151111-05:13:42: [INFO]: object created.  pid = testUpdateSystemMetadata_ObsoletesFail_2015314211329477 [org.dataone.integration.ContextAwareTestCaseDataone]
20151111-05:13:52: [INFO]: rest call info: GET https://mn-dev-unm-2.test.dataone.org/metacat/d1/mn/v2/meta/testUpdateSystemMetadata_ObsoletesFail_2015314211329475 [org.dataone.client.rest.RestClient]
20151111-05:13:52: [INFO]: rest call info: PUT https://mn-dev-unm-2.test.dataone.org/metacat/d1/mn/v2/meta; MMP message has: ParamPart:pid = testUpdateSystemMetadata_ObsoletesFail_2015314211329475; FilePart:sysmeta = /tmp/mmp.output.8493243928302695175.tmp (914 bytes);  [org.dataone.client.rest.RestClient]
20151111-05:13:52: [INFO]: **************************************************** [org.dataone.integration.ContextAwareTestCaseDataone]
20151111-05:13:52: [INFO]: ***  context label:   DEV2 [org.dataone.integration.ContextAwareTestCaseDataone]
20151111-05:13:52: [INFO]: **************************************************** [org.dataone.integration.ContextAwareTestCaseDataone]
20151111-05:13:52: [INFO]: **************************************************** [org.dataone.integration.ContextAwareTestCaseDataone]
20151111-05:13:53: [INFO]: rest call info: GET https://mn-dev-ucsb-1.test.dataone.org/metacat/d1/mn/v2/monitor/ping [org.dataone.client.rest.RestClient]
20151111-05:13:53: [INFO]: MN excluded from test: https://mn-dev-ucsb-1.test.dataone.org/metacat/d1/mn [org.dataone.integration.ContextAwareTestCaseDataone]
20151111-05:13:53: [INFO]: rest call info: GET https://mn-dev-ucsb-2.test.dataone.org/metacat/d1/mn/v2/monitor/ping [org.dataone.client.rest.RestClient]
20151111-05:13:53: [INFO]: MN included in test: https://mn-dev-ucsb-2.test.dataone.org/metacat/d1/mn [org.dataone.integration.ContextAwareTestCaseDataone]
20151111-05:13:53: [INFO]: rest call info: GET https://mn-dev-unm-1.test.dataone.org/metacat/d1/mn/v2/monitor/ping [org.dataone.client.rest.RestClient]
20151111-05:13:53: [INFO]: MN excluded from test: https://mn-dev-unm-1.test.dataone.org/metacat/d1/mn [org.dataone.integration.ContextAwareTestCaseDataone]
20151111-05:13:53: [INFO]: rest call info: GET https://mn-dev-unm-2.test.dataone.org/metacat/d1/mn/v2/monitor/ping [org.dataone.client.rest.RestClient]
20151111-05:13:53: [INFO]: MN included in test: https://mn-dev-unm-2.test.dataone.org/metacat/d1/mn [org.dataone.integration.ContextAwareTestCaseDataone]
20151111-05:13:53: [INFO]: 
***************** running test for testUpdateSystemMetadata_ObsoletedByFail(...) vs. node: https://mn-dev-ucsb-2.test.dataone.org/metacat/d1/mn ***************** [org.dataone.integration.ContextAwareTestCaseDataone]
20151111-05:13:53: [INFO]: certificate directory: /etc/dataone/client/testClientCerts/ [org.dataone.integration.ContextAwareTestCaseDataone]
20151111-05:13:53: [INFO]: certificate filename: cnDevUNM2 [org.dataone.integration.ContextAwareTestCaseDataone]
20151111-05:13:53: [INFO]: client setup as Subject: CN=urn:node:cnDevUNM2,DC=dataone,DC=org [org.dataone.integration.ContextAwareTestCaseDataone]
20151111-05:13:53: [INFO]: creating a test object.  pid = testUpdateSystemMetadata_ObsoletedByFail_2015314211353182 on https://mn-dev-ucsb-2.test.dataone.org/metacat/d1/mn/v2 [org.dataone.integration.ContextAwareTestCaseDataone]
20151111-05:13:53: [INFO]: SystemMetadata for pid: testUpdateSystemMetadata_ObsoletedByFail_2015314211353182
<?xml version="1.0" encoding="UTF-8"?><d1_v2.0:systemMetadata xmlns:d1_v2.0="http://ns.dataone.org/service/types/v2.0" xmlns:d1="http://ns.dataone.org/service/types/v1"><serialVersion>1</serialVersion><identifier>testUpdateSystemMetadata_ObsoletedByFail_2015314211353182</identifier><formatId>eml://ecoinformatics.org/eml-2.0.1</formatId><size>17181</size><checksum algorithm="MD5">03ce09c6b4c3efc1681f3023402998a2</checksum><submitter>CN=urn:node:cnDevUNM2,DC=dataone,DC=org</submitter><rightsHolder>CN=testRightsHolder,DC=dataone,DC=org</rightsHolder><accessPolicy><allow><subject>CN=testRightsHolder,DC=dataone,DC=org</subject><permission>changePermission</permission></allow></accessPolicy><dateUploaded>2015-11-11T05:13:53.200+00:00</dateUploaded><dateSysMetadataModified>2015-11-11T05:13:53.200+00:00</dateSysMetadataModified><originMemberNode>urn:node:mnDevUCSB2</originMemberNode><authoritativeMemberNode>urn:node:mnDevUCSB2</authoritativeMemberNode></d1_v2.0:systemMetadata> [org.dataone.integration.ContextAwareTestCaseDataone]
20151111-05:13:54: [INFO]: rest call info: POST https://mn-dev-ucsb-2.test.dataone.org/metacat/d1/mn/v2/object; MMP message has: ParamPart:pid = testUpdateSystemMetadata_ObsoletedByFail_2015314211353182; FilePart:object = /tmp/mmp.output.4290626528101265549.tmp (17181 bytes); FilePart:sysmeta = /tmp/mmp.output.1049024300396485581.tmp (983 bytes);  [org.dataone.client.rest.RestClient]
20151111-05:13:54: [INFO]: object created.  pid = testUpdateSystemMetadata_ObsoletedByFail_2015314211353182 [org.dataone.integration.ContextAwareTestCaseDataone]
20151111-05:14:05: [INFO]: rest call info: PUT https://mn-dev-ucsb-2.test.dataone.org/metacat/d1/mn/v2/object/testUpdateSystemMetadata_ObsoletedByFail_2015314211353182; MMP message has: ParamPart:newPid = testUpdateSystemMetadata_ObsoletedByFail_2015314211353183; FilePart:object = /tmp/mmp.output.7548081351607793262.tmp (17181 bytes); FilePart:sysmeta = /tmp/mmp.output.8340786706831047008.tmp (786 bytes);  [org.dataone.client.rest.RestClient]
20151111-05:14:05: [INFO]: certificate directory: /etc/dataone/client/testClientCerts/ [org.dataone.integration.ContextAwareTestCaseDataone]
20151111-05:14:05: [INFO]: certificate filename: cnDevUNM2 [org.dataone.integration.ContextAwareTestCaseDataone]
20151111-05:14:05: [INFO]: client setup as Subject: CN=urn:node:cnDevUNM2,DC=dataone,DC=org [org.dataone.integration.ContextAwareTestCaseDataone]
20151111-05:14:05: [INFO]: creating a test object.  pid = testUpdateSystemMetadata_ObsoletedByFail_2015314211353184 on https://mn-dev-ucsb-2.test.dataone.org/metacat/d1/mn/v2 [org.dataone.integration.ContextAwareTestCaseDataone]
20151111-05:14:05: [INFO]: SystemMetadata for pid: testUpdateSystemMetadata_ObsoletedByFail_2015314211353184
<?xml version="1.0" encoding="UTF-8"?><d1_v2.0:systemMetadata xmlns:d1_v2.0="http://ns.dataone.org/service/types/v2.0" xmlns:d1="http://ns.dataone.org/service/types/v1"><serialVersion>1</serialVersion><identifier>testUpdateSystemMetadata_ObsoletedByFail_2015314211353184</identifier><formatId>eml://ecoinformatics.org/eml-2.0.1</formatId><size>17181</size><checksum algorithm="MD5">03ce09c6b4c3efc1681f3023402998a2</checksum><submitter>CN=urn:node:cnDevUNM2,DC=dataone,DC=org</submitter><rightsHolder>CN=testRightsHolder,DC=dataone,DC=org</rightsHolder><accessPolicy><allow><subject>CN=testRightsHolder,DC=dataone,DC=org</subject><permission>changePermission</permission></allow></accessPolicy><dateUploaded>2015-11-11T05:14:05.816+00:00</dateUploaded><dateSysMetadataModified>2015-11-11T05:14:05.816+00:00</dateSysMetadataModified><originMemberNode>urn:node:mnDevUCSB2</originMemberNode><authoritativeMemberNode>urn:node:mnDevUCSB2</authoritativeMemberNode></d1_v2.0:systemMetadata> [org.dataone.integration.ContextAwareTestCaseDataone]
20151111-05:14:06: [INFO]: rest call info: POST https://mn-dev-ucsb-2.test.dataone.org/metacat/d1/mn/v2/object; MMP message has: ParamPart:pid = testUpdateSystemMetadata_ObsoletedByFail_2015314211353184; FilePart:object = /tmp/mmp.output.8652789248823804857.tmp (17181 bytes); FilePart:sysmeta = /tmp/mmp.output.8087591717029432641.tmp (983 bytes);  [org.dataone.client.rest.RestClient]
20151111-05:14:06: [INFO]: object created.  pid = testUpdateSystemMetadata_ObsoletedByFail_2015314211353184 [org.dataone.integration.ContextAwareTestCaseDataone]
20151111-05:14:17: [INFO]: rest call info: GET https://mn-dev-ucsb-2.test.dataone.org/metacat/d1/mn/v2/meta/testUpdateSystemMetadata_ObsoletedByFail_2015314211353182 [org.dataone.client.rest.RestClient]
20151111-05:14:17: [INFO]: rest call info: PUT https://mn-dev-ucsb-2.test.dataone.org/metacat/d1/mn/v2/meta; MMP message has: ParamPart:pid = testUpdateSystemMetadata_ObsoletedByFail_2015314211353182; FilePart:sysmeta = /tmp/mmp.output.6471457562439270054.tmp (1091 bytes);  [org.dataone.client.rest.RestClient]
20151111-05:14:17: [INFO]: 
***************** running test for testUpdateSystemMetadata_ObsoletedByFail(...) vs. node: https://mn-dev-unm-2.test.dataone.org/metacat/d1/mn ***************** [org.dataone.integration.ContextAwareTestCaseDataone]
20151111-05:14:17: [INFO]: certificate directory: /etc/dataone/client/testClientCerts/ [org.dataone.integration.ContextAwareTestCaseDataone]
20151111-05:14:17: [INFO]: certificate filename: cnDevUNM2 [org.dataone.integration.ContextAwareTestCaseDataone]
20151111-05:14:17: [INFO]: client setup as Subject: CN=urn:node:cnDevUNM2,DC=dataone,DC=org [org.dataone.integration.ContextAwareTestCaseDataone]
20151111-05:14:17: [INFO]: creating a test object.  pid = testUpdateSystemMetadata_ObsoletedByFail_2015314211417413 on https://mn-dev-unm-2.test.dataone.org/metacat/d1/mn/v2 [org.dataone.integration.ContextAwareTestCaseDataone]
20151111-05:14:17: [INFO]: SystemMetadata for pid: testUpdateSystemMetadata_ObsoletedByFail_2015314211417413
<?xml version="1.0" encoding="UTF-8"?><d1_v2.0:systemMetadata xmlns:d1_v2.0="http://ns.dataone.org/service/types/v2.0" xmlns:d1="http://ns.dataone.org/service/types/v1"><serialVersion>1</serialVersion><identifier>testUpdateSystemMetadata_ObsoletedByFail_2015314211417413</identifier><formatId>eml://ecoinformatics.org/eml-2.0.1</formatId><size>17181</size><checksum algorithm="MD5">03ce09c6b4c3efc1681f3023402998a2</checksum><submitter>CN=urn:node:cnDevUNM2,DC=dataone,DC=org</submitter><rightsHolder>CN=testRightsHolder,DC=dataone,DC=org</rightsHolder><accessPolicy><allow><subject>CN=testRightsHolder,DC=dataone,DC=org</subject><permission>changePermission</permission></allow></accessPolicy><dateUploaded>2015-11-11T05:14:17.432+00:00</dateUploaded><dateSysMetadataModified>2015-11-11T05:14:17.432+00:00</dateSysMetadataModified><originMemberNode>urn:node:mnDevUNM2</originMemberNode><authoritativeMemberNode>urn:node:mnDevUNM2</authoritativeMemberNode></d1_v2.0:systemMetadata> [org.dataone.integration.ContextAwareTestCaseDataone]
20151111-05:14:18: [INFO]: rest call info: POST https://mn-dev-unm-2.test.dataone.org/metacat/d1/mn/v2/object; MMP message has: ParamPart:pid = testUpdateSystemMetadata_ObsoletedByFail_2015314211417413; FilePart:object = /tmp/mmp.output.5313395329126284104.tmp (17181 bytes); FilePart:sysmeta = /tmp/mmp.output.3876201287721365515.tmp (981 bytes);  [org.dataone.client.rest.RestClient]
20151111-05:14:18: [INFO]: object created.  pid = testUpdateSystemMetadata_ObsoletedByFail_2015314211417413 [org.dataone.integration.ContextAwareTestCaseDataone]
20151111-05:14:29: [INFO]: rest call info: PUT https://mn-dev-unm-2.test.dataone.org/metacat/d1/mn/v2/object/testUpdateSystemMetadata_ObsoletedByFail_2015314211417413; MMP message has: ParamPart:newPid = testUpdateSystemMetadata_ObsoletedByFail_2015314211417415; FilePart:object = /tmp/mmp.output.2102457874218460757.tmp (17181 bytes); FilePart:sysmeta = /tmp/mmp.output.1616550641600717413.tmp (786 bytes);  [org.dataone.client.rest.RestClient]
20151111-05:14:29: [INFO]: certificate directory: /etc/dataone/client/testClientCerts/ [org.dataone.integration.ContextAwareTestCaseDataone]
20151111-05:14:29: [INFO]: certificate filename: cnDevUNM2 [org.dataone.integration.ContextAwareTestCaseDataone]
20151111-05:14:29: [INFO]: client setup as Subject: CN=urn:node:cnDevUNM2,DC=dataone,DC=org [org.dataone.integration.ContextAwareTestCaseDataone]
20151111-05:14:29: [INFO]: creating a test object.  pid = testUpdateSystemMetadata_ObsoletedByFail_2015314211417416 on https://mn-dev-unm-2.test.dataone.org/metacat/d1/mn/v2 [org.dataone.integration.ContextAwareTestCaseDataone]
20151111-05:14:29: [INFO]: SystemMetadata for pid: testUpdateSystemMetadata_ObsoletedByFail_2015314211417416
<?xml version="1.0" encoding="UTF-8"?><d1_v2.0:systemMetadata xmlns:d1_v2.0="http://ns.dataone.org/service/types/v2.0" xmlns:d1="http://ns.dataone.org/service/types/v1"><serialVersion>1</serialVersion><identifier>testUpdateSystemMetadata_ObsoletedByFail_2015314211417416</identifier><formatId>eml://ecoinformatics.org/eml-2.0.1</formatId><size>17181</size><checksum algorithm="MD5">03ce09c6b4c3efc1681f3023402998a2</checksum><submitter>CN=urn:node:cnDevUNM2,DC=dataone,DC=org</submitter><rightsHolder>CN=testRightsHolder,DC=dataone,DC=org</rightsHolder><accessPolicy><allow><subject>CN=testRightsHolder,DC=dataone,DC=org</subject><permission>changePermission</permission></allow></accessPolicy><dateUploaded>2015-11-11T05:14:29.644+00:00</dateUploaded><dateSysMetadataModified>2015-11-11T05:14:29.644+00:00</dateSysMetadataModified><originMemberNode>urn:node:mnDevUNM2</originMemberNode><authoritativeMemberNode>urn:node:mnDevUNM2</authoritativeMemberNode></d1_v2.0:systemMetadata> [org.dataone.integration.ContextAwareTestCaseDataone]
20151111-05:14:30: [INFO]: rest call info: POST https://mn-dev-unm-2.test.dataone.org/metacat/d1/mn/v2/object; MMP message has: ParamPart:pid = testUpdateSystemMetadata_ObsoletedByFail_2015314211417416; FilePart:object = /tmp/mmp.output.2761038258105174215.tmp (17181 bytes); FilePart:sysmeta = /tmp/mmp.output.2125669608821425900.tmp (981 bytes);  [org.dataone.client.rest.RestClient]
20151111-05:14:30: [INFO]: object created.  pid = testUpdateSystemMetadata_ObsoletedByFail_2015314211417416 [org.dataone.integration.ContextAwareTestCaseDataone]
20151111-05:14:40: [INFO]: rest call info: GET https://mn-dev-unm-2.test.dataone.org/metacat/d1/mn/v2/meta/testUpdateSystemMetadata_ObsoletedByFail_2015314211417413 [org.dataone.client.rest.RestClient]
20151111-05:14:40: [INFO]: rest call info: PUT https://mn-dev-unm-2.test.dataone.org/metacat/d1/mn/v2/meta; MMP message has: ParamPart:pid = testUpdateSystemMetadata_ObsoletedByFail_2015314211417413; FilePart:sysmeta = /tmp/mmp.output.2977140923689161907.tmp (1089 bytes);  [org.dataone.client.rest.RestClient]
20151111-05:14:40: [INFO]: **************************************************** [org.dataone.integration.ContextAwareTestCaseDataone]
20151111-05:14:40: [INFO]: ***  context label:   DEV2 [org.dataone.integration.ContextAwareTestCaseDataone]
20151111-05:14:40: [INFO]: **************************************************** [org.dataone.integration.ContextAwareTestCaseDataone]
20151111-05:14:40: [INFO]: **************************************************** [org.dataone.integration.ContextAwareTestCaseDataone]
20151111-05:14:41: [INFO]: rest call info: GET https://mn-dev-ucsb-1.test.dataone.org/metacat/d1/mn/v2/monitor/ping [org.dataone.client.rest.RestClient]
20151111-05:14:41: [INFO]: MN excluded from test: https://mn-dev-ucsb-1.test.dataone.org/metacat/d1/mn [org.dataone.integration.ContextAwareTestCaseDataone]
20151111-05:14:41: [INFO]: rest call info: GET https://mn-dev-ucsb-2.test.dataone.org/metacat/d1/mn/v2/monitor/ping [org.dataone.client.rest.RestClient]
20151111-05:14:41: [INFO]: MN included in test: https://mn-dev-ucsb-2.test.dataone.org/metacat/d1/mn [org.dataone.integration.ContextAwareTestCaseDataone]
20151111-05:14:41: [INFO]: rest call info: GET https://mn-dev-unm-1.test.dataone.org/metacat/d1/mn/v2/monitor/ping [org.dataone.client.rest.RestClient]
20151111-05:14:41: [INFO]: MN excluded from test: https://mn-dev-unm-1.test.dataone.org/metacat/d1/mn [org.dataone.integration.ContextAwareTestCaseDataone]
20151111-05:14:41: [INFO]: rest call info: GET https://mn-dev-unm-2.test.dataone.org/metacat/d1/mn/v2/monitor/ping [org.dataone.client.rest.RestClient]
20151111-05:14:41: [INFO]: MN included in test: https://mn-dev-unm-2.test.dataone.org/metacat/d1/mn [org.dataone.integration.ContextAwareTestCaseDataone]
20151111-05:14:41: [INFO]: 
***************** running test for testUpdateSystemMetadata_MutableObsoletedBy(...) vs. node: https://mn-dev-ucsb-2.test.dataone.org/metacat/d1/mn ***************** [org.dataone.integration.ContextAwareTestCaseDataone]
20151111-05:14:41: [INFO]: certificate directory: /etc/dataone/client/testClientCerts/ [org.dataone.integration.ContextAwareTestCaseDataone]
20151111-05:14:41: [INFO]: certificate filename: cnDevUNM2 [org.dataone.integration.ContextAwareTestCaseDataone]
20151111-05:14:41: [INFO]: client setup as Subject: CN=urn:node:cnDevUNM2,DC=dataone,DC=org [org.dataone.integration.ContextAwareTestCaseDataone]
20151111-05:14:41: [INFO]: creating a test object.  pid = testUpdateSystemMetadata_MutableObsoletedBy_2015314211441207 on https://mn-dev-ucsb-2.test.dataone.org/metacat/d1/mn/v2 [org.dataone.integration.ContextAwareTestCaseDataone]
20151111-05:14:41: [INFO]: SystemMetadata for pid: testUpdateSystemMetadata_MutableObsoletedBy_2015314211441207
<?xml version="1.0" encoding="UTF-8"?><d1_v2.0:systemMetadata xmlns:d1_v2.0="http://ns.dataone.org/service/types/v2.0" xmlns:d1="http://ns.dataone.org/service/types/v1"><serialVersion>1</serialVersion><identifier>testUpdateSystemMetadata_MutableObsoletedBy_2015314211441207</identifier><formatId>eml://ecoinformatics.org/eml-2.0.1</formatId><size>17181</size><checksum algorithm="MD5">03ce09c6b4c3efc1681f3023402998a2</checksum><submitter>CN=urn:node:cnDevUNM2,DC=dataone,DC=org</submitter><rightsHolder>CN=testRightsHolder,DC=dataone,DC=org</rightsHolder><accessPolicy><allow><subject>CN=testRightsHolder,DC=dataone,DC=org</subject><permission>changePermission</permission></allow></accessPolicy><dateUploaded>2015-11-11T05:14:41.224+00:00</dateUploaded><dateSysMetadataModified>2015-11-11T05:14:41.224+00:00</dateSysMetadataModified><originMemberNode>urn:node:mnDevUCSB2</originMemberNode><authoritativeMemberNode>urn:node:mnDevUCSB2</authoritativeMemberNode></d1_v2.0:systemMetadata> [org.dataone.integration.ContextAwareTestCaseDataone]
20151111-05:14:42: [INFO]: rest call info: POST https://mn-dev-ucsb-2.test.dataone.org/metacat/d1/mn/v2/object; MMP message has: ParamPart:pid = testUpdateSystemMetadata_MutableObsoletedBy_2015314211441207; FilePart:object = /tmp/mmp.output.2771687763295815306.tmp (17181 bytes); FilePart:sysmeta = /tmp/mmp.output.5401401097492185924.tmp (986 bytes);  [org.dataone.client.rest.RestClient]
20151111-05:14:42: [INFO]: object created.  pid = testUpdateSystemMetadata_MutableObsoletedBy_2015314211441207 [org.dataone.integration.ContextAwareTestCaseDataone]
20151111-05:14:42: [INFO]: certificate directory: /etc/dataone/client/testClientCerts/ [org.dataone.integration.ContextAwareTestCaseDataone]
20151111-05:14:42: [INFO]: certificate filename: cnDevUNM2 [org.dataone.integration.ContextAwareTestCaseDataone]
20151111-05:14:42: [INFO]: client setup as Subject: CN=urn:node:cnDevUNM2,DC=dataone,DC=org [org.dataone.integration.ContextAwareTestCaseDataone]
20151111-05:14:42: [INFO]: creating a test object.  pid = testUpdateSystemMetadata_MutableObsoletedBy_2015314211441209 on https://mn-dev-ucsb-2.test.dataone.org/metacat/d1/mn/v2 [org.dataone.integration.ContextAwareTestCaseDataone]
20151111-05:14:42: [INFO]: SystemMetadata for pid: testUpdateSystemMetadata_MutableObsoletedBy_2015314211441209
<?xml version="1.0" encoding="UTF-8"?><d1_v2.0:systemMetadata xmlns:d1_v2.0="http://ns.dataone.org/service/types/v2.0" xmlns:d1="http://ns.dataone.org/service/types/v1"><serialVersion>1</serialVersion><identifier>testUpdateSystemMetadata_MutableObsoletedBy_2015314211441209</identifier><formatId>eml://ecoinformatics.org/eml-2.0.1</formatId><size>17181</size><checksum algorithm="MD5">03ce09c6b4c3efc1681f3023402998a2</checksum><submitter>CN=urn:node:cnDevUNM2,DC=dataone,DC=org</submitter><rightsHolder>CN=testRightsHolder,DC=dataone,DC=org</rightsHolder><accessPolicy><allow><subject>CN=testRightsHolder,DC=dataone,DC=org</subject><permission>changePermission</permission></allow></accessPolicy><dateUploaded>2015-11-11T05:14:42.433+00:00</dateUploaded><dateSysMetadataModified>2015-11-11T05:14:42.433+00:00</dateSysMetadataModified><originMemberNode>urn:node:mnDevUCSB2</originMemberNode><authoritativeMemberNode>urn:node:mnDevUCSB2</authoritativeMemberNode></d1_v2.0:systemMetadata> [org.dataone.integration.ContextAwareTestCaseDataone]
20151111-05:14:43: [INFO]: rest call info: POST https://mn-dev-ucsb-2.test.dataone.org/metacat/d1/mn/v2/object; MMP message has: ParamPart:pid = testUpdateSystemMetadata_MutableObsoletedBy_2015314211441209; FilePart:object = /tmp/mmp.output.7397867167025996185.tmp (17181 bytes); FilePart:sysmeta = /tmp/mmp.output.5516089882542470129.tmp (986 bytes);  [org.dataone.client.rest.RestClient]
20151111-05:14:43: [INFO]: object created.  pid = testUpdateSystemMetadata_MutableObsoletedBy_2015314211441209 [org.dataone.integration.ContextAwareTestCaseDataone]
20151111-05:14:53: [INFO]: rest call info: GET https://mn-dev-ucsb-2.test.dataone.org/metacat/d1/mn/v2/meta/testUpdateSystemMetadata_MutableObsoletedBy_2015314211441207 [org.dataone.client.rest.RestClient]
20151111-05:14:59: [INFO]: rest call info: PUT https://mn-dev-ucsb-2.test.dataone.org/metacat/d1/mn/v2/meta; MMP message has: ParamPart:pid = testUpdateSystemMetadata_MutableObsoletedBy_2015314211441207; FilePart:sysmeta = /tmp/mmp.output.8263250229891260550.tmp (1097 bytes);  [org.dataone.client.rest.RestClient]
20151111-05:14:59: [INFO]: 
***************** running test for testUpdateSystemMetadata_MutableObsoletedBy(...) vs. node: https://mn-dev-unm-2.test.dataone.org/metacat/d1/mn ***************** [org.dataone.integration.ContextAwareTestCaseDataone]
20151111-05:14:59: [INFO]: certificate directory: /etc/dataone/client/testClientCerts/ [org.dataone.integration.ContextAwareTestCaseDataone]
20151111-05:14:59: [INFO]: certificate filename: cnDevUNM2 [org.dataone.integration.ContextAwareTestCaseDataone]
20151111-05:14:59: [INFO]: client setup as Subject: CN=urn:node:cnDevUNM2,DC=dataone,DC=org [org.dataone.integration.ContextAwareTestCaseDataone]
20151111-05:14:59: [INFO]: creating a test object.  pid = testUpdateSystemMetadata_MutableObsoletedBy_2015314211459394 on https://mn-dev-unm-2.test.dataone.org/metacat/d1/mn/v2 [org.dataone.integration.ContextAwareTestCaseDataone]
20151111-05:14:59: [INFO]: SystemMetadata for pid: testUpdateSystemMetadata_MutableObsoletedBy_2015314211459394
<?xml version="1.0" encoding="UTF-8"?><d1_v2.0:systemMetadata xmlns:d1_v2.0="http://ns.dataone.org/service/types/v2.0" xmlns:d1="http://ns.dataone.org/service/types/v1"><serialVersion>1</serialVersion><identifier>testUpdateSystemMetadata_MutableObsoletedBy_2015314211459394</identifier><formatId>eml://ecoinformatics.org/eml-2.0.1</formatId><size>17181</size><checksum algorithm="MD5">03ce09c6b4c3efc1681f3023402998a2</checksum><submitter>CN=urn:node:cnDevUNM2,DC=dataone,DC=org</submitter><rightsHolder>CN=testRightsHolder,DC=dataone,DC=org</rightsHolder><accessPolicy><allow><subject>CN=testRightsHolder,DC=dataone,DC=org</subject><permission>changePermission</permission></allow></accessPolicy><dateUploaded>2015-11-11T05:14:59.409+00:00</dateUploaded><dateSysMetadataModified>2015-11-11T05:14:59.409+00:00</dateSysMetadataModified><originMemberNode>urn:node:mnDevUNM2</originMemberNode><authoritativeMemberNode>urn:node:mnDevUNM2</authoritativeMemberNode></d1_v2.0:systemMetadata> [org.dataone.integration.ContextAwareTestCaseDataone]
20151111-05:15:00: [INFO]: rest call info: POST https://mn-dev-unm-2.test.dataone.org/metacat/d1/mn/v2/object; MMP message has: ParamPart:pid = testUpdateSystemMetadata_MutableObsoletedBy_2015314211459394; FilePart:object = /tmp/mmp.output.7619492715940909663.tmp (17181 bytes); FilePart:sysmeta = /tmp/mmp.output.6972319795260063818.tmp (984 bytes);  [org.dataone.client.rest.RestClient]
20151111-05:15:00: [INFO]: object created.  pid = testUpdateSystemMetadata_MutableObsoletedBy_2015314211459394 [org.dataone.integration.ContextAwareTestCaseDataone]
20151111-05:15:00: [INFO]: certificate directory: /etc/dataone/client/testClientCerts/ [org.dataone.integration.ContextAwareTestCaseDataone]
20151111-05:15:00: [INFO]: certificate filename: cnDevUNM2 [org.dataone.integration.ContextAwareTestCaseDataone]
20151111-05:15:00: [INFO]: client setup as Subject: CN=urn:node:cnDevUNM2,DC=dataone,DC=org [org.dataone.integration.ContextAwareTestCaseDataone]
20151111-05:15:00: [INFO]: creating a test object.  pid = testUpdateSystemMetadata_MutableObsoletedBy_2015314211459396 on https://mn-dev-unm-2.test.dataone.org/metacat/d1/mn/v2 [org.dataone.integration.ContextAwareTestCaseDataone]
20151111-05:15:00: [INFO]: SystemMetadata for pid: testUpdateSystemMetadata_MutableObsoletedBy_2015314211459396
<?xml version="1.0" encoding="UTF-8"?><d1_v2.0:systemMetadata xmlns:d1_v2.0="http://ns.dataone.org/service/types/v2.0" xmlns:d1="http://ns.dataone.org/service/types/v1"><serialVersion>1</serialVersion><identifier>testUpdateSystemMetadata_MutableObsoletedBy_2015314211459396</identifier><formatId>eml://ecoinformatics.org/eml-2.0.1</formatId><size>17181</size><checksum algorithm="MD5">03ce09c6b4c3efc1681f3023402998a2</checksum><submitter>CN=urn:node:cnDevUNM2,DC=dataone,DC=org</submitter><rightsHolder>CN=testRightsHolder,DC=dataone,DC=org</rightsHolder><accessPolicy><allow><subject>CN=testRightsHolder,DC=dataone,DC=org</subject><permission>changePermission</permission></allow></accessPolicy><dateUploaded>2015-11-11T05:15:00.326+00:00</dateUploaded><dateSysMetadataModified>2015-11-11T05:15:00.326+00:00</dateSysMetadataModified><originMemberNode>urn:node:mnDevUNM2</originMemberNode><authoritativeMemberNode>urn:node:mnDevUNM2</authoritativeMemberNode></d1_v2.0:systemMetadata> [org.dataone.integration.ContextAwareTestCaseDataone]
20151111-05:15:01: [INFO]: rest call info: POST https://mn-dev-unm-2.test.dataone.org/metacat/d1/mn/v2/object; MMP message has: ParamPart:pid = testUpdateSystemMetadata_MutableObsoletedBy_2015314211459396; FilePart:object = /tmp/mmp.output.581730925714620308.tmp (17181 bytes); FilePart:sysmeta = /tmp/mmp.output.7068739389243018700.tmp (984 bytes);  [org.dataone.client.rest.RestClient]
20151111-05:15:01: [INFO]: object created.  pid = testUpdateSystemMetadata_MutableObsoletedBy_2015314211459396 [org.dataone.integration.ContextAwareTestCaseDataone]
20151111-05:15:11: [INFO]: rest call info: GET https://mn-dev-unm-2.test.dataone.org/metacat/d1/mn/v2/meta/testUpdateSystemMetadata_MutableObsoletedBy_2015314211459394 [org.dataone.client.rest.RestClient]
20151111-05:15:16: [INFO]: rest call info: PUT https://mn-dev-unm-2.test.dataone.org/metacat/d1/mn/v2/meta; MMP message has: ParamPart:pid = testUpdateSystemMetadata_MutableObsoletedBy_2015314211459394; FilePart:sysmeta = /tmp/mmp.output.4971185316932703026.tmp (1095 bytes);  [org.dataone.client.rest.RestClient]
20151111-05:15:16: [INFO]: **************************************************** [org.dataone.integration.ContextAwareTestCaseDataone]
20151111-05:15:16: [INFO]: ***  context label:   DEV2 [org.dataone.integration.ContextAwareTestCaseDataone]
20151111-05:15:16: [INFO]: **************************************************** [org.dataone.integration.ContextAwareTestCaseDataone]
20151111-05:15:16: [INFO]: **************************************************** [org.dataone.integration.ContextAwareTestCaseDataone]
20151111-05:15:17: [INFO]: rest call info: GET https://mn-dev-ucsb-1.test.dataone.org/metacat/d1/mn/v2/monitor/ping [org.dataone.client.rest.RestClient]
20151111-05:15:17: [INFO]: MN excluded from test: https://mn-dev-ucsb-1.test.dataone.org/metacat/d1/mn [org.dataone.integration.ContextAwareTestCaseDataone]
20151111-05:15:17: [INFO]: rest call info: GET https://mn-dev-ucsb-2.test.dataone.org/metacat/d1/mn/v2/monitor/ping [org.dataone.client.rest.RestClient]
20151111-05:15:17: [INFO]: MN included in test: https://mn-dev-ucsb-2.test.dataone.org/metacat/d1/mn [org.dataone.integration.ContextAwareTestCaseDataone]
20151111-05:15:17: [INFO]: rest call info: GET https://mn-dev-unm-1.test.dataone.org/metacat/d1/mn/v2/monitor/ping [org.dataone.client.rest.RestClient]
20151111-05:15:17: [INFO]: MN excluded from test: https://mn-dev-unm-1.test.dataone.org/metacat/d1/mn [org.dataone.integration.ContextAwareTestCaseDataone]
20151111-05:15:17: [INFO]: rest call info: GET https://mn-dev-unm-2.test.dataone.org/metacat/d1/mn/v2/monitor/ping [org.dataone.client.rest.RestClient]
20151111-05:15:17: [INFO]: MN included in test: https://mn-dev-unm-2.test.dataone.org/metacat/d1/mn [org.dataone.integration.ContextAwareTestCaseDataone]
20151111-05:15:17: [INFO]: 
***************** running test for testUpdateSystemMetadata_MutableObsoletes(...) vs. node: https://mn-dev-ucsb-2.test.dataone.org/metacat/d1/mn ***************** [org.dataone.integration.ContextAwareTestCaseDataone]
20151111-05:15:17: [INFO]: certificate directory: /etc/dataone/client/testClientCerts/ [org.dataone.integration.ContextAwareTestCaseDataone]
20151111-05:15:17: [INFO]: certificate filename: cnDevUNM2 [org.dataone.integration.ContextAwareTestCaseDataone]
20151111-05:15:17: [INFO]: client setup as Subject: CN=urn:node:cnDevUNM2,DC=dataone,DC=org [org.dataone.integration.ContextAwareTestCaseDataone]
20151111-05:15:17: [INFO]: creating a test object.  pid = testUpdateSystemMetadata_MutableObsoletes_2015314211517808 on https://mn-dev-ucsb-2.test.dataone.org/metacat/d1/mn/v2 [org.dataone.integration.ContextAwareTestCaseDataone]
20151111-05:15:17: [INFO]: SystemMetadata for pid: testUpdateSystemMetadata_MutableObsoletes_2015314211517808
<?xml version="1.0" encoding="UTF-8"?><d1_v2.0:systemMetadata xmlns:d1_v2.0="http://ns.dataone.org/service/types/v2.0" xmlns:d1="http://ns.dataone.org/service/types/v1"><serialVersion>1</serialVersion><identifier>testUpdateSystemMetadata_MutableObsoletes_2015314211517808</identifier><formatId>eml://ecoinformatics.org/eml-2.0.1</formatId><size>17181</size><checksum algorithm="MD5">03ce09c6b4c3efc1681f3023402998a2</checksum><submitter>CN=urn:node:cnDevUNM2,DC=dataone,DC=org</submitter><rightsHolder>CN=testRightsHolder,DC=dataone,DC=org</rightsHolder><accessPolicy><allow><subject>CN=testRightsHolder,DC=dataone,DC=org</subject><permission>changePermission</permission></allow></accessPolicy><dateUploaded>2015-11-11T05:15:17.840+00:00</dateUploaded><dateSysMetadataModified>2015-11-11T05:15:17.840+00:00</dateSysMetadataModified><originMemberNode>urn:node:mnDevUCSB2</originMemberNode><authoritativeMemberNode>urn:node:mnDevUCSB2</authoritativeMemberNode></d1_v2.0:systemMetadata> [org.dataone.integration.ContextAwareTestCaseDataone]
20151111-05:15:18: [INFO]: rest call info: POST https://mn-dev-ucsb-2.test.dataone.org/metacat/d1/mn/v2/object; MMP message has: ParamPart:pid = testUpdateSystemMetadata_MutableObsoletes_2015314211517808; FilePart:object = /tmp/mmp.output.5478616932398139362.tmp (17181 bytes); FilePart:sysmeta = /tmp/mmp.output.7850623078833276864.tmp (984 bytes);  [org.dataone.client.rest.RestClient]
20151111-05:15:18: [INFO]: object created.  pid = testUpdateSystemMetadata_MutableObsoletes_2015314211517808 [org.dataone.integration.ContextAwareTestCaseDataone]
20151111-05:15:18: [INFO]: certificate directory: /etc/dataone/client/testClientCerts/ [org.dataone.integration.ContextAwareTestCaseDataone]
20151111-05:15:18: [INFO]: certificate filename: cnDevUNM2 [org.dataone.integration.ContextAwareTestCaseDataone]
20151111-05:15:18: [INFO]: client setup as Subject: CN=urn:node:cnDevUNM2,DC=dataone,DC=org [org.dataone.integration.ContextAwareTestCaseDataone]
20151111-05:15:18: [INFO]: creating a test object.  pid = testUpdateSystemMetadata_MutableObsoletes_2015314211517809 on https://mn-dev-ucsb-2.test.dataone.org/metacat/d1/mn/v2 [org.dataone.integration.ContextAwareTestCaseDataone]
20151111-05:15:18: [INFO]: SystemMetadata for pid: testUpdateSystemMetadata_MutableObsoletes_2015314211517809
<?xml version="1.0" encoding="UTF-8"?><d1_v2.0:systemMetadata xmlns:d1_v2.0="http://ns.dataone.org/service/types/v2.0" xmlns:d1="http://ns.dataone.org/service/types/v1"><serialVersion>1</serialVersion><identifier>testUpdateSystemMetadata_MutableObsoletes_2015314211517809</identifier><formatId>eml://ecoinformatics.org/eml-2.0.1</formatId><size>17181</size><checksum algorithm="MD5">03ce09c6b4c3efc1681f3023402998a2</checksum><submitter>CN=urn:node:cnDevUNM2,DC=dataone,DC=org</submitter><rightsHolder>CN=testRightsHolder,DC=dataone,DC=org</rightsHolder><accessPolicy><allow><subject>CN=testRightsHolder,DC=dataone,DC=org</subject><permission>changePermission</permission></allow></accessPolicy><dateUploaded>2015-11-11T05:15:18.755+00:00</dateUploaded><dateSysMetadataModified>2015-11-11T05:15:18.755+00:00</dateSysMetadataModified><originMemberNode>urn:node:mnDevUCSB2</originMemberNode><authoritativeMemberNode>urn:node:mnDevUCSB2</authoritativeMemberNode></d1_v2.0:systemMetadata> [org.dataone.integration.ContextAwareTestCaseDataone]
20151111-05:15:19: [INFO]: rest call info: POST https://mn-dev-ucsb-2.test.dataone.org/metacat/d1/mn/v2/object; MMP message has: ParamPart:pid = testUpdateSystemMetadata_MutableObsoletes_2015314211517809; FilePart:object = /tmp/mmp.output.3668138548993387636.tmp (17181 bytes); FilePart:sysmeta = /tmp/mmp.output.3402930187382905984.tmp (984 bytes);  [org.dataone.client.rest.RestClient]
20151111-05:15:19: [INFO]: object created.  pid = testUpdateSystemMetadata_MutableObsoletes_2015314211517809 [org.dataone.integration.ContextAwareTestCaseDataone]
20151111-05:15:30: [INFO]: rest call info: GET https://mn-dev-ucsb-2.test.dataone.org/metacat/d1/mn/v2/meta/testUpdateSystemMetadata_MutableObsoletes_2015314211517809 [org.dataone.client.rest.RestClient]
20151111-05:15:35: [INFO]: rest call info: PUT https://mn-dev-ucsb-2.test.dataone.org/metacat/d1/mn/v2/meta; MMP message has: ParamPart:pid = testUpdateSystemMetadata_MutableObsoletes_2015314211517809; FilePart:sysmeta = /tmp/mmp.output.1167900672556837386.tmp (1089 bytes);  [org.dataone.client.rest.RestClient]
20151111-05:15:35: [INFO]: 
***************** running test for testUpdateSystemMetadata_MutableObsoletes(...) vs. node: https://mn-dev-unm-2.test.dataone.org/metacat/d1/mn ***************** [org.dataone.integration.ContextAwareTestCaseDataone]
20151111-05:15:35: [INFO]: certificate directory: /etc/dataone/client/testClientCerts/ [org.dataone.integration.ContextAwareTestCaseDataone]
20151111-05:15:35: [INFO]: certificate filename: cnDevUNM2 [org.dataone.integration.ContextAwareTestCaseDataone]
20151111-05:15:35: [INFO]: client setup as Subject: CN=urn:node:cnDevUNM2,DC=dataone,DC=org [org.dataone.integration.ContextAwareTestCaseDataone]
20151111-05:15:35: [INFO]: creating a test object.  pid = testUpdateSystemMetadata_MutableObsoletes_2015314211535634 on https://mn-dev-unm-2.test.dataone.org/metacat/d1/mn/v2 [org.dataone.integration.ContextAwareTestCaseDataone]
20151111-05:15:35: [INFO]: SystemMetadata for pid: testUpdateSystemMetadata_MutableObsoletes_2015314211535634
<?xml version="1.0" encoding="UTF-8"?><d1_v2.0:systemMetadata xmlns:d1_v2.0="http://ns.dataone.org/service/types/v2.0" xmlns:d1="http://ns.dataone.org/service/types/v1"><serialVersion>1</serialVersion><identifier>testUpdateSystemMetadata_MutableObsoletes_2015314211535634</identifier><formatId>eml://ecoinformatics.org/eml-2.0.1</formatId><size>17181</size><checksum algorithm="MD5">03ce09c6b4c3efc1681f3023402998a2</checksum><submitter>CN=urn:node:cnDevUNM2,DC=dataone,DC=org</submitter><rightsHolder>CN=testRightsHolder,DC=dataone,DC=org</rightsHolder><accessPolicy><allow><subject>CN=testRightsHolder,DC=dataone,DC=org</subject><permission>changePermission</permission></allow></accessPolicy><dateUploaded>2015-11-11T05:15:35.646+00:00</dateUploaded><dateSysMetadataModified>2015-11-11T05:15:35.646+00:00</dateSysMetadataModified><originMemberNode>urn:node:mnDevUNM2</originMemberNode><authoritativeMemberNode>urn:node:mnDevUNM2</authoritativeMemberNode></d1_v2.0:systemMetadata> [org.dataone.integration.ContextAwareTestCaseDataone]
20151111-05:15:36: [INFO]: rest call info: POST https://mn-dev-unm-2.test.dataone.org/metacat/d1/mn/v2/object; MMP message has: ParamPart:pid = testUpdateSystemMetadata_MutableObsoletes_2015314211535634; FilePart:object = /tmp/mmp.output.268166319366434609.tmp (17181 bytes); FilePart:sysmeta = /tmp/mmp.output.5185825153706448235.tmp (982 bytes);  [org.dataone.client.rest.RestClient]
20151111-05:15:36: [INFO]: object created.  pid = testUpdateSystemMetadata_MutableObsoletes_2015314211535634 [org.dataone.integration.ContextAwareTestCaseDataone]
20151111-05:15:36: [INFO]: certificate directory: /etc/dataone/client/testClientCerts/ [org.dataone.integration.ContextAwareTestCaseDataone]
20151111-05:15:36: [INFO]: certificate filename: cnDevUNM2 [org.dataone.integration.ContextAwareTestCaseDataone]
20151111-05:15:36: [INFO]: client setup as Subject: CN=urn:node:cnDevUNM2,DC=dataone,DC=org [org.dataone.integration.ContextAwareTestCaseDataone]
20151111-05:15:36: [INFO]: creating a test object.  pid = testUpdateSystemMetadata_MutableObsoletes_2015314211535635 on https://mn-dev-unm-2.test.dataone.org/metacat/d1/mn/v2 [org.dataone.integration.ContextAwareTestCaseDataone]
20151111-05:15:36: [INFO]: SystemMetadata for pid: testUpdateSystemMetadata_MutableObsoletes_2015314211535635
<?xml version="1.0" encoding="UTF-8"?><d1_v2.0:systemMetadata xmlns:d1_v2.0="http://ns.dataone.org/service/types/v2.0" xmlns:d1="http://ns.dataone.org/service/types/v1"><serialVersion>1</serialVersion><identifier>testUpdateSystemMetadata_MutableObsoletes_2015314211535635</identifier><formatId>eml://ecoinformatics.org/eml-2.0.1</formatId><size>17181</size><checksum algorithm="MD5">03ce09c6b4c3efc1681f3023402998a2</checksum><submitter>CN=urn:node:cnDevUNM2,DC=dataone,DC=org</submitter><rightsHolder>CN=testRightsHolder,DC=dataone,DC=org</rightsHolder><accessPolicy><allow><subject>CN=testRightsHolder,DC=dataone,DC=org</subject><permission>changePermission</permission></allow></accessPolicy><dateUploaded>2015-11-11T05:15:36.631+00:00</dateUploaded><dateSysMetadataModified>2015-11-11T05:15:36.631+00:00</dateSysMetadataModified><originMemberNode>urn:node:mnDevUNM2</originMemberNode><authoritativeMemberNode>urn:node:mnDevUNM2</authoritativeMemberNode></d1_v2.0:systemMetadata> [org.dataone.integration.ContextAwareTestCaseDataone]
20151111-05:15:37: [INFO]: rest call info: POST https://mn-dev-unm-2.test.dataone.org/metacat/d1/mn/v2/object; MMP message has: ParamPart:pid = testUpdateSystemMetadata_MutableObsoletes_2015314211535635; FilePart:object = /tmp/mmp.output.4889650400239999477.tmp (17181 bytes); FilePart:sysmeta = /tmp/mmp.output.3089102792842683876.tmp (982 bytes);  [org.dataone.client.rest.RestClient]
20151111-05:15:37: [INFO]: object created.  pid = testUpdateSystemMetadata_MutableObsoletes_2015314211535635 [org.dataone.integration.ContextAwareTestCaseDataone]
20151111-05:15:47: [INFO]: rest call info: GET https://mn-dev-unm-2.test.dataone.org/metacat/d1/mn/v2/meta/testUpdateSystemMetadata_MutableObsoletes_2015314211535635 [org.dataone.client.rest.RestClient]
20151111-05:15:52: [INFO]: rest call info: PUT https://mn-dev-unm-2.test.dataone.org/metacat/d1/mn/v2/meta; MMP message has: ParamPart:pid = testUpdateSystemMetadata_MutableObsoletes_2015314211535635; FilePart:sysmeta = /tmp/mmp.output.6949909647901822551.tmp (1087 bytes);  [org.dataone.client.rest.RestClient]
20151111-05:15:52: [INFO]: **************************************************** [org.dataone.integration.ContextAwareTestCaseDataone]
20151111-05:15:52: [INFO]: ***  context label:   DEV2 [org.dataone.integration.ContextAwareTestCaseDataone]
20151111-05:15:52: [INFO]: **************************************************** [org.dataone.integration.ContextAwareTestCaseDataone]
20151111-05:15:52: [INFO]: **************************************************** [org.dataone.integration.ContextAwareTestCaseDataone]
20151111-05:15:53: [INFO]: rest call info: GET https://mn-dev-ucsb-1.test.dataone.org/metacat/d1/mn/v2/monitor/ping [org.dataone.client.rest.RestClient]
20151111-05:15:53: [INFO]: MN excluded from test: https://mn-dev-ucsb-1.test.dataone.org/metacat/d1/mn [org.dataone.integration.ContextAwareTestCaseDataone]
20151111-05:15:53: [INFO]: rest call info: GET https://mn-dev-ucsb-2.test.dataone.org/metacat/d1/mn/v2/monitor/ping [org.dataone.client.rest.RestClient]
20151111-05:15:53: [INFO]: MN included in test: https://mn-dev-ucsb-2.test.dataone.org/metacat/d1/mn [org.dataone.integration.ContextAwareTestCaseDataone]
20151111-05:15:53: [INFO]: rest call info: GET https://mn-dev-unm-1.test.dataone.org/metacat/d1/mn/v2/monitor/ping [org.dataone.client.rest.RestClient]
20151111-05:15:53: [INFO]: MN excluded from test: https://mn-dev-unm-1.test.dataone.org/metacat/d1/mn [org.dataone.integration.ContextAwareTestCaseDataone]
20151111-05:15:53: [INFO]: rest call info: GET https://mn-dev-unm-2.test.dataone.org/metacat/d1/mn/v2/monitor/ping [org.dataone.client.rest.RestClient]
20151111-05:15:53: [INFO]: MN included in test: https://mn-dev-unm-2.test.dataone.org/metacat/d1/mn [org.dataone.integration.ContextAwareTestCaseDataone]
20151111-05:15:53: [INFO]: 
***************** running test for testUpdateSystemMetadata_CNCertNonAuthMN(...) vs. node: https://mn-dev-ucsb-2.test.dataone.org/metacat/d1/mn ***************** [org.dataone.integration.ContextAwareTestCaseDataone]
20151111-05:15:53: [INFO]: rest call info: GET https://cn-dev-ucsb-2.test.dataone.org/cn/v2/node [org.dataone.client.rest.RestClient]
Tests run: 14, Failures: 1, Errors: 0, Skipped: 1, Time elapsed: 367.998 sec <<< FAILURE!

Results :

Failed tests: 
  testRegisterSystemMetadata_dateModified(org.dataone.integration.it.apiTests.MNSystemMetadataMutabilityIt): Unable to fetch node list from CN: https://cn-dev-ucsb-2.test.dataone.org/cn/v2
  testSetReplicationStatus_dateModified(org.dataone.integration.it.apiTests.MNSystemMetadataMutabilityIt): Unable to fetch node list from CN: https://cn-dev-ucsb-2.test.dataone.org/cn/v2
  testSetReplicationMetadata_dateModified(org.dataone.integration.it.apiTests.MNSystemMetadataMutabilityIt): Unable to fetch node list from CN: https://cn-dev-ucsb-2.test.dataone.org/cn/v2
  testDeleteReplicationMetadata_dateModified(org.dataone.integration.it.apiTests.MNSystemMetadataMutabilityIt): Unable to fetch node list from CN: https://cn-dev-ucsb-2.test.dataone.org/cn/v2
  testUpdateSystemMetadata_CNCertNonAuthMN(org.dataone.integration.it.apiTests.MNUpdateSystemMetadataIT): Test setup failed. Couldn't create object: GET https://cn-dev-ucsb-2.test.dataone.org/cn/v2/node : ServiceFailure: -1: 500: Internal Server Error: Deserializing Text/Plain: Just providing message body:

Tests run: 18, Failures: 5, Errors: 0, Skipped: 1

[WARNING] File encoding has not been set, using platform encoding UTF-8, i.e. build is platform dependent!
[JENKINS] Recording test results
[INFO] 
[INFO] --- maven-failsafe-plugin:2.8.1:verify (verify) @ d1_integration ---
[INFO] Failsafe report directory: /var/lib/jenkins/jobs/d1_integration_DEV2_mn_sysmeta_mutability/workspace/target/failsafe-reports
[WARNING] File encoding has not been set, using platform encoding UTF-8, i.e. build is platform dependent!
[ERROR] There are test failures.

Please refer to /var/lib/jenkins/jobs/d1_integration_DEV2_mn_sysmeta_mutability/workspace/target/failsafe-reports for the individual test results.
[JENKINS] Recording test results
Notifying upstream projects of job completion
Join notifier requires a CauseAction
[INFO] ------------------------------------------------------------------------
[INFO] BUILD SUCCESS
[INFO] ------------------------------------------------------------------------
[INFO] Total time: 6:43.537s
[INFO] Finished at: Wed Nov 11 05:15:53 UTC 2015
[INFO] Final Memory: 42M/362M
[INFO] ------------------------------------------------------------------------
Waiting for Jenkins to finish collecting data
[JENKINS] Archiving /var/lib/jenkins/jobs/d1_integration_DEV2_mn_sysmeta_mutability/workspace/pom.xml to org.dataone/d1_integration/2.0-SNAPSHOT/d1_integration-2.0-SNAPSHOT.pom
channel stopped
Notifying upstream projects of job completion
Warning: you have no plugins providing access control for builds, so falling back to legacy behavior of permitting any downstream builds to be triggered
Finished: UNSTABLE