UnstableConsole Output

Skipping 34 KB.. Full Log
IQSmjNKU4P0+vJLE4u1gvPjexLDVPzxdEGvvmZ+X75ZekLlOVfvTjc8FPJgaGiiIGKaiG5Py84vycVD1nCA1SyAABjCCFBQCV27OjYAAAAA==--- maven-compiler-plugin:2.0.2:testCompile (default-testCompile) @ d1_integration ---
[INFO] Compiling 144 source files to /var/lib/jenkins/jobs/d1_integration_DEV2_MN_sid_functional/workspace/target/test-classes
[INFO] 
[INFO] --- maven-surefire-plugin:2.10:test (default-test) @ d1_integration ---
[INFO] Surefire report directory: /var/lib/jenkins/jobs/d1_integration_DEV2_MN_sid_functional/workspace/target/surefire-reports

-------------------------------------------------------
 T E S T S
-------------------------------------------------------

Results :

Tests run: 0, Failures: 0, Errors: 0, Skipped: 0

[JENKINS] Recording test results[INFO] 
[INFO] --- maven-antrun-plugin:1.3:run (execution1) @ d1_integration ---

[INFO] Executing tasks
     [copy] Copying 236 files to /var/lib/jenkins/jobs/d1_integration_DEV2_MN_sid_functional/workspace/target/classes
     [copy] Copying 3 files to /var/lib/jenkins/jobs/d1_integration_DEV2_MN_sid_functional/workspace/target/d1_integration-2.0-SNAPSHOT/org/dataone/integration/webTest
[INFO] Executed tasks
[INFO] 
[INFO] --- maven-dependency-plugin:2.3:unpack-dependencies (jetty-classpath) @ d1_integration ---
[INFO] Unpacking /var/lib/jenkins/.m2/repository/org/eclipse/jetty/orbit/org.apache.jasper.glassfish/2.2.2.v201112011158/org.apache.jasper.glassfish-2.2.2.v201112011158.jar to /var/lib/jenkins/jobs/d1_integration_DEV2_MN_sid_functional/workspace/target/d1_integration-2.0-SNAPSHOT with includes "" and excludes ""
[INFO] Unpacking /var/lib/jenkins/.m2/repository/org/slf4j/slf4j-simple/1.6.4/slf4j-simple-1.6.4.jar to /var/lib/jenkins/jobs/d1_integration_DEV2_MN_sid_functional/workspace/target/d1_integration-2.0-SNAPSHOT with includes "" and excludes ""
[INFO] Unpacking /var/lib/jenkins/.m2/repository/org/eclipse/jetty/jetty-websocket/8.1.15.v20140411/jetty-websocket-8.1.15.v20140411.jar to /var/lib/jenkins/jobs/d1_integration_DEV2_MN_sid_functional/workspace/target/d1_integration-2.0-SNAPSHOT with includes "" and excludes ""
[INFO] Unpacking /var/lib/jenkins/.m2/repository/org/eclipse/jetty/orbit/javax.security.auth.message/1.0.0.v201108011116/javax.security.auth.message-1.0.0.v201108011116.jar to /var/lib/jenkins/jobs/d1_integration_DEV2_MN_sid_functional/workspace/target/d1_integration-2.0-SNAPSHOT with includes "" and excludes ""
[INFO] Unpacking /var/lib/jenkins/.m2/repository/org/eclipse/jetty/orbit/javax.servlet.jsp.jstl/1.2.0.v201105211821/javax.servlet.jsp.jstl-1.2.0.v201105211821.jar to /var/lib/jenkins/jobs/d1_integration_DEV2_MN_sid_functional/workspace/target/d1_integration-2.0-SNAPSHOT with includes "" and excludes ""
[INFO] Unpacking /var/lib/jenkins/.m2/repository/org/eclipse/jetty/orbit/com.sun.el/2.2.0.v201108011116/com.sun.el-2.2.0.v201108011116.jar to /var/lib/jenkins/jobs/d1_integration_DEV2_MN_sid_functional/workspace/target/d1_integration-2.0-SNAPSHOT with includes "" and excludes ""
[INFO] Unpacking /var/lib/jenkins/.m2/repository/org/eclipse/jetty/orbit/javax.mail.glassfish/1.4.1.v201005082020/javax.mail.glassfish-1.4.1.v201005082020.jar to /var/lib/jenkins/jobs/d1_integration_DEV2_MN_sid_functional/workspace/target/d1_integration-2.0-SNAPSHOT with includes "" and excludes ""
[INFO] Unpacking /var/lib/jenkins/.m2/repository/org/slf4j/slf4j-api/1.6.4/slf4j-api-1.6.4.jar to /var/lib/jenkins/jobs/d1_integration_DEV2_MN_sid_functional/workspace/target/d1_integration-2.0-SNAPSHOT with includes "" and excludes ""
[INFO] Unpacking /var/lib/jenkins/.m2/repository/org/eclipse/jetty/jetty-io/8.1.15.v20140411/jetty-io-8.1.15.v20140411.jar to /var/lib/jenkins/jobs/d1_integration_DEV2_MN_sid_functional/workspace/target/d1_integration-2.0-SNAPSHOT with includes "" and excludes ""
[INFO] Unpacking /var/lib/jenkins/.m2/repository/org/eclipse/jetty/orbit/javax.servlet.jsp/2.2.0.v201112011158/javax.servlet.jsp-2.2.0.v201112011158.jar to /var/lib/jenkins/jobs/d1_integration_DEV2_MN_sid_functional/workspace/target/d1_integration-2.0-SNAPSHOT with includes "" and excludes ""
[INFO] Unpacking /var/lib/jenkins/.m2/repository/org/eclipse/jetty/aggregate/jetty-all-server/8.1.15.v20140411/jetty-all-server-8.1.15.v20140411.jar to /var/lib/jenkins/jobs/d1_integration_DEV2_MN_sid_functional/workspace/target/d1_integration-2.0-SNAPSHOT with includes "" and excludes ""
[INFO] Unpacking /var/lib/jenkins/.m2/repository/org/eclipse/jetty/jetty-jsp/8.1.15.v20140411/jetty-jsp-8.1.15.v20140411.jar to /var/lib/jenkins/jobs/d1_integration_DEV2_MN_sid_functional/workspace/target/d1_integration-2.0-SNAPSHOT with includes "" and excludes ""
[INFO] Unpacking /var/lib/jenkins/.m2/repository/org/eclipse/jetty/orbit/org.apache.taglibs.standard.glassfish/1.2.0.v201112081803/org.apache.taglibs.standard.glassfish-1.2.0.v201112081803.jar to /var/lib/jenkins/jobs/d1_integration_DEV2_MN_sid_functional/workspace/target/d1_integration-2.0-SNAPSHOT with includes "" and excludes ""
[INFO] Unpacking /var/lib/jenkins/.m2/repository/javax/servlet/servlet-api/2.5/servlet-api-2.5.jar to /var/lib/jenkins/jobs/d1_integration_DEV2_MN_sid_functional/workspace/target/d1_integration-2.0-SNAPSHOT with includes "" and excludes ""
[INFO] Unpacking /var/lib/jenkins/.m2/repository/org/eclipse/jetty/orbit/javax.activation/1.1.0.v201105071233/javax.activation-1.1.0.v201105071233.jar to /var/lib/jenkins/jobs/d1_integration_DEV2_MN_sid_functional/workspace/target/d1_integration-2.0-SNAPSHOT with includes "" and excludes ""
[INFO] Unpacking /var/lib/jenkins/.m2/repository/org/eclipse/jetty/orbit/javax.annotation/1.1.0.v201108011116/javax.annotation-1.1.0.v201108011116.jar to /var/lib/jenkins/jobs/d1_integration_DEV2_MN_sid_functional/workspace/target/d1_integration-2.0-SNAPSHOT with includes "" and excludes ""
[INFO] Unpacking /var/lib/jenkins/.m2/repository/org/eclipse/jetty/jetty-http/8.1.15.v20140411/jetty-http-8.1.15.v20140411.jar to /var/lib/jenkins/jobs/d1_integration_DEV2_MN_sid_functional/workspace/target/d1_integration-2.0-SNAPSHOT with includes "" and excludes ""
[INFO] Unpacking /var/lib/jenkins/.m2/repository/org/eclipse/jetty/jetty-util/8.1.15.v20140411/jetty-util-8.1.15.v20140411.jar to /var/lib/jenkins/jobs/d1_integration_DEV2_MN_sid_functional/workspace/target/d1_integration-2.0-SNAPSHOT with includes "" and excludes ""
[INFO] Unpacking /var/lib/jenkins/.m2/repository/org/eclipse/jetty/orbit/org.eclipse.jdt.core/3.7.1/org.eclipse.jdt.core-3.7.1.jar to /var/lib/jenkins/jobs/d1_integration_DEV2_MN_sid_functional/workspace/target/d1_integration-2.0-SNAPSHOT with includes "" and excludes ""
[INFO] Unpacking /var/lib/jenkins/.m2/repository/org/eclipse/jetty/orbit/javax.servlet/3.0.0.v201112011016/javax.servlet-3.0.0.v201112011016.jar to /var/lib/jenkins/jobs/d1_integration_DEV2_MN_sid_functional/workspace/target/d1_integration-2.0-SNAPSHOT with includes "" and excludes ""
[INFO] Unpacking /var/lib/jenkins/.m2/repository/org/eclipse/jetty/orbit/javax.el/2.2.0.v201108011116/javax.el-2.2.0.v201108011116.jar to /var/lib/jenkins/jobs/d1_integration_DEV2_MN_sid_functional/workspace/target/d1_integration-2.0-SNAPSHOT with includes "" and excludes ""
[INFO] 
[INFO] --- maven-war-plugin:2.1.1:war (default-war) @ d1_integration ---
[INFO] Packaging webapp
[INFO] Assembling webapp [d1_integration] in [/var/lib/jenkins/jobs/d1_integration_DEV2_MN_sid_functional/workspace/target/d1_integration-2.0-SNAPSHOT]
[INFO] Processing war project
[INFO] Copying webapp resources [/var/lib/jenkins/jobs/d1_integration_DEV2_MN_sid_functional/workspace/src/main/webapp]
[INFO] Webapp assembled in [430 msecs]
[INFO] Building war: /var/lib/jenkins/jobs/d1_integration_DEV2_MN_sid_functional/workspace/target/d1_integration-2.0-SNAPSHOT.war
[INFO] WEB-INF/web.xml already added, skipping
[INFO] 
[INFO] --- maven-antrun-plugin:1.3:run (execution2) @ d1_integration ---
[INFO] Executing tasks
     [move] Moving 1 file to /var/lib/jenkins/jobs/d1_integration_DEV2_MN_sid_functional/workspace/target
[INFO] Executed tasks
[INFO] 
[INFO] --- maven-failsafe-plugin:2.8.1:integration-test (integration-test) @ d1_integration ---
[INFO] Failsafe report directory: /var/lib/jenkins/jobs/d1_integration_DEV2_MN_sid_functional/workspace/target/failsafe-reports

-------------------------------------------------------
 T E S T S
-------------------------------------------------------
Running org.dataone.integration.it.testImplementations.SidMNTestImplementations
20151119-07:12:39: [INFO]: **************************************************** [org.dataone.integration.ContextAwareTestCaseDataone]
20151119-07:12:39: [INFO]: ***  context label:   DEV2 [org.dataone.integration.ContextAwareTestCaseDataone]
20151119-07:12:39: [INFO]: **************************************************** [org.dataone.integration.ContextAwareTestCaseDataone]
~~~ Context is from d1client.properties: https://cn-dev-2.test.dataone.org/cn
20151119-07:12:40: [INFO]: rest call info: GET https://cn-dev-2.test.dataone.org/cn/v1/node [org.dataone.client.rest.RestClient]
20151119-07:12:40: [INFO]: isNodeAlive for Node: https://cn-dev-2.test.dataone.org/cn ... [org.dataone.integration.ContextAwareTestCaseDataone]
20151119-07:12:40: [INFO]: ... calling node ... [org.dataone.integration.ContextAwareTestCaseDataone]
20151119-07:12:41: [INFO]: rest call info: GET https://cn-dev-2.test.dataone.org/cn [org.dataone.client.rest.RestClient]
20151119-07:12:41: [INFO]: ... called node [org.dataone.integration.ContextAwareTestCaseDataone]
20151119-07:12:41: [INFO]: *** Adding CN to list: cn-dev-2 [ https://cn-dev-2.test.dataone.org/cn ] [org.dataone.integration.ContextAwareTestCaseDataone]
20151119-07:12:41: [INFO]: isNodeAlive for Node: https://cn-dev-ucsb-2.test.dataone.org/cn ... [org.dataone.integration.ContextAwareTestCaseDataone]
20151119-07:12:41: [INFO]: ... calling node ... [org.dataone.integration.ContextAwareTestCaseDataone]
20151119-07:12:52: [INFO]: rest call info: GET https://cn-dev-ucsb-2.test.dataone.org/cn [org.dataone.client.rest.RestClient]
20151119-07:12:52: [INFO]: ... called node [org.dataone.integration.ContextAwareTestCaseDataone]
20151119-07:12:52: [WARN]: *** Failed to add CN to list: cn-dev-ucsb-2 [ https://cn-dev-ucsb-2.test.dataone.org/cn ].  Could not reach the node:GET https://cn-dev-2.test.dataone.org/cn/v1/node [org.dataone.integration.ContextAwareTestCaseDataone]
20151119-07:12:52: [INFO]: isNodeAlive for Node: https://cn-dev-unm-2.test.dataone.org/cn ... [org.dataone.integration.ContextAwareTestCaseDataone]
20151119-07:12:52: [INFO]: ... calling node ... [org.dataone.integration.ContextAwareTestCaseDataone]
20151119-07:12:52: [INFO]: rest call info: GET https://cn-dev-unm-2.test.dataone.org/cn [org.dataone.client.rest.RestClient]
20151119-07:12:52: [INFO]: ... called node [org.dataone.integration.ContextAwareTestCaseDataone]
20151119-07:12:52: [INFO]: *** Adding CN to list: cn-dev-unm-2 [ https://cn-dev-unm-2.test.dataone.org/cn ] [org.dataone.integration.ContextAwareTestCaseDataone]
20151119-07:12:52: [INFO]: isNodeAlive for Node: https://mn-dev-ucsb-1.test.dataone.org/metacat/d1/mn ... [org.dataone.integration.ContextAwareTestCaseDataone]
20151119-07:12:52: [INFO]: ... calling node ... [org.dataone.integration.ContextAwareTestCaseDataone]
20151119-07:12:54: [INFO]: rest call info: GET https://mn-dev-ucsb-1.test.dataone.org/metacat/d1/mn [org.dataone.client.rest.RestClient]
20151119-07:12:54: [INFO]: ... called node [org.dataone.integration.ContextAwareTestCaseDataone]
20151119-07:12:54: [INFO]: *** Adding MN to list: mn-dev-ucsb-1 [ https://mn-dev-ucsb-1.test.dataone.org/metacat/d1/mn ] [org.dataone.integration.ContextAwareTestCaseDataone]
20151119-07:12:54: [INFO]: isNodeAlive for Node: https://mn-dev-ucsb-2.test.dataone.org/metacat/d1/mn ... [org.dataone.integration.ContextAwareTestCaseDataone]
20151119-07:12:54: [INFO]: ... calling node ... [org.dataone.integration.ContextAwareTestCaseDataone]
20151119-07:12:55: [INFO]: rest call info: GET https://mn-dev-ucsb-2.test.dataone.org/metacat/d1/mn [org.dataone.client.rest.RestClient]
20151119-07:12:55: [INFO]: ... called node [org.dataone.integration.ContextAwareTestCaseDataone]
20151119-07:12:55: [INFO]: *** Adding MN to list: mn-dev-ucsb-2 [ https://mn-dev-ucsb-2.test.dataone.org/metacat/d1/mn ] [org.dataone.integration.ContextAwareTestCaseDataone]
20151119-07:12:55: [INFO]: isNodeAlive for Node: https://mn-dev-unm-1.test.dataone.org/metacat/d1/mn ... [org.dataone.integration.ContextAwareTestCaseDataone]
20151119-07:12:55: [INFO]: ... calling node ... [org.dataone.integration.ContextAwareTestCaseDataone]
20151119-07:12:55: [INFO]: rest call info: GET https://mn-dev-unm-1.test.dataone.org/metacat/d1/mn [org.dataone.client.rest.RestClient]
20151119-07:12:55: [INFO]: ... called node [org.dataone.integration.ContextAwareTestCaseDataone]
20151119-07:12:55: [INFO]: *** Adding MN to list: mn-dev-unm-1 [ https://mn-dev-unm-1.test.dataone.org/metacat/d1/mn ] [org.dataone.integration.ContextAwareTestCaseDataone]
20151119-07:12:55: [INFO]: isNodeAlive for Node: https://mn-dev-unm-2.test.dataone.org/metacat/d1/mn ... [org.dataone.integration.ContextAwareTestCaseDataone]
20151119-07:12:55: [INFO]: ... calling node ... [org.dataone.integration.ContextAwareTestCaseDataone]
20151119-07:12:56: [INFO]: rest call info: GET https://mn-dev-unm-2.test.dataone.org/metacat/d1/mn [org.dataone.client.rest.RestClient]
20151119-07:12:56: [INFO]: ... called node [org.dataone.integration.ContextAwareTestCaseDataone]
20151119-07:12:56: [INFO]: *** Adding MN to list: mn-dev-unm-2 [ https://mn-dev-unm-2.test.dataone.org/metacat/d1/mn ] [org.dataone.integration.ContextAwareTestCaseDataone]
20151119-07:12:56: [INFO]: trying to filter CN list for the round robin CN... original size: 2, includes nodes: [org.dataone.integration.ContextAwareTestCaseDataone]
20151119-07:12:56: [INFO]:     CN: https://cn-dev-2.test.dataone.org/cn "Development 2 Round Robin Router Node" [org.dataone.integration.ContextAwareTestCaseDataone]
20151119-07:12:56: [INFO]:     CN: https://cn-dev-unm-2.test.dataone.org/cn "UNM Development 2 Protocol Coordinating Node" [org.dataone.integration.ContextAwareTestCaseDataone]
20151119-07:12:56: [INFO]: excluding round robin CN: https://cn-dev-2.test.dataone.org/cn "Development 2 Round Robin Router Node" [org.dataone.integration.ContextAwareTestCaseDataone]
20151119-07:12:56: [INFO]: including CN: https://cn-dev-unm-2.test.dataone.org/cn "UNM Development 2 Protocol Coordinating Node" [org.dataone.integration.ContextAwareTestCaseDataone]
20151119-07:12:56: [INFO]: filtered CN list without round robin CN. size: 1, including nodes: [org.dataone.integration.ContextAwareTestCaseDataone]
20151119-07:12:56: [INFO]:     CN: https://cn-dev-unm-2.test.dataone.org/cn "UNM Development 2 Protocol Coordinating Node" [org.dataone.integration.ContextAwareTestCaseDataone]
20151119-07:12:56: [INFO]: **************************************************** [org.dataone.integration.ContextAwareTestCaseDataone]
20151119-07:12:56: [INFO]: Testing getPackage() method ...  [org.dataone.integration.ContextAwareTestCaseDataone]
20151119-07:12:56: [INFO]: Testing getPackage(), Case1 [org.dataone.integration.ContextAwareTestCaseDataone]
20151119-07:12:56: [INFO]: certificate directory: /etc/dataone/client/testClientCerts/ [org.dataone.integration.ContextAwareTestCaseDataone]
20151119-07:12:56: [INFO]: certificate filename: cnDevUNM2 [org.dataone.integration.ContextAwareTestCaseDataone]
20151119-07:12:56: [INFO]: client setup as Subject: CN=urn:node:cnDevUNM2,DC=dataone,DC=org [org.dataone.integration.ContextAwareTestCaseDataone]
20151119-07:12:57: [INFO]: rest call info: GET https://mn-dev-ucsb-1.test.dataone.org/metacat/d1/mn/v2/monitor/ping [org.dataone.client.rest.RestClient]
20151119-07:12:57: [INFO]: MN excluded from test: https://mn-dev-ucsb-1.test.dataone.org/metacat/d1/mn [org.dataone.integration.ContextAwareTestCaseDataone]
20151119-07:12:58: [INFO]: rest call info: GET https://mn-dev-ucsb-2.test.dataone.org/metacat/d1/mn/v2/monitor/ping [org.dataone.client.rest.RestClient]
20151119-07:12:58: [INFO]: MN included in test: https://mn-dev-ucsb-2.test.dataone.org/metacat/d1/mn [org.dataone.integration.ContextAwareTestCaseDataone]
20151119-07:12:58: [INFO]: rest call info: GET https://mn-dev-unm-1.test.dataone.org/metacat/d1/mn/v2/monitor/ping [org.dataone.client.rest.RestClient]
20151119-07:12:58: [INFO]: MN excluded from test: https://mn-dev-unm-1.test.dataone.org/metacat/d1/mn [org.dataone.integration.ContextAwareTestCaseDataone]
20151119-07:12:58: [INFO]: rest call info: GET https://mn-dev-unm-2.test.dataone.org/metacat/d1/mn/v2/monitor/ping [org.dataone.client.rest.RestClient]
20151119-07:12:58: [INFO]: MN included in test: https://mn-dev-unm-2.test.dataone.org/metacat/d1/mn [org.dataone.integration.ContextAwareTestCaseDataone]
20151119-07:12:58: [INFO]: certificate directory: /etc/dataone/client/testClientCerts/ [org.dataone.integration.ContextAwareTestCaseDataone]
20151119-07:12:58: [INFO]: certificate filename: testRightsHolder [org.dataone.integration.ContextAwareTestCaseDataone]
20151119-07:12:58: [INFO]: client setup as Subject: CN=testRightsHolder,DC=dataone,DC=org [org.dataone.integration.ContextAwareTestCaseDataone]
20151119-07:12:58: [INFO]: certificate directory: /etc/dataone/client/testClientCerts/ [org.dataone.integration.ContextAwareTestCaseDataone]
20151119-07:12:58: [INFO]: certificate filename: cnDevUNM2 [org.dataone.integration.ContextAwareTestCaseDataone]
20151119-07:12:58: [INFO]: client setup as Subject: CN=urn:node:cnDevUNM2,DC=dataone,DC=org [org.dataone.integration.ContextAwareTestCaseDataone]
20151119-07:12:58: [INFO]: refreshing objectFormatCache from cn: null [org.dataone.client.v2.formats.ObjectFormatCache]
20151119-07:12:59: [INFO]: rest call info: GET https://cn-dev-2.test.dataone.org/cn/v2/formats [org.dataone.client.rest.RestClient]
20151119-07:12:59: [INFO]: successful cache refresh from cn.listFormats() [org.dataone.client.v2.formats.ObjectFormatCache]
20151119-07:12:59: [INFO]: creating a test object.  pid = testPackage_scimeta_2015322231258777 on https://mn-dev-ucsb-2.test.dataone.org/metacat/d1/mn/v2 [org.dataone.integration.ContextAwareTestCaseDataone]
20151119-07:12:59: [INFO]: SystemMetadata for pid: testPackage_scimeta_2015322231258777
<?xml version="1.0" encoding="UTF-8"?><d1_v2.0:systemMetadata xmlns:d1_v2.0="http://ns.dataone.org/service/types/v2.0" xmlns:d1="http://ns.dataone.org/service/types/v1"><serialVersion>1</serialVersion><identifier>testPackage_scimeta_2015322231258777</identifier><formatId>eml://ecoinformatics.org/eml-2.0.1</formatId><size>17181</size><checksum algorithm="MD5">03ce09c6b4c3efc1681f3023402998a2</checksum><submitter>CN=urn:node:cnDevUNM2,DC=dataone,DC=org</submitter><rightsHolder>CN=testRightsHolder,DC=dataone,DC=org</rightsHolder><accessPolicy><allow><subject>CN=testRightsHolder,DC=dataone,DC=org</subject><permission>read</permission></allow></accessPolicy><dateUploaded>2015-11-19T07:12:59.120+00:00</dateUploaded><dateSysMetadataModified>2015-11-19T07:12:59.120+00:00</dateSysMetadataModified><originMemberNode>urn:node:mnDevUCSB2</originMemberNode><authoritativeMemberNode>urn:node:mnDevUCSB2</authoritativeMemberNode></d1_v2.0:systemMetadata> [org.dataone.integration.ContextAwareTestCaseDataone]
20151119-07:13:00: [INFO]: rest call info: POST https://mn-dev-ucsb-2.test.dataone.org/metacat/d1/mn/v2/object; MMP message has: ParamPart:pid = testPackage_scimeta_2015322231258777; FilePart:object = /tmp/mmp.output.1310834788875634475.tmp (17181 bytes); FilePart:sysmeta = /tmp/mmp.output.730215230477011782.tmp (950 bytes);  [org.dataone.client.rest.RestClient]
20151119-07:13:00: [INFO]: object created.  pid = testPackage_scimeta_2015322231258777 [org.dataone.integration.ContextAwareTestCaseDataone]
20151119-07:13:00: [INFO]: certificate directory: /etc/dataone/client/testClientCerts/ [org.dataone.integration.ContextAwareTestCaseDataone]
20151119-07:13:00: [INFO]: certificate filename: cnDevUNM2 [org.dataone.integration.ContextAwareTestCaseDataone]
20151119-07:13:00: [INFO]: client setup as Subject: CN=urn:node:cnDevUNM2,DC=dataone,DC=org [org.dataone.integration.ContextAwareTestCaseDataone]
20151119-07:13:00: [INFO]: creating a test object.  pid = MNCallAdapterTierTests.mn-dev-ucsb-2.201532223130490.testPackage_dataObj_ on https://mn-dev-ucsb-2.test.dataone.org/metacat/d1/mn/v2 [org.dataone.integration.ContextAwareTestCaseDataone]
20151119-07:13:00: [INFO]: SystemMetadata for pid: MNCallAdapterTierTests.mn-dev-ucsb-2.201532223130490.testPackage_dataObj_
<?xml version="1.0" encoding="UTF-8"?><d1_v2.0:systemMetadata xmlns:d1_v2.0="http://ns.dataone.org/service/types/v2.0" xmlns:d1="http://ns.dataone.org/service/types/v1"><serialVersion>1</serialVersion><identifier>MNCallAdapterTierTests.mn-dev-ucsb-2.201532223130490.testPackage_dataObj_</identifier><formatId>eml://ecoinformatics.org/eml-2.0.1</formatId><size>17181</size><checksum algorithm="MD5">03ce09c6b4c3efc1681f3023402998a2</checksum><submitter>CN=urn:node:cnDevUNM2,DC=dataone,DC=org</submitter><rightsHolder>CN=testRightsHolder,DC=dataone,DC=org</rightsHolder><accessPolicy><allow><subject>CN=testRightsHolder,DC=dataone,DC=org</subject><permission>read</permission></allow></accessPolicy><dateUploaded>2015-11-19T07:13:00.515+00:00</dateUploaded><dateSysMetadataModified>2015-11-19T07:13:00.515+00:00</dateSysMetadataModified><originMemberNode>urn:node:mnDevUCSB2</originMemberNode><authoritativeMemberNode>urn:node:mnDevUCSB2</authoritativeMemberNode></d1_v2.0:systemMetadata> [org.dataone.integration.ContextAwareTestCaseDataone]
20151119-07:13:31: [INFO]: rest call info: POST https://mn-dev-ucsb-2.test.dataone.org/metacat/d1/mn/v2/object; MMP message has: ParamPart:pid = MNCallAdapterTierTests.mn-dev-ucsb-2.201532223130490.testPackage_dataObj_; FilePart:object = /tmp/mmp.output.7435569084116270120.tmp (17181 bytes); FilePart:sysmeta = /tmp/mmp.output.7073606425894479910.tmp (987 bytes);  [org.dataone.client.rest.RestClient]
org.dataone.client.exception.ClientSideException: Unable to create test object!/class org.dataone.client.exception.ClientSideException: /Read timed out
	at org.dataone.integration.ContextAwareTestCaseDataone.createTestObject(ContextAwareTestCaseDataone.java:1513)
	at org.dataone.integration.ContextAwareTestCaseDataone.createTestObject(ContextAwareTestCaseDataone.java:1334)
	at org.dataone.integration.ContextAwareTestCaseDataone.createTestObject(ContextAwareTestCaseDataone.java:1287)
	at org.dataone.integration.ContextAwareTestCaseDataone.createTestObject(ContextAwareTestCaseDataone.java:1246)
	at org.dataone.integration.ContextAwareTestCaseDataone.createTestObject(ContextAwareTestCaseDataone.java:1259)
	at org.dataone.integration.ContextAwareTestCaseDataone.createTestObject(ContextAwareTestCaseDataone.java:1185)
	at org.dataone.integration.ContextAwareTestCaseDataone.createTestObject(ContextAwareTestCaseDataone.java:1206)
	at org.dataone.integration.ContextAwareTestCaseDataone.createPackage(ContextAwareTestCaseDataone.java:1856)
	at org.dataone.integration.it.testImplementations.SidMNTestImplementations.setupResourcePkgMNCase1(SidMNTestImplementations.java:387)
	at sun.reflect.NativeMethodAccessorImpl.invoke0(Native Method)
	at sun.reflect.NativeMethodAccessorImpl.invoke(NativeMethodAccessorImpl.java:57)
	at sun.reflect.DelegatingMethodAccessorImpl.invoke(DelegatingMethodAccessorImpl.java:43)
	at java.lang.reflect.Method.invoke(Method.java:606)
	at org.dataone.integration.it.testImplementations.SidMNTestImplementations.testGetPackage(SidMNTestImplementations.java:629)
	at sun.reflect.NativeMethodAccessorImpl.invoke0(Native Method)
	at sun.reflect.NativeMethodAccessorImpl.invoke(NativeMethodAccessorImpl.java:57)
	at sun.reflect.DelegatingMethodAccessorImpl.invoke(DelegatingMethodAccessorImpl.java:43)
	at java.lang.reflect.Method.invoke(Method.java:606)
	at org.junit.runners.model.FrameworkMethod$1.runReflectiveCall(FrameworkMethod.java:44)
	at org.junit.internal.runners.model.ReflectiveCallable.run(ReflectiveCallable.java:15)
	at org.junit.runners.model.FrameworkMethod.invokeExplosively(FrameworkMethod.java:41)
	at org.junit.internal.runners.statements.InvokeMethod.evaluate(InvokeMethod.java:20)
	at org.junit.rules.Verifier$1.evaluate(Verifier.java:34)
	at org.junit.internal.runners.statements.RunBefores.evaluate(RunBefores.java:28)
	at org.junit.runners.BlockJUnit4ClassRunner.runChild(BlockJUnit4ClassRunner.java:76)
	at org.junit.runners.BlockJUnit4ClassRunner.runChild(BlockJUnit4ClassRunner.java:50)
	at org.junit.runners.ParentRunner$3.run(ParentRunner.java:193)
	at org.junit.runners.ParentRunner$1.schedule(ParentRunner.java:52)
	at org.junit.runners.ParentRunner.runChildren(ParentRunner.java:191)
	at org.junit.runners.ParentRunner.access$000(ParentRunner.java:42)
	at org.junit.runners.ParentRunner$2.evaluate(ParentRunner.java:184)
	at org.junit.runners.ParentRunner.run(ParentRunner.java:236)
	at org.apache.maven.surefire.junit4.JUnit4TestSet.execute(JUnit4TestSet.java:53)
	at org.apache.maven.surefire.junit4.JUnit4Provider.executeTestSet(JUnit4Provider.java:119)
	at org.apache.maven.surefire.junit4.JUnit4Provider.invoke(JUnit4Provider.java:101)
	at sun.reflect.NativeMethodAccessorImpl.invoke0(Native Method)
	at sun.reflect.NativeMethodAccessorImpl.invoke(NativeMethodAccessorImpl.java:57)
	at sun.reflect.DelegatingMethodAccessorImpl.invoke(DelegatingMethodAccessorImpl.java:43)
	at java.lang.reflect.Method.invoke(Method.java:606)
	at org.apache.maven.surefire.booter.ProviderFactory$ClassLoaderProxy.invoke(ProviderFactory.java:103)
	at com.sun.proxy.$Proxy0.invoke(Unknown Source)
	at org.apache.maven.surefire.booter.SurefireStarter.invokeProvider(SurefireStarter.java:150)
	at org.apache.maven.surefire.booter.SurefireStarter.runSuitesInProcess(SurefireStarter.java:91)
	at org.apache.maven.surefire.booter.ForkedBooter.main(ForkedBooter.java:69)
Caused by: org.dataone.service.exceptions.ServiceFailure: class org.dataone.client.exception.ClientSideException: /Read timed out
	at org.dataone.client.rest.HttpMultipartRestClient.doPostRequest(HttpMultipartRestClient.java:460)
	at org.dataone.client.v2.impl.MultipartMNode.create(MultipartMNode.java:495)
	at org.dataone.integration.adapters.CommonCallAdapter.create(CommonCallAdapter.java:505)
	at org.dataone.integration.ContextAwareTestCaseDataone.createTestObject(ContextAwareTestCaseDataone.java:1504)
	... 43 more
Caused by: org.dataone.client.exception.ClientSideException: /Read timed out
	... 47 more
Caused by: java.net.SocketTimeoutException: Read timed out
	at java.net.SocketInputStream.socketRead0(Native Method)
	at java.net.SocketInputStream.read(SocketInputStream.java:152)
	at java.net.SocketInputStream.read(SocketInputStream.java:122)
	at sun.security.ssl.InputRecord.readFully(InputRecord.java:442)
	at sun.security.ssl.InputRecord.read(InputRecord.java:480)
	at sun.security.ssl.SSLSocketImpl.readRecord(SSLSocketImpl.java:946)
	at sun.security.ssl.SSLSocketImpl.readDataRecord(SSLSocketImpl.java:903)
	at sun.security.ssl.AppInputStream.read(AppInputStream.java:102)
	at org.apache.http.impl.io.SessionInputBufferImpl.streamRead(SessionInputBufferImpl.java:136)
	at org.apache.http.impl.io.SessionInputBufferImpl.fillBuffer(SessionInputBufferImpl.java:152)
	at org.apache.http.impl.io.SessionInputBufferImpl.readLine(SessionInputBufferImpl.java:270)
	at org.apache.http.impl.conn.DefaultHttpResponseParser.parseHead(DefaultHttpResponseParser.java:140)
	at org.apache.http.impl.conn.DefaultHttpResponseParser.parseHead(DefaultHttpResponseParser.java:57)
	at org.apache.http.impl.io.AbstractMessageParser.parse(AbstractMessageParser.java:260)
	at org.apache.http.impl.DefaultBHttpClientConnection.receiveResponseHeader(DefaultBHttpClientConnection.java:161)
	at sun.reflect.GeneratedMethodAccessor9.invoke(Unknown Source)
	at sun.reflect.DelegatingMethodAccessorImpl.invoke(DelegatingMethodAccessorImpl.java:43)
	at java.lang.reflect.Method.invoke(Method.java:606)
	at org.apache.http.impl.conn.CPoolProxy.invoke(CPoolProxy.java:138)
	at com.sun.proxy.$Proxy9.receiveResponseHeader(Unknown Source)
	at org.apache.http.protocol.HttpRequestExecutor.doReceiveResponse(HttpRequestExecutor.java:271)
	at org.apache.http.protocol.HttpRequestExecutor.execute(HttpRequestExecutor.java:123)
	at org.apache.http.impl.execchain.MainClientExec.execute(MainClientExec.java:254)
	at org.apache.http.impl.execchain.ProtocolExec.execute(ProtocolExec.java:195)
	at org.apache.http.impl.execchain.RetryExec.execute(RetryExec.java:86)
	at org.apache.http.impl.execchain.RedirectExec.execute(RedirectExec.java:108)
	at org.apache.http.impl.client.InternalHttpClient.doExecute(InternalHttpClient.java:186)
	at org.apache.http.impl.client.CloseableHttpClient.execute(CloseableHttpClient.java:82)
	at org.apache.http.impl.client.CloseableHttpClient.execute(CloseableHttpClient.java:106)
	at org.apache.http.impl.client.CloseableHttpClient.execute(CloseableHttpClient.java:57)
	at org.dataone.client.rest.RestClient.doRequest(RestClient.java:294)
	at org.dataone.client.rest.RestClient.doRequestMMBody(RestClient.java:272)
	at org.dataone.client.rest.RestClient.doPostRequest(RestClient.java:192)
	at org.dataone.client.rest.HttpMultipartRestClient.doPostRequest(HttpMultipartRestClient.java:453)
	... 46 more
20151119-07:13:31: [INFO]: **************************************************** [org.dataone.integration.ContextAwareTestCaseDataone]
20151119-07:13:31: [INFO]: ***  context label:   DEV2 [org.dataone.integration.ContextAwareTestCaseDataone]
20151119-07:13:31: [INFO]: **************************************************** [org.dataone.integration.ContextAwareTestCaseDataone]
20151119-07:13:31: [INFO]: **************************************************** [org.dataone.integration.ContextAwareTestCaseDataone]
20151119-07:13:31: [INFO]: Testing update() method ...  [org.dataone.integration.ContextAwareTestCaseDataone]
20151119-07:13:31: [INFO]: Testing update(), Case1 [org.dataone.integration.ContextAwareTestCaseDataone]
20151119-07:13:32: [INFO]: rest call info: GET https://mn-dev-ucsb-1.test.dataone.org/metacat/d1/mn/v2/monitor/ping [org.dataone.client.rest.RestClient]
20151119-07:13:32: [INFO]: MN excluded from test: https://mn-dev-ucsb-1.test.dataone.org/metacat/d1/mn [org.dataone.integration.ContextAwareTestCaseDataone]
20151119-07:13:33: [INFO]: rest call info: GET https://mn-dev-ucsb-2.test.dataone.org/metacat/d1/mn/v2/monitor/ping [org.dataone.client.rest.RestClient]
20151119-07:13:33: [INFO]: MN included in test: https://mn-dev-ucsb-2.test.dataone.org/metacat/d1/mn [org.dataone.integration.ContextAwareTestCaseDataone]
20151119-07:13:34: [INFO]: rest call info: GET https://mn-dev-unm-1.test.dataone.org/metacat/d1/mn/v2/monitor/ping [org.dataone.client.rest.RestClient]
20151119-07:13:34: [INFO]: MN excluded from test: https://mn-dev-unm-1.test.dataone.org/metacat/d1/mn [org.dataone.integration.ContextAwareTestCaseDataone]
20151119-07:13:34: [INFO]: rest call info: GET https://mn-dev-unm-2.test.dataone.org/metacat/d1/mn/v2/monitor/ping [org.dataone.client.rest.RestClient]
20151119-07:13:34: [INFO]: MN included in test: https://mn-dev-unm-2.test.dataone.org/metacat/d1/mn [org.dataone.integration.ContextAwareTestCaseDataone]
20151119-07:13:36: [INFO]: rest call info: GET https://mn-dev-ucsb-2.test.dataone.org/metacat/d1/mn/v2/node [org.dataone.client.rest.RestClient]
20151119-07:13:36: [INFO]: CREATING test object... pid: P1_2015322231336171 with a sid: S1_2015322231336173 obsoletes: null obsoletedBy: null [org.dataone.integration.ContextAwareTestCaseDataone]
20151119-07:13:36: [INFO]: certificate directory: /etc/dataone/client/testClientCerts/ [org.dataone.integration.ContextAwareTestCaseDataone]
20151119-07:13:36: [INFO]: certificate filename: cnDevUNM2 [org.dataone.integration.ContextAwareTestCaseDataone]
20151119-07:13:36: [INFO]: client setup as Subject: CN=urn:node:cnDevUNM2,DC=dataone,DC=org [org.dataone.integration.ContextAwareTestCaseDataone]
20151119-07:13:36: [INFO]: creating a test object.  pid = P1_2015322231336171 on https://mn-dev-ucsb-2.test.dataone.org/metacat/d1/mn/v2 [org.dataone.integration.ContextAwareTestCaseDataone]
20151119-07:13:36: [INFO]: SystemMetadata for pid: P1_2015322231336171
<?xml version="1.0" encoding="UTF-8"?><d1_v2.0:systemMetadata xmlns:d1_v2.0="http://ns.dataone.org/service/types/v2.0" xmlns:d1="http://ns.dataone.org/service/types/v1"><serialVersion>1</serialVersion><identifier>P1_2015322231336171</identifier><formatId>eml://ecoinformatics.org/eml-2.0.1</formatId><size>17181</size><checksum algorithm="MD5">03ce09c6b4c3efc1681f3023402998a2</checksum><submitter>CN=urn:node:cnDevUNM2,DC=dataone,DC=org</submitter><rightsHolder>CN=testRightsHolder,DC=dataone,DC=org</rightsHolder><accessPolicy><allow><subject>public</subject><permission>read</permission></allow></accessPolicy><dateUploaded>2015-11-19T07:13:36.193+00:00</dateUploaded><dateSysMetadataModified>2015-11-19T07:13:36.193+00:00</dateSysMetadataModified><originMemberNode>urn:node:mnDevUCSB2</originMemberNode><authoritativeMemberNode>urn:node:mnDevUCSB2</authoritativeMemberNode><seriesId>S1_2015322231336173</seriesId></d1_v2.0:systemMetadata> [org.dataone.integration.ContextAwareTestCaseDataone]
20151119-07:14:06: [INFO]: rest call info: POST https://mn-dev-ucsb-2.test.dataone.org/metacat/d1/mn/v2/object; MMP message has: ParamPart:pid = P1_2015322231336171; FilePart:object = /tmp/mmp.output.6451731421375891950.tmp (17181 bytes); FilePart:sysmeta = /tmp/mmp.output.8146437680410265079.tmp (942 bytes);  [org.dataone.client.rest.RestClient]
java.lang.reflect.InvocationTargetException
	at sun.reflect.NativeMethodAccessorImpl.invoke0(Native Method)
	at sun.reflect.NativeMethodAccessorImpl.invoke(NativeMethodAccessorImpl.java:57)
	at sun.reflect.DelegatingMethodAccessorImpl.invoke(DelegatingMethodAccessorImpl.java:43)
	at java.lang.reflect.Method.invoke(Method.java:606)
	at org.dataone.integration.it.testImplementations.SidMNTestImplementations.testUpdate(SidMNTestImplementations.java:740)
	at sun.reflect.NativeMethodAccessorImpl.invoke0(Native Method)
	at sun.reflect.NativeMethodAccessorImpl.invoke(NativeMethodAccessorImpl.java:57)
	at sun.reflect.DelegatingMethodAccessorImpl.invoke(DelegatingMethodAccessorImpl.java:43)
	at java.lang.reflect.Method.invoke(Method.java:606)
	at org.junit.runners.model.FrameworkMethod$1.runReflectiveCall(FrameworkMethod.java:44)
	at org.junit.internal.runners.model.ReflectiveCallable.run(ReflectiveCallable.java:15)
	at org.junit.runners.model.FrameworkMethod.invokeExplosively(FrameworkMethod.java:41)
	at org.junit.internal.runners.statements.InvokeMethod.evaluate(InvokeMethod.java:20)
	at org.junit.rules.Verifier$1.evaluate(Verifier.java:34)
	at org.junit.internal.runners.statements.RunBefores.evaluate(RunBefores.java:28)
	at org.junit.runners.BlockJUnit4ClassRunner.runChild(BlockJUnit4ClassRunner.java:76)
	at org.junit.runners.BlockJUnit4ClassRunner.runChild(BlockJUnit4ClassRunner.java:50)
	at org.junit.runners.ParentRunner$3.run(ParentRunner.java:193)
	at org.junit.runners.ParentRunner$1.schedule(ParentRunner.java:52)
	at org.junit.runners.ParentRunner.runChildren(ParentRunner.java:191)
	at org.junit.runners.ParentRunner.access$000(ParentRunner.java:42)
	at org.junit.runners.ParentRunner$2.evaluate(ParentRunner.java:184)
	at org.junit.runners.ParentRunner.run(ParentRunner.java:236)
	at org.apache.maven.surefire.junit4.JUnit4TestSet.execute(JUnit4TestSet.java:53)
	at org.apache.maven.surefire.junit4.JUnit4Provider.executeTestSet(JUnit4Provider.java:119)
	at org.apache.maven.surefire.junit4.JUnit4Provider.invoke(JUnit4Provider.java:101)
	at sun.reflect.NativeMethodAccessorImpl.invoke0(Native Method)
	at sun.reflect.NativeMethodAccessorImpl.invoke(NativeMethodAccessorImpl.java:57)
	at sun.reflect.DelegatingMethodAccessorImpl.invoke(DelegatingMethodAccessorImpl.java:43)
	at java.lang.reflect.Method.invoke(Method.java:606)
	at org.apache.maven.surefire.booter.ProviderFactory$ClassLoaderProxy.invoke(ProviderFactory.java:103)
	at com.sun.proxy.$Proxy0.invoke(Unknown Source)
	at org.apache.maven.surefire.booter.SurefireStarter.invokeProvider(SurefireStarter.java:150)
	at org.apache.maven.surefire.booter.SurefireStarter.runSuitesInProcess(SurefireStarter.java:91)
	at org.apache.maven.surefire.booter.ForkedBooter.main(ForkedBooter.java:69)
Caused by: org.dataone.client.exception.ClientSideException: Unable to create test object!/class org.dataone.client.exception.ClientSideException: /Read timed out
	at org.dataone.integration.ContextAwareTestCaseDataone.createTestObject(ContextAwareTestCaseDataone.java:1513)
	at org.dataone.integration.ContextAwareTestCaseDataone.createTestObject(ContextAwareTestCaseDataone.java:1345)
	at org.dataone.integration.it.testImplementations.SidCommonTestImplementations.createTestObject(SidCommonTestImplementations.java:216)
	at org.dataone.integration.it.testImplementations.SidMNTestImplementations.setupMNCase1(SidMNTestImplementations.java:88)
	... 35 more
Caused by: org.dataone.service.exceptions.ServiceFailure: class org.dataone.client.exception.ClientSideException: /Read timed out
	at org.dataone.client.rest.HttpMultipartRestClient.doPostRequest(HttpMultipartRestClient.java:460)
	at org.dataone.client.v2.impl.MultipartMNode.create(MultipartMNode.java:495)
	at org.dataone.integration.adapters.CommonCallAdapter.create(CommonCallAdapter.java:505)
	at org.dataone.integration.ContextAwareTestCaseDataone.createTestObject(ContextAwareTestCaseDataone.java:1504)
	... 38 more
Caused by: org.dataone.client.exception.ClientSideException: /Read timed out
	... 42 more
Caused by: java.net.SocketTimeoutException: Read timed out
	at java.net.SocketInputStream.socketRead0(Native Method)
	at java.net.SocketInputStream.read(SocketInputStream.java:152)
	at java.net.SocketInputStream.read(SocketInputStream.java:122)
	at sun.security.ssl.InputRecord.readFully(InputRecord.java:442)
	at sun.security.ssl.InputRecord.read(InputRecord.java:480)
	at sun.security.ssl.SSLSocketImpl.readRecord(SSLSocketImpl.java:946)
	at sun.security.ssl.SSLSocketImpl.readDataRecord(SSLSocketImpl.java:903)
	at sun.security.ssl.AppInputStream.read(AppInputStream.java:102)
	at org.apache.http.impl.io.SessionInputBufferImpl.streamRead(SessionInputBufferImpl.java:136)
	at org.apache.http.impl.io.SessionInputBufferImpl.fillBuffer(SessionInputBufferImpl.java:152)
	at org.apache.http.impl.io.SessionInputBufferImpl.readLine(SessionInputBufferImpl.java:270)
	at org.apache.http.impl.conn.DefaultHttpResponseParser.parseHead(DefaultHttpResponseParser.java:140)
	at org.apache.http.impl.conn.DefaultHttpResponseParser.parseHead(DefaultHttpResponseParser.java:57)
	at org.apache.http.impl.io.AbstractMessageParser.parse(AbstractMessageParser.java:260)
	at org.apache.http.impl.DefaultBHttpClientConnection.receiveResponseHeader(DefaultBHttpClientConnection.java:161)
	at sun.reflect.GeneratedMethodAccessor9.invoke(Unknown Source)
	at sun.reflect.DelegatingMethodAccessorImpl.invoke(DelegatingMethodAccessorImpl.java:43)
	at java.lang.reflect.Method.invoke(Method.java:606)
	at org.apache.http.impl.conn.CPoolProxy.invoke(CPoolProxy.java:138)
	at com.sun.proxy.$Proxy9.receiveResponseHeader(Unknown Source)
	at org.apache.http.protocol.HttpRequestExecutor.doReceiveResponse(HttpRequestExecutor.java:271)
	at org.apache.http.protocol.HttpRequestExecutor.execute(HttpRequestExecutor.java:123)
	at org.apache.http.impl.execchain.MainClientExec.execute(MainClientExec.java:254)
	at org.apache.http.impl.execchain.ProtocolExec.execute(ProtocolExec.java:195)
	at org.apache.http.impl.execchain.RetryExec.execute(RetryExec.java:86)
	at org.apache.http.impl.execchain.RedirectExec.execute(RedirectExec.java:108)
	at org.apache.http.impl.client.InternalHttpClient.doExecute(InternalHttpClient.java:186)
	at org.apache.http.impl.client.CloseableHttpClient.execute(CloseableHttpClient.java:82)
	at org.apache.http.impl.client.CloseableHttpClient.execute(CloseableHttpClient.java:106)
	at org.apache.http.impl.client.CloseableHttpClient.execute(CloseableHttpClient.java:57)
	at org.dataone.client.rest.RestClient.doRequest(RestClient.java:294)
	at org.dataone.client.rest.RestClient.doRequestMMBody(RestClient.java:272)
	at org.dataone.client.rest.RestClient.doPostRequest(RestClient.java:192)
	at org.dataone.client.rest.HttpMultipartRestClient.doPostRequest(HttpMultipartRestClient.java:453)
	... 41 more
20151119-07:14:06: [INFO]: **************************************************** [org.dataone.integration.ContextAwareTestCaseDataone]
20151119-07:14:06: [INFO]: ***  context label:   DEV2 [org.dataone.integration.ContextAwareTestCaseDataone]
20151119-07:14:06: [INFO]: **************************************************** [org.dataone.integration.ContextAwareTestCaseDataone]
20151119-07:14:06: [INFO]: **************************************************** [org.dataone.integration.ContextAwareTestCaseDataone]
20151119-07:14:06: [INFO]: testSidReuse() method ...  [org.dataone.integration.ContextAwareTestCaseDataone]
20151119-07:14:07: [INFO]: rest call info: GET https://mn-dev-ucsb-1.test.dataone.org/metacat/d1/mn/v2/monitor/ping [org.dataone.client.rest.RestClient]
20151119-07:14:07: [INFO]: MN excluded from test: https://mn-dev-ucsb-1.test.dataone.org/metacat/d1/mn [org.dataone.integration.ContextAwareTestCaseDataone]
20151119-07:14:08: [INFO]: rest call info: GET https://mn-dev-ucsb-2.test.dataone.org/metacat/d1/mn/v2/monitor/ping [org.dataone.client.rest.RestClient]
20151119-07:14:08: [INFO]: MN included in test: https://mn-dev-ucsb-2.test.dataone.org/metacat/d1/mn [org.dataone.integration.ContextAwareTestCaseDataone]
20151119-07:14:09: [INFO]: rest call info: GET https://mn-dev-unm-1.test.dataone.org/metacat/d1/mn/v2/monitor/ping [org.dataone.client.rest.RestClient]
20151119-07:14:09: [INFO]: MN excluded from test: https://mn-dev-unm-1.test.dataone.org/metacat/d1/mn [org.dataone.integration.ContextAwareTestCaseDataone]
20151119-07:14:09: [INFO]: rest call info: GET https://mn-dev-unm-2.test.dataone.org/metacat/d1/mn/v2/monitor/ping [org.dataone.client.rest.RestClient]
20151119-07:14:09: [INFO]: MN included in test: https://mn-dev-unm-2.test.dataone.org/metacat/d1/mn [org.dataone.integration.ContextAwareTestCaseDataone]
20151119-07:14:09: [INFO]: CREATING test object... pid: P1_201532223149418 with a sid: S1_201532223149425 obsoletes: null obsoletedBy: P2_201532223149421 [org.dataone.integration.ContextAwareTestCaseDataone]
20151119-07:14:09: [INFO]: certificate directory: /etc/dataone/client/testClientCerts/ [org.dataone.integration.ContextAwareTestCaseDataone]
20151119-07:14:09: [INFO]: certificate filename: cnDevUNM2 [org.dataone.integration.ContextAwareTestCaseDataone]
20151119-07:14:09: [INFO]: client setup as Subject: CN=urn:node:cnDevUNM2,DC=dataone,DC=org [org.dataone.integration.ContextAwareTestCaseDataone]
20151119-07:14:09: [WARN]: Unable to find a valid authoritative MN to use for the object: P1_201532223149418 [org.dataone.integration.ContextAwareTestCaseDataone]
20151119-07:14:09: [INFO]: creating a test object.  pid = P1_201532223149418 on https://mn-dev-ucsb-2.test.dataone.org/metacat/d1/mn/v2 [org.dataone.integration.ContextAwareTestCaseDataone]
20151119-07:14:09: [INFO]: SystemMetadata for pid: P1_201532223149418
<?xml version="1.0" encoding="UTF-8"?><d1_v2.0:systemMetadata xmlns:d1_v2.0="http://ns.dataone.org/service/types/v2.0" xmlns:d1="http://ns.dataone.org/service/types/v1"><serialVersion>1</serialVersion><identifier>P1_201532223149418</identifier><formatId>eml://ecoinformatics.org/eml-2.0.1</formatId><size>17181</size><checksum algorithm="MD5">03ce09c6b4c3efc1681f3023402998a2</checksum><submitter>CN=urn:node:cnDevUNM2,DC=dataone,DC=org</submitter><rightsHolder>CN=testRightsHolder,DC=dataone,DC=org</rightsHolder><accessPolicy><allow><subject>public</subject><permission>read</permission></allow></accessPolicy><dateUploaded>2015-11-19T07:14:09.449+00:00</dateUploaded><dateSysMetadataModified>2015-11-19T07:14:09.449+00:00</dateSysMetadataModified><originMemberNode>bogusAuthoritativeNode</originMemberNode><authoritativeMemberNode>bogusAuthoritativeNode</authoritativeMemberNode><seriesId>S1_201532223149425</seriesId></d1_v2.0:systemMetadata> [org.dataone.integration.ContextAwareTestCaseDataone]
20151119-07:14:40: [INFO]: rest call info: POST https://mn-dev-ucsb-2.test.dataone.org/metacat/d1/mn/v2/object; MMP message has: ParamPart:pid = P1_201532223149418; FilePart:object = /tmp/mmp.output.1756790233368369603.tmp (17181 bytes); FilePart:sysmeta = /tmp/mmp.output.7534078206680998176.tmp (946 bytes);  [org.dataone.client.rest.RestClient]
20151119-07:14:40: [INFO]: **************************************************** [org.dataone.integration.ContextAwareTestCaseDataone]
20151119-07:14:40: [INFO]: ***  context label:   DEV2 [org.dataone.integration.ContextAwareTestCaseDataone]
20151119-07:14:40: [INFO]: **************************************************** [org.dataone.integration.ContextAwareTestCaseDataone]
20151119-07:14:40: [INFO]: **************************************************** [org.dataone.integration.ContextAwareTestCaseDataone]
20151119-07:14:40: [INFO]: testSidReuseDiffChain() method ...  [org.dataone.integration.ContextAwareTestCaseDataone]
20151119-07:14:41: [INFO]: rest call info: GET https://mn-dev-ucsb-1.test.dataone.org/metacat/d1/mn/v2/monitor/ping [org.dataone.client.rest.RestClient]
20151119-07:14:41: [INFO]: MN excluded from test: https://mn-dev-ucsb-1.test.dataone.org/metacat/d1/mn [org.dataone.integration.ContextAwareTestCaseDataone]
20151119-07:14:42: [INFO]: rest call info: GET https://mn-dev-ucsb-2.test.dataone.org/metacat/d1/mn/v2/monitor/ping [org.dataone.client.rest.RestClient]
20151119-07:14:42: [INFO]: MN included in test: https://mn-dev-ucsb-2.test.dataone.org/metacat/d1/mn [org.dataone.integration.ContextAwareTestCaseDataone]
20151119-07:14:43: [INFO]: rest call info: GET https://mn-dev-unm-1.test.dataone.org/metacat/d1/mn/v2/monitor/ping [org.dataone.client.rest.RestClient]
20151119-07:14:43: [INFO]: MN excluded from test: https://mn-dev-unm-1.test.dataone.org/metacat/d1/mn [org.dataone.integration.ContextAwareTestCaseDataone]
20151119-07:14:43: [INFO]: rest call info: GET https://mn-dev-unm-2.test.dataone.org/metacat/d1/mn/v2/monitor/ping [org.dataone.client.rest.RestClient]
20151119-07:14:43: [INFO]: MN included in test: https://mn-dev-unm-2.test.dataone.org/metacat/d1/mn [org.dataone.integration.ContextAwareTestCaseDataone]
20151119-07:14:43: [INFO]: CREATING test object... pid: P1_2015322231443424 with a sid: S1_2015322231443433 obsoletes: null obsoletedBy: P2_2015322231443426 [org.dataone.integration.ContextAwareTestCaseDataone]
20151119-07:14:43: [INFO]: certificate directory: /etc/dataone/client/testClientCerts/ [org.dataone.integration.ContextAwareTestCaseDataone]
20151119-07:14:43: [INFO]: certificate filename: cnDevUNM2 [org.dataone.integration.ContextAwareTestCaseDataone]
20151119-07:14:43: [INFO]: client setup as Subject: CN=urn:node:cnDevUNM2,DC=dataone,DC=org [org.dataone.integration.ContextAwareTestCaseDataone]
20151119-07:14:43: [WARN]: Unable to find a valid authoritative MN to use for the object: P1_2015322231443424 [org.dataone.integration.ContextAwareTestCaseDataone]
20151119-07:14:43: [INFO]: creating a test object.  pid = P1_2015322231443424 on https://mn-dev-ucsb-2.test.dataone.org/metacat/d1/mn/v2 [org.dataone.integration.ContextAwareTestCaseDataone]
20151119-07:14:43: [INFO]: SystemMetadata for pid: P1_2015322231443424
<?xml version="1.0" encoding="UTF-8"?><d1_v2.0:systemMetadata xmlns:d1_v2.0="http://ns.dataone.org/service/types/v2.0" xmlns:d1="http://ns.dataone.org/service/types/v1"><serialVersion>1</serialVersion><identifier>P1_2015322231443424</identifier><formatId>eml://ecoinformatics.org/eml-2.0.1</formatId><size>17181</size><checksum algorithm="MD5">03ce09c6b4c3efc1681f3023402998a2</checksum><submitter>CN=urn:node:cnDevUNM2,DC=dataone,DC=org</submitter><rightsHolder>CN=testRightsHolder,DC=dataone,DC=org</rightsHolder><accessPolicy><allow><subject>public</subject><permission>read</permission></allow></accessPolicy><dateUploaded>2015-11-19T07:14:43.457+00:00</dateUploaded><dateSysMetadataModified>2015-11-19T07:14:43.457+00:00</dateSysMetadataModified><originMemberNode>bogusAuthoritativeNode</originMemberNode><authoritativeMemberNode>bogusAuthoritativeNode</authoritativeMemberNode><seriesId>S1_2015322231443433</seriesId></d1_v2.0:systemMetadata> [org.dataone.integration.ContextAwareTestCaseDataone]
20151119-07:15:13: [INFO]: rest call info: POST https://mn-dev-ucsb-2.test.dataone.org/metacat/d1/mn/v2/object; MMP message has: ParamPart:pid = P1_2015322231443424; FilePart:object = /tmp/mmp.output.5996533592215839989.tmp (17181 bytes); FilePart:sysmeta = /tmp/mmp.output.2150159034235634646.tmp (948 bytes);  [org.dataone.client.rest.RestClient]
20151119-07:15:13: [INFO]: **************************************************** [org.dataone.integration.ContextAwareTestCaseDataone]
20151119-07:15:13: [INFO]: ***  context label:   DEV2 [org.dataone.integration.ContextAwareTestCaseDataone]
20151119-07:15:13: [INFO]: **************************************************** [org.dataone.integration.ContextAwareTestCaseDataone]
20151119-07:15:13: [INFO]: **************************************************** [org.dataone.integration.ContextAwareTestCaseDataone]
20151119-07:15:13: [INFO]: Testing getSystemMetadata() method ...  [org.dataone.integration.ContextAwareTestCaseDataone]
20151119-07:15:13: [INFO]: Testing getSystemMetadata(), Case1 [org.dataone.integration.ContextAwareTestCaseDataone]
20151119-07:15:14: [INFO]: rest call info: GET https://mn-dev-ucsb-1.test.dataone.org/metacat/d1/mn/v2/monitor/ping [org.dataone.client.rest.RestClient]
20151119-07:15:14: [INFO]: MN excluded from test: https://mn-dev-ucsb-1.test.dataone.org/metacat/d1/mn [org.dataone.integration.ContextAwareTestCaseDataone]
20151119-07:15:15: [INFO]: rest call info: GET https://mn-dev-ucsb-2.test.dataone.org/metacat/d1/mn/v2/monitor/ping [org.dataone.client.rest.RestClient]
20151119-07:15:15: [INFO]: MN included in test: https://mn-dev-ucsb-2.test.dataone.org/metacat/d1/mn [org.dataone.integration.ContextAwareTestCaseDataone]
20151119-07:15:16: [INFO]: rest call info: GET https://mn-dev-unm-1.test.dataone.org/metacat/d1/mn/v2/monitor/ping [org.dataone.client.rest.RestClient]
20151119-07:15:16: [INFO]: MN excluded from test: https://mn-dev-unm-1.test.dataone.org/metacat/d1/mn [org.dataone.integration.ContextAwareTestCaseDataone]
20151119-07:15:16: [INFO]: rest call info: GET https://mn-dev-unm-2.test.dataone.org/metacat/d1/mn/v2/monitor/ping [org.dataone.client.rest.RestClient]
20151119-07:15:16: [INFO]: MN included in test: https://mn-dev-unm-2.test.dataone.org/metacat/d1/mn [org.dataone.integration.ContextAwareTestCaseDataone]
20151119-07:15:16: [INFO]: CREATING test object... pid: P1_2015322231516414 with a sid: S1_2015322231516416 obsoletes: null obsoletedBy: null [org.dataone.integration.ContextAwareTestCaseDataone]
20151119-07:15:16: [INFO]: certificate directory: /etc/dataone/client/testClientCerts/ [org.dataone.integration.ContextAwareTestCaseDataone]
20151119-07:15:16: [INFO]: certificate filename: cnDevUNM2 [org.dataone.integration.ContextAwareTestCaseDataone]
20151119-07:15:16: [INFO]: client setup as Subject: CN=urn:node:cnDevUNM2,DC=dataone,DC=org [org.dataone.integration.ContextAwareTestCaseDataone]
20151119-07:15:16: [WARN]: Unable to find a valid authoritative MN to use for the object: P1_2015322231516414 [org.dataone.integration.ContextAwareTestCaseDataone]
20151119-07:15:16: [INFO]: creating a test object.  pid = P1_2015322231516414 on https://mn-dev-ucsb-2.test.dataone.org/metacat/d1/mn/v2 [org.dataone.integration.ContextAwareTestCaseDataone]
20151119-07:15:16: [INFO]: SystemMetadata for pid: P1_2015322231516414
<?xml version="1.0" encoding="UTF-8"?><d1_v2.0:systemMetadata xmlns:d1_v2.0="http://ns.dataone.org/service/types/v2.0" xmlns:d1="http://ns.dataone.org/service/types/v1"><serialVersion>1</serialVersion><identifier>P1_2015322231516414</identifier><formatId>eml://ecoinformatics.org/eml-2.0.1</formatId><size>17181</size><checksum algorithm="MD5">03ce09c6b4c3efc1681f3023402998a2</checksum><submitter>CN=urn:node:cnDevUNM2,DC=dataone,DC=org</submitter><rightsHolder>CN=testRightsHolder,DC=dataone,DC=org</rightsHolder><accessPolicy><allow><subject>public</subject><permission>read</permission></allow></accessPolicy><dateUploaded>2015-11-19T07:15:16.436+00:00</dateUploaded><dateSysMetadataModified>2015-11-19T07:15:16.436+00:00</dateSysMetadataModified><originMemberNode>bogusAuthoritativeNode</originMemberNode><authoritativeMemberNode>bogusAuthoritativeNode</authoritativeMemberNode><seriesId>S1_2015322231516416</seriesId></d1_v2.0:systemMetadata> [org.dataone.integration.ContextAwareTestCaseDataone]
20151119-07:15:19: [INFO]: rest call info: POST https://mn-dev-ucsb-2.test.dataone.org/metacat/d1/mn/v2/object; MMP message has: ParamPart:pid = P1_2015322231516414; FilePart:object = /tmp/mmp.output.2067760624198946269.tmp (17181 bytes); FilePart:sysmeta = /tmp/mmp.output.8560316775017873844.tmp (948 bytes);  [org.dataone.client.rest.RestClient]
20151119-07:15:19: [INFO]: object created.  pid = P1_2015322231516414 [org.dataone.integration.ContextAwareTestCaseDataone]
20151119-07:15:29: [INFO]: Created SID (S1_2015322231516416) and head PID (P1_2015322231516414) pair. [org.dataone.integration.ContextAwareTestCaseDataone]
20151119-07:16:09: [INFO]: rest call info: GET https://mn-dev-ucsb-2.test.dataone.org/metacat/d1/mn/v2/meta/S1_2015322231516416 [org.dataone.client.rest.RestClient]
org.dataone.service.exceptions.ServiceFailure: class org.dataone.client.exception.ClientSideException: /Read timed out
	at org.dataone.client.rest.HttpMultipartRestClient.doGetRequest(HttpMultipartRestClient.java:339)
	at org.dataone.client.rest.HttpMultipartRestClient.doGetRequest(HttpMultipartRestClient.java:318)
	at org.dataone.client.v2.impl.MultipartD1Node.getSystemMetadata(MultipartD1Node.java:94)
	at org.dataone.client.v2.impl.MultipartMNode.getSystemMetadata(MultipartMNode.java:337)
	at org.dataone.integration.adapters.CommonCallAdapter.getSystemMetadata(CommonCallAdapter.java:246)
	at org.dataone.integration.it.testImplementations.SidCommonTestImplementations.testGetSystemMetadata(SidCommonTestImplementations.java:326)
	at sun.reflect.NativeMethodAccessorImpl.invoke0(Native Method)
	at sun.reflect.NativeMethodAccessorImpl.invoke(NativeMethodAccessorImpl.java:57)
	at sun.reflect.DelegatingMethodAccessorImpl.invoke(DelegatingMethodAccessorImpl.java:43)
	at java.lang.reflect.Method.invoke(Method.java:606)
	at org.junit.runners.model.FrameworkMethod$1.runReflectiveCall(FrameworkMethod.java:44)
	at org.junit.internal.runners.model.ReflectiveCallable.run(ReflectiveCallable.java:15)
	at org.junit.runners.model.FrameworkMethod.invokeExplosively(FrameworkMethod.java:41)
	at org.junit.internal.runners.statements.InvokeMethod.evaluate(InvokeMethod.java:20)
	at org.junit.rules.Verifier$1.evaluate(Verifier.java:34)
	at org.junit.internal.runners.statements.RunBefores.evaluate(RunBefores.java:28)
	at org.junit.runners.BlockJUnit4ClassRunner.runChild(BlockJUnit4ClassRunner.java:76)
	at org.junit.runners.BlockJUnit4ClassRunner.runChild(BlockJUnit4ClassRunner.java:50)
	at org.junit.runners.ParentRunner$3.run(ParentRunner.java:193)
	at org.junit.runners.ParentRunner$1.schedule(ParentRunner.java:52)
	at org.junit.runners.ParentRunner.runChildren(ParentRunner.java:191)
	at org.junit.runners.ParentRunner.access$000(ParentRunner.java:42)
	at org.junit.runners.ParentRunner$2.evaluate(ParentRunner.java:184)
	at org.junit.runners.ParentRunner.run(ParentRunner.java:236)
	at org.apache.maven.surefire.junit4.JUnit4TestSet.execute(JUnit4TestSet.java:53)
	at org.apache.maven.surefire.junit4.JUnit4Provider.executeTestSet(JUnit4Provider.java:119)
	at org.apache.maven.surefire.junit4.JUnit4Provider.invoke(JUnit4Provider.java:101)
	at sun.reflect.NativeMethodAccessorImpl.invoke0(Native Method)
	at sun.reflect.NativeMethodAccessorImpl.invoke(NativeMethodAccessorImpl.java:57)
	at sun.reflect.DelegatingMethodAccessorImpl.invoke(DelegatingMethodAccessorImpl.java:43)
	at java.lang.reflect.Method.invoke(Method.java:606)
	at org.apache.maven.surefire.booter.ProviderFactory$ClassLoaderProxy.invoke(ProviderFactory.java:103)
	at com.sun.proxy.$Proxy0.invoke(Unknown Source)
	at org.apache.maven.surefire.booter.SurefireStarter.invokeProvider(SurefireStarter.java:150)
	at org.apache.maven.surefire.booter.SurefireStarter.runSuitesInProcess(SurefireStarter.java:91)
	at org.apache.maven.surefire.booter.ForkedBooter.main(ForkedBooter.java:69)
Caused by: org.dataone.client.exception.ClientSideException: /Read timed out
	... 36 more
Caused by: java.net.SocketTimeoutException: Read timed out
	at java.net.SocketInputStream.socketRead0(Native Method)
	at java.net.SocketInputStream.read(SocketInputStream.java:152)
	at java.net.SocketInputStream.read(SocketInputStream.java:122)
	at sun.security.ssl.InputRecord.readFully(InputRecord.java:442)
	at sun.security.ssl.InputRecord.read(InputRecord.java:480)
	at sun.security.ssl.SSLSocketImpl.readRecord(SSLSocketImpl.java:946)
	at sun.security.ssl.SSLSocketImpl.readDataRecord(SSLSocketImpl.java:903)
	at sun.security.ssl.AppInputStream.read(AppInputStream.java:102)
	at org.apache.http.impl.io.SessionInputBufferImpl.streamRead(SessionInputBufferImpl.java:136)
	at org.apache.http.impl.io.SessionInputBufferImpl.fillBuffer(SessionInputBufferImpl.java:152)
	at org.apache.http.impl.io.SessionInputBufferImpl.readLine(SessionInputBufferImpl.java:270)
	at org.apache.http.impl.conn.DefaultHttpResponseParser.parseHead(DefaultHttpResponseParser.java:140)
	at org.apache.http.impl.conn.DefaultHttpResponseParser.parseHead(DefaultHttpResponseParser.java:57)
	at org.apache.http.impl.io.AbstractMessageParser.parse(AbstractMessageParser.java:260)
	at org.apache.http.impl.DefaultBHttpClientConnection.receiveResponseHeader(DefaultBHttpClientConnection.java:161)
	at sun.reflect.GeneratedMethodAccessor9.invoke(Unknown Source)
	at sun.reflect.DelegatingMethodAccessorImpl.invoke(DelegatingMethodAccessorImpl.java:43)
	at java.lang.reflect.Method.invoke(Method.java:606)
	at org.apache.http.impl.conn.CPoolProxy.invoke(CPoolProxy.java:138)
	at com.sun.proxy.$Proxy9.receiveResponseHeader(Unknown Source)
	at org.apache.http.protocol.HttpRequestExecutor.doReceiveResponse(HttpRequestExecutor.java:271)
	at org.apache.http.protocol.HttpRequestExecutor.execute(HttpRequestExecutor.java:123)
	at org.apache.http.impl.execchain.MainClientExec.execute(MainClientExec.java:254)
	at org.apache.http.impl.execchain.ProtocolExec.execute(ProtocolExec.java:195)
	at org.apache.http.impl.execchain.RetryExec.execute(RetryExec.java:86)
	at org.apache.http.impl.execchain.RedirectExec.execute(RedirectExec.java:108)
	at org.apache.http.impl.client.InternalHttpClient.doExecute(InternalHttpClient.java:186)
	at org.apache.http.impl.client.CloseableHttpClient.execute(CloseableHttpClient.java:82)
	at org.apache.http.impl.client.CloseableHttpClient.execute(CloseableHttpClient.java:106)
	at org.apache.http.impl.client.CloseableHttpClient.execute(CloseableHttpClient.java:57)
	at org.dataone.client.rest.RestClient.doRequest(RestClient.java:294)
	at org.dataone.client.rest.RestClient.doRequestNoBody(RestClient.java:230)
	at org.dataone.client.rest.RestClient.doGetRequest(RestClient.java:148)
	at org.dataone.client.rest.HttpMultipartRestClient.doGetRequest(HttpMultipartRestClient.java:329)
	... 35 more
20151119-07:16:09: [INFO]: CREATING test object... pid: P1_201532223169466 with a sid: S1_201532223169471 obsoletes: null obsoletedBy: null [org.dataone.integration.ContextAwareTestCaseDataone]
20151119-07:16:09: [INFO]: certificate directory: /etc/dataone/client/testClientCerts/ [org.dataone.integration.ContextAwareTestCaseDataone]
20151119-07:16:09: [INFO]: certificate filename: cnDevUNM2 [org.dataone.integration.ContextAwareTestCaseDataone]
20151119-07:16:09: [INFO]: client setup as Subject: CN=urn:node:cnDevUNM2,DC=dataone,DC=org [org.dataone.integration.ContextAwareTestCaseDataone]
20151119-07:16:09: [WARN]: Unable to find a valid authoritative MN to use for the object: P1_201532223169466 [org.dataone.integration.ContextAwareTestCaseDataone]
20151119-07:16:09: [INFO]: creating a test object.  pid = P1_201532223169466 on https://mn-dev-unm-2.test.dataone.org/metacat/d1/mn/v2 [org.dataone.integration.ContextAwareTestCaseDataone]
20151119-07:16:09: [INFO]: SystemMetadata for pid: P1_201532223169466
<?xml version="1.0" encoding="UTF-8"?><d1_v2.0:systemMetadata xmlns:d1_v2.0="http://ns.dataone.org/service/types/v2.0" xmlns:d1="http://ns.dataone.org/service/types/v1"><serialVersion>1</serialVersion><identifier>P1_201532223169466</identifier><formatId>eml://ecoinformatics.org/eml-2.0.1</formatId><size>17181</size><checksum algorithm="MD5">03ce09c6b4c3efc1681f3023402998a2</checksum><submitter>CN=urn:node:cnDevUNM2,DC=dataone,DC=org</submitter><rightsHolder>CN=testRightsHolder,DC=dataone,DC=org</rightsHolder><accessPolicy><allow><subject>public</subject><permission>read</permission></allow></accessPolicy><dateUploaded>2015-11-19T07:16:09.488+00:00</dateUploaded><dateSysMetadataModified>2015-11-19T07:16:09.488+00:00</dateSysMetadataModified><originMemberNode>bogusAuthoritativeNode</originMemberNode><authoritativeMemberNode>bogusAuthoritativeNode</authoritativeMemberNode><seriesId>S1_201532223169471</seriesId></d1_v2.0:systemMetadata> [org.dataone.integration.ContextAwareTestCaseDataone]
20151119-07:16:11: [INFO]: rest call info: POST https://mn-dev-unm-2.test.dataone.org/metacat/d1/mn/v2/object; MMP message has: ParamPart:pid = P1_201532223169466; FilePart:object = /tmp/mmp.output.7879784920758512423.tmp (17181 bytes); FilePart:sysmeta = /tmp/mmp.output.2354135072699560920.tmp (946 bytes);  [org.dataone.client.rest.RestClient]
20151119-07:16:11: [INFO]: object created.  pid = P1_201532223169466 [org.dataone.integration.ContextAwareTestCaseDataone]
20151119-07:16:21: [INFO]: Created SID (S1_201532223169471) and head PID (P1_201532223169466) pair. [org.dataone.integration.ContextAwareTestCaseDataone]
20151119-07:16:31: [INFO]: rest call info: GET https://mn-dev-unm-2.test.dataone.org/metacat/d1/mn/v2/meta/S1_201532223169471 [org.dataone.client.rest.RestClient]
20151119-07:16:31: [INFO]: **************************************************** [org.dataone.integration.ContextAwareTestCaseDataone]
20151119-07:16:31: [INFO]: ***  context label:   DEV2 [org.dataone.integration.ContextAwareTestCaseDataone]
20151119-07:16:31: [INFO]: **************************************************** [org.dataone.integration.ContextAwareTestCaseDataone]
20151119-07:16:31: [INFO]: **************************************************** [org.dataone.integration.ContextAwareTestCaseDataone]
20151119-07:16:31: [INFO]: Testing get() method ...  [org.dataone.integration.ContextAwareTestCaseDataone]
20151119-07:16:31: [INFO]: Testing get(), Case1 [org.dataone.integration.ContextAwareTestCaseDataone]
20151119-07:16:32: [INFO]: rest call info: GET https://mn-dev-ucsb-1.test.dataone.org/metacat/d1/mn/v2/monitor/ping [org.dataone.client.rest.RestClient]
20151119-07:16:32: [INFO]: MN excluded from test: https://mn-dev-ucsb-1.test.dataone.org/metacat/d1/mn [org.dataone.integration.ContextAwareTestCaseDataone]
20151119-07:16:33: [INFO]: rest call info: GET https://mn-dev-ucsb-2.test.dataone.org/metacat/d1/mn/v2/monitor/ping [org.dataone.client.rest.RestClient]
20151119-07:16:33: [INFO]: MN included in test: https://mn-dev-ucsb-2.test.dataone.org/metacat/d1/mn [org.dataone.integration.ContextAwareTestCaseDataone]
20151119-07:16:33: [INFO]: rest call info: GET https://mn-dev-unm-1.test.dataone.org/metacat/d1/mn/v2/monitor/ping [org.dataone.client.rest.RestClient]
20151119-07:16:33: [INFO]: MN excluded from test: https://mn-dev-unm-1.test.dataone.org/metacat/d1/mn [org.dataone.integration.ContextAwareTestCaseDataone]
20151119-07:16:33: [INFO]: rest call info: GET https://mn-dev-unm-2.test.dataone.org/metacat/d1/mn/v2/monitor/ping [org.dataone.client.rest.RestClient]
20151119-07:16:33: [INFO]: MN included in test: https://mn-dev-unm-2.test.dataone.org/metacat/d1/mn [org.dataone.integration.ContextAwareTestCaseDataone]
20151119-07:16:33: [INFO]: CREATING test object... pid: P1_2015322231633361 with a sid: S1_2015322231633363 obsoletes: null obsoletedBy: null [org.dataone.integration.ContextAwareTestCaseDataone]
20151119-07:16:33: [INFO]: certificate directory: /etc/dataone/client/testClientCerts/ [org.dataone.integration.ContextAwareTestCaseDataone]
20151119-07:16:33: [INFO]: certificate filename: cnDevUNM2 [org.dataone.integration.ContextAwareTestCaseDataone]
20151119-07:16:33: [INFO]: client setup as Subject: CN=urn:node:cnDevUNM2,DC=dataone,DC=org [org.dataone.integration.ContextAwareTestCaseDataone]
20151119-07:16:33: [WARN]: Unable to find a valid authoritative MN to use for the object: P1_2015322231633361 [org.dataone.integration.ContextAwareTestCaseDataone]
20151119-07:16:33: [INFO]: creating a test object.  pid = P1_2015322231633361 on https://mn-dev-ucsb-2.test.dataone.org/metacat/d1/mn/v2 [org.dataone.integration.ContextAwareTestCaseDataone]
20151119-07:16:33: [INFO]: SystemMetadata for pid: P1_2015322231633361
<?xml version="1.0" encoding="UTF-8"?><d1_v2.0:systemMetadata xmlns:d1_v2.0="http://ns.dataone.org/service/types/v2.0" xmlns:d1="http://ns.dataone.org/service/types/v1"><serialVersion>1</serialVersion><identifier>P1_2015322231633361</identifier><formatId>eml://ecoinformatics.org/eml-2.0.1</formatId><size>17181</size><checksum algorithm="MD5">03ce09c6b4c3efc1681f3023402998a2</checksum><submitter>CN=urn:node:cnDevUNM2,DC=dataone,DC=org</submitter><rightsHolder>CN=testRightsHolder,DC=dataone,DC=org</rightsHolder><accessPolicy><allow><subject>public</subject><permission>read</permission></allow></accessPolicy><dateUploaded>2015-11-19T07:16:33.381+00:00</dateUploaded><dateSysMetadataModified>2015-11-19T07:16:33.381+00:00</dateSysMetadataModified><originMemberNode>bogusAuthoritativeNode</originMemberNode><authoritativeMemberNode>bogusAuthoritativeNode</authoritativeMemberNode><seriesId>S1_2015322231633363</seriesId></d1_v2.0:systemMetadata> [org.dataone.integration.ContextAwareTestCaseDataone]
20151119-07:16:35: [INFO]: rest call info: POST https://mn-dev-ucsb-2.test.dataone.org/metacat/d1/mn/v2/object; MMP message has: ParamPart:pid = P1_2015322231633361; FilePart:object = /tmp/mmp.output.7543633483704229160.tmp (17181 bytes); FilePart:sysmeta = /tmp/mmp.output.4055992295589828632.tmp (948 bytes);  [org.dataone.client.rest.RestClient]
20151119-07:16:35: [INFO]: object created.  pid = P1_2015322231633361 [org.dataone.integration.ContextAwareTestCaseDataone]
20151119-07:16:45: [INFO]: Created SID (S1_2015322231633363) and head PID (P1_2015322231633361) pair. [org.dataone.integration.ContextAwareTestCaseDataone]
20151119-07:16:50: [INFO]: rest call info: GET https://mn-dev-ucsb-2.test.dataone.org/metacat/d1/mn/v2/object/S1_2015322231633363 [org.dataone.client.rest.RestClient]
20151119-07:17:20: [INFO]: rest call info: GET https://mn-dev-ucsb-2.test.dataone.org/metacat/d1/mn/v2/object/P1_2015322231633361 [org.dataone.client.rest.RestClient]
org.dataone.service.exceptions.ServiceFailure: class org.dataone.client.exception.ClientSideException: /Read timed out
	at org.dataone.client.rest.HttpMultipartRestClient.doGetRequest(HttpMultipartRestClient.java:339)
	at org.dataone.client.rest.HttpMultipartRestClient.doGetRequest(HttpMultipartRestClient.java:318)
	at org.dataone.client.rest.MultipartD1Node.get(MultipartD1Node.java:392)
	at org.dataone.client.v2.impl.MultipartMNode.get(MultipartMNode.java:279)
	at org.dataone.integration.adapters.CommonCallAdapter.get(CommonCallAdapter.java:215)
	at org.dataone.integration.it.testImplementations.SidCommonTestImplementations.testGet(SidCommonTestImplementations.java:374)
	at sun.reflect.NativeMethodAccessorImpl.invoke0(Native Method)
	at sun.reflect.NativeMethodAccessorImpl.invoke(NativeMethodAccessorImpl.java:57)
	at sun.reflect.DelegatingMethodAccessorImpl.invoke(DelegatingMethodAccessorImpl.java:43)
	at java.lang.reflect.Method.invoke(Method.java:606)
	at org.junit.runners.model.FrameworkMethod$1.runReflectiveCall(FrameworkMethod.java:44)
	at org.junit.internal.runners.model.ReflectiveCallable.run(ReflectiveCallable.java:15)
	at org.junit.runners.model.FrameworkMethod.invokeExplosively(FrameworkMethod.java:41)
	at org.junit.internal.runners.statements.InvokeMethod.evaluate(InvokeMethod.java:20)
	at org.junit.rules.Verifier$1.evaluate(Verifier.java:34)
	at org.junit.internal.runners.statements.RunBefores.evaluate(RunBefores.java:28)
	at org.junit.runners.BlockJUnit4ClassRunner.runChild(BlockJUnit4ClassRunner.java:76)
	at org.junit.runners.BlockJUnit4ClassRunner.runChild(BlockJUnit4ClassRunner.java:50)
	at org.junit.runners.ParentRunner$3.run(ParentRunner.java:193)
	at org.junit.runners.ParentRunner$1.schedule(ParentRunner.java:52)
	at org.junit.runners.ParentRunner.runChildren(ParentRunner.java:191)
	at org.junit.runners.ParentRunner.access$000(ParentRunner.java:42)
	at org.junit.runners.ParentRunner$2.evaluate(ParentRunner.java:184)
	at org.junit.runners.ParentRunner.run(ParentRunner.java:236)
	at org.apache.maven.surefire.junit4.JUnit4TestSet.execute(JUnit4TestSet.java:53)
	at org.apache.maven.surefire.junit4.JUnit4Provider.executeTestSet(JUnit4Provider.java:119)
	at org.apache.maven.surefire.junit4.JUnit4Provider.invoke(JUnit4Provider.java:101)
	at sun.reflect.NativeMethodAccessorImpl.invoke0(Native Method)
	at sun.reflect.NativeMethodAccessorImpl.invoke(NativeMethodAccessorImpl.java:57)
	at sun.reflect.DelegatingMethodAccessorImpl.invoke(DelegatingMethodAccessorImpl.java:43)
	at java.lang.reflect.Method.invoke(Method.java:606)
	at org.apache.maven.surefire.booter.ProviderFactory$ClassLoaderProxy.invoke(ProviderFactory.java:103)
	at com.sun.proxy.$Proxy0.invoke(Unknown Source)
	at org.apache.maven.surefire.booter.SurefireStarter.invokeProvider(SurefireStarter.java:150)
	at org.apache.maven.surefire.booter.SurefireStarter.runSuitesInProcess(SurefireStarter.java:91)
	at org.apache.maven.surefire.booter.ForkedBooter.main(ForkedBooter.java:69)
Caused by: org.dataone.client.exception.ClientSideException: /Read timed out
	... 36 more
Caused by: java.net.SocketTimeoutException: Read timed out
	at java.net.SocketInputStream.socketRead0(Native Method)
	at java.net.SocketInputStream.read(SocketInputStream.java:152)
	at java.net.SocketInputStream.read(SocketInputStream.java:122)
	at sun.security.ssl.InputRecord.readFully(InputRecord.java:442)
	at sun.security.ssl.InputRecord.read(InputRecord.java:480)
	at sun.security.ssl.SSLSocketImpl.readRecord(SSLSocketImpl.java:946)
	at sun.security.ssl.SSLSocketImpl.readDataRecord(SSLSocketImpl.java:903)
	at sun.security.ssl.AppInputStream.read(AppInputStream.java:102)
	at org.apache.http.impl.io.SessionInputBufferImpl.streamRead(SessionInputBufferImpl.java:136)
	at org.apache.http.impl.io.SessionInputBufferImpl.fillBuffer(SessionInputBufferImpl.java:152)
	at org.apache.http.impl.io.SessionInputBufferImpl.readLine(SessionInputBufferImpl.java:270)
	at org.apache.http.impl.conn.DefaultHttpResponseParser.parseHead(DefaultHttpResponseParser.java:140)
	at org.apache.http.impl.conn.DefaultHttpResponseParser.parseHead(DefaultHttpResponseParser.java:57)
	at org.apache.http.impl.io.AbstractMessageParser.parse(AbstractMessageParser.java:260)
	at org.apache.http.impl.DefaultBHttpClientConnection.receiveResponseHeader(DefaultBHttpClientConnection.java:161)
	at sun.reflect.GeneratedMethodAccessor9.invoke(Unknown Source)
	at sun.reflect.DelegatingMethodAccessorImpl.invoke(DelegatingMethodAccessorImpl.java:43)
	at java.lang.reflect.Method.invoke(Method.java:606)
	at org.apache.http.impl.conn.CPoolProxy.invoke(CPoolProxy.java:138)
	at com.sun.proxy.$Proxy9.receiveResponseHeader(Unknown Source)
	at org.apache.http.protocol.HttpRequestExecutor.doReceiveResponse(HttpRequestExecutor.java:271)
	at org.apache.http.protocol.HttpRequestExecutor.execute(HttpRequestExecutor.java:123)
	at org.apache.http.impl.execchain.MainClientExec.execute(MainClientExec.java:254)
	at org.apache.http.impl.execchain.ProtocolExec.execute(ProtocolExec.java:195)
	at org.apache.http.impl.execchain.RetryExec.execute(RetryExec.java:86)
	at org.apache.http.impl.execchain.RedirectExec.execute(RedirectExec.java:108)
	at org.apache.http.impl.client.InternalHttpClient.doExecute(InternalHttpClient.java:186)
	at org.apache.http.impl.client.CloseableHttpClient.execute(CloseableHttpClient.java:82)
	at org.apache.http.impl.client.CloseableHttpClient.execute(CloseableHttpClient.java:106)
	at org.apache.http.impl.client.CloseableHttpClient.execute(CloseableHttpClient.java:57)
	at org.dataone.client.rest.RestClient.doRequest(RestClient.java:294)
	at org.dataone.client.rest.RestClient.doRequestNoBody(RestClient.java:230)
	at org.dataone.client.rest.RestClient.doGetRequest(RestClient.java:148)
	at org.dataone.client.rest.HttpMultipartRestClient.doGetRequest(HttpMultipartRestClient.java:329)
	... 35 more
20151119-07:17:20: [INFO]: CREATING test object... pid: P1_2015322231720806 with a sid: S1_2015322231720808 obsoletes: null obsoletedBy: null [org.dataone.integration.ContextAwareTestCaseDataone]
20151119-07:17:20: [INFO]: certificate directory: /etc/dataone/client/testClientCerts/ [org.dataone.integration.ContextAwareTestCaseDataone]
20151119-07:17:20: [INFO]: certificate filename: cnDevUNM2 [org.dataone.integration.ContextAwareTestCaseDataone]
20151119-07:17:20: [INFO]: client setup as Subject: CN=urn:node:cnDevUNM2,DC=dataone,DC=org [org.dataone.integration.ContextAwareTestCaseDataone]
20151119-07:17:20: [WARN]: Unable to find a valid authoritative MN to use for the object: P1_2015322231720806 [org.dataone.integration.ContextAwareTestCaseDataone]
20151119-07:17:20: [INFO]: creating a test object.  pid = P1_2015322231720806 on https://mn-dev-unm-2.test.dataone.org/metacat/d1/mn/v2 [org.dataone.integration.ContextAwareTestCaseDataone]
20151119-07:17:20: [INFO]: SystemMetadata for pid: P1_2015322231720806
<?xml version="1.0" encoding="UTF-8"?><d1_v2.0:systemMetadata xmlns:d1_v2.0="http://ns.dataone.org/service/types/v2.0" xmlns:d1="http://ns.dataone.org/service/types/v1"><serialVersion>1</serialVersion><identifier>P1_2015322231720806</identifier><formatId>eml://ecoinformatics.org/eml-2.0.1</formatId><size>17181</size><checksum algorithm="MD5">03ce09c6b4c3efc1681f3023402998a2</checksum><submitter>CN=urn:node:cnDevUNM2,DC=dataone,DC=org</submitter><rightsHolder>CN=testRightsHolder,DC=dataone,DC=org</rightsHolder><accessPolicy><allow><subject>public</subject><permission>read</permission></allow></accessPolicy><dateUploaded>2015-11-19T07:17:20.825+00:00</dateUploaded><dateSysMetadataModified>2015-11-19T07:17:20.825+00:00</dateSysMetadataModified><originMemberNode>bogusAuthoritativeNode</originMemberNode><authoritativeMemberNode>bogusAuthoritativeNode</authoritativeMemberNode><seriesId>S1_2015322231720808</seriesId></d1_v2.0:systemMetadata> [org.dataone.integration.ContextAwareTestCaseDataone]
20151119-07:17:22: [INFO]: rest call info: POST https://mn-dev-unm-2.test.dataone.org/metacat/d1/mn/v2/object; MMP message has: ParamPart:pid = P1_2015322231720806; FilePart:object = /tmp/mmp.output.1612017119970448947.tmp (17181 bytes); FilePart:sysmeta = /tmp/mmp.output.2129293541406406000.tmp (948 bytes);  [org.dataone.client.rest.RestClient]
20151119-07:17:22: [INFO]: object created.  pid = P1_2015322231720806 [org.dataone.integration.ContextAwareTestCaseDataone]
20151119-07:17:32: [INFO]: Created SID (S1_2015322231720808) and head PID (P1_2015322231720806) pair. [org.dataone.integration.ContextAwareTestCaseDataone]
20151119-07:17:32: [INFO]: rest call info: GET https://mn-dev-unm-2.test.dataone.org/metacat/d1/mn/v2/object/S1_2015322231720808 [org.dataone.client.rest.RestClient]
20151119-07:17:32: [INFO]: rest call info: GET https://mn-dev-unm-2.test.dataone.org/metacat/d1/mn/v2/object/P1_2015322231720806 [org.dataone.client.rest.RestClient]
20151119-07:17:32: [INFO]: **************************************************** [org.dataone.integration.ContextAwareTestCaseDataone]
20151119-07:17:32: [INFO]: ***  context label:   DEV2 [org.dataone.integration.ContextAwareTestCaseDataone]
20151119-07:17:32: [INFO]: **************************************************** [org.dataone.integration.ContextAwareTestCaseDataone]
20151119-07:17:32: [INFO]: **************************************************** [org.dataone.integration.ContextAwareTestCaseDataone]
20151119-07:17:32: [INFO]: Testing describe() method ...  [org.dataone.integration.ContextAwareTestCaseDataone]
20151119-07:17:32: [INFO]: Testing describe(), Case1 [org.dataone.integration.ContextAwareTestCaseDataone]
20151119-07:17:33: [INFO]: rest call info: GET https://mn-dev-ucsb-1.test.dataone.org/metacat/d1/mn/v2/monitor/ping [org.dataone.client.rest.RestClient]
20151119-07:17:33: [INFO]: MN excluded from test: https://mn-dev-ucsb-1.test.dataone.org/metacat/d1/mn [org.dataone.integration.ContextAwareTestCaseDataone]
20151119-07:17:34: [INFO]: rest call info: GET https://mn-dev-ucsb-2.test.dataone.org/metacat/d1/mn/v2/monitor/ping [org.dataone.client.rest.RestClient]
20151119-07:17:34: [INFO]: MN included in test: https://mn-dev-ucsb-2.test.dataone.org/metacat/d1/mn [org.dataone.integration.ContextAwareTestCaseDataone]
20151119-07:17:34: [INFO]: rest call info: GET https://mn-dev-unm-1.test.dataone.org/metacat/d1/mn/v2/monitor/ping [org.dataone.client.rest.RestClient]
20151119-07:17:34: [INFO]: MN excluded from test: https://mn-dev-unm-1.test.dataone.org/metacat/d1/mn [org.dataone.integration.ContextAwareTestCaseDataone]
20151119-07:17:34: [INFO]: rest call info: GET https://mn-dev-unm-2.test.dataone.org/metacat/d1/mn/v2/monitor/ping [org.dataone.client.rest.RestClient]
20151119-07:17:34: [INFO]: MN included in test: https://mn-dev-unm-2.test.dataone.org/metacat/d1/mn [org.dataone.integration.ContextAwareTestCaseDataone]
20151119-07:17:34: [INFO]: CREATING test object... pid: P1_2015322231734382 with a sid: S1_2015322231734384 obsoletes: null obsoletedBy: null [org.dataone.integration.ContextAwareTestCaseDataone]
20151119-07:17:34: [INFO]: certificate directory: /etc/dataone/client/testClientCerts/ [org.dataone.integration.ContextAwareTestCaseDataone]
20151119-07:17:34: [INFO]: certificate filename: cnDevUNM2 [org.dataone.integration.ContextAwareTestCaseDataone]
20151119-07:17:34: [INFO]: client setup as Subject: CN=urn:node:cnDevUNM2,DC=dataone,DC=org [org.dataone.integration.ContextAwareTestCaseDataone]
20151119-07:17:34: [WARN]: Unable to find a valid authoritative MN to use for the object: P1_2015322231734382 [org.dataone.integration.ContextAwareTestCaseDataone]
20151119-07:17:34: [INFO]: creating a test object.  pid = P1_2015322231734382 on https://mn-dev-ucsb-2.test.dataone.org/metacat/d1/mn/v2 [org.dataone.integration.ContextAwareTestCaseDataone]
20151119-07:17:34: [INFO]: SystemMetadata for pid: P1_2015322231734382
<?xml version="1.0" encoding="UTF-8"?><d1_v2.0:systemMetadata xmlns:d1_v2.0="http://ns.dataone.org/service/types/v2.0" xmlns:d1="http://ns.dataone.org/service/types/v1"><serialVersion>1</serialVersion><identifier>P1_2015322231734382</identifier><formatId>eml://ecoinformatics.org/eml-2.0.1</formatId><size>17181</size><checksum algorithm="MD5">03ce09c6b4c3efc1681f3023402998a2</checksum><submitter>CN=urn:node:cnDevUNM2,DC=dataone,DC=org</submitter><rightsHolder>CN=testRightsHolder,DC=dataone,DC=org</rightsHolder><accessPolicy><allow><subject>public</subject><permission>read</permission></allow></accessPolicy><dateUploaded>2015-11-19T07:17:34.400+00:00</dateUploaded><dateSysMetadataModified>2015-11-19T07:17:34.400+00:00</dateSysMetadataModified><originMemberNode>bogusAuthoritativeNode</originMemberNode><authoritativeMemberNode>bogusAuthoritativeNode</authoritativeMemberNode><seriesId>S1_2015322231734384</seriesId></d1_v2.0:systemMetadata> [org.dataone.integration.ContextAwareTestCaseDataone]
20151119-07:18:04: [INFO]: rest call info: POST https://mn-dev-ucsb-2.test.dataone.org/metacat/d1/mn/v2/object; MMP message has: ParamPart:pid = P1_2015322231734382; FilePart:object = /tmp/mmp.output.79692451378243278.tmp (17181 bytes); FilePart:sysmeta = /tmp/mmp.output.3514866483689397220.tmp (948 bytes);  [org.dataone.client.rest.RestClient]
java.lang.reflect.InvocationTargetException
	at sun.reflect.NativeMethodAccessorImpl.invoke0(Native Method)
	at sun.reflect.NativeMethodAccessorImpl.invoke(NativeMethodAccessorImpl.java:57)
	at sun.reflect.DelegatingMethodAccessorImpl.invoke(DelegatingMethodAccessorImpl.java:43)
	at java.lang.reflect.Method.invoke(Method.java:606)
	at org.dataone.integration.it.testImplementations.SidCommonTestImplementations.testDescribe(SidCommonTestImplementations.java:416)
	at sun.reflect.NativeMethodAccessorImpl.invoke0(Native Method)
	at sun.reflect.NativeMethodAccessorImpl.invoke(NativeMethodAccessorImpl.java:57)
	at sun.reflect.DelegatingMethodAccessorImpl.invoke(DelegatingMethodAccessorImpl.java:43)
	at java.lang.reflect.Method.invoke(Method.java:606)
	at org.junit.runners.model.FrameworkMethod$1.runReflectiveCall(FrameworkMethod.java:44)
	at org.junit.internal.runners.model.ReflectiveCallable.run(ReflectiveCallable.java:15)
	at org.junit.runners.model.FrameworkMethod.invokeExplosively(FrameworkMethod.java:41)
	at org.junit.internal.runners.statements.InvokeMethod.evaluate(InvokeMethod.java:20)
	at org.junit.rules.Verifier$1.evaluate(Verifier.java:34)
	at org.junit.internal.runners.statements.RunBefores.evaluate(RunBefores.java:28)
	at org.junit.runners.BlockJUnit4ClassRunner.runChild(BlockJUnit4ClassRunner.java:76)
	at org.junit.runners.BlockJUnit4ClassRunner.runChild(BlockJUnit4ClassRunner.java:50)
	at org.junit.runners.ParentRunner$3.run(ParentRunner.java:193)
	at org.junit.runners.ParentRunner$1.schedule(ParentRunner.java:52)
	at org.junit.runners.ParentRunner.runChildren(ParentRunner.java:191)
	at org.junit.runners.ParentRunner.access$000(ParentRunner.java:42)
	at org.junit.runners.ParentRunner$2.evaluate(ParentRunner.java:184)
	at org.junit.runners.ParentRunner.run(ParentRunner.java:236)
	at org.apache.maven.surefire.junit4.JUnit4TestSet.execute(JUnit4TestSet.java:53)
	at org.apache.maven.surefire.junit4.JUnit4Provider.executeTestSet(JUnit4Provider.java:119)
	at org.apache.maven.surefire.junit4.JUnit4Provider.invoke(JUnit4Provider.java:101)
	at sun.reflect.NativeMethodAccessorImpl.invoke0(Native Method)
	at sun.reflect.NativeMethodAccessorImpl.invoke(NativeMethodAccessorImpl.java:57)
	at sun.reflect.DelegatingMethodAccessorImpl.invoke(DelegatingMethodAccessorImpl.java:43)
	at java.lang.reflect.Method.invoke(Method.java:606)
	at org.apache.maven.surefire.booter.ProviderFactory$ClassLoaderProxy.invoke(ProviderFactory.java:103)
	at com.sun.proxy.$Proxy0.invoke(Unknown Source)
	at org.apache.maven.surefire.booter.SurefireStarter.invokeProvider(SurefireStarter.java:150)
	at org.apache.maven.surefire.booter.SurefireStarter.runSuitesInProcess(SurefireStarter.java:91)
	at org.apache.maven.surefire.booter.ForkedBooter.main(ForkedBooter.java:69)
Caused by: org.dataone.client.exception.ClientSideException: Unable to create test object!/class org.dataone.client.exception.ClientSideException: /Read timed out
	at org.dataone.integration.ContextAwareTestCaseDataone.createTestObject(ContextAwareTestCaseDataone.java:1513)
	at org.dataone.integration.ContextAwareTestCaseDataone.createTestObject(ContextAwareTestCaseDataone.java:1345)
	at org.dataone.integration.it.testImplementations.SidCommonTestImplementations.createTestObject(SidCommonTestImplementations.java:216)
	at org.dataone.integration.it.testImplementations.SidMNTestImplementations.setupMNCase1(SidMNTestImplementations.java:88)
	... 35 more
Caused by: org.dataone.service.exceptions.ServiceFailure: class org.dataone.client.exception.ClientSideException: /Read timed out
	at org.dataone.client.rest.HttpMultipartRestClient.doPostRequest(HttpMultipartRestClient.java:460)
	at org.dataone.client.v2.impl.MultipartMNode.create(MultipartMNode.java:495)
	at org.dataone.integration.adapters.CommonCallAdapter.create(CommonCallAdapter.java:505)
	at org.dataone.integration.ContextAwareTestCaseDataone.createTestObject(ContextAwareTestCaseDataone.java:1504)
	... 38 more
Caused by: org.dataone.client.exception.ClientSideException: /Read timed out
	... 42 more
Caused by: java.net.SocketTimeoutException: Read timed out
	at java.net.SocketInputStream.socketRead0(Native Method)
	at java.net.SocketInputStream.read(SocketInputStream.java:152)
	at java.net.SocketInputStream.read(SocketInputStream.java:122)
	at sun.security.ssl.InputRecord.readFully(InputRecord.java:442)
	at sun.security.ssl.InputRecord.read(InputRecord.java:480)
	at sun.security.ssl.SSLSocketImpl.readRecord(SSLSocketImpl.java:946)
	at sun.security.ssl.SSLSocketImpl.readDataRecord(SSLSocketImpl.java:903)
	at sun.security.ssl.AppInputStream.read(AppInputStream.java:102)
	at org.apache.http.impl.io.SessionInputBufferImpl.streamRead(SessionInputBufferImpl.java:136)
	at org.apache.http.impl.io.SessionInputBufferImpl.fillBuffer(SessionInputBufferImpl.java:152)
	at org.apache.http.impl.io.SessionInputBufferImpl.readLine(SessionInputBufferImpl.java:270)
	at org.apache.http.impl.conn.DefaultHttpResponseParser.parseHead(DefaultHttpResponseParser.java:140)
	at org.apache.http.impl.conn.DefaultHttpResponseParser.parseHead(DefaultHttpResponseParser.java:57)
	at org.apache.http.impl.io.AbstractMessageParser.parse(AbstractMessageParser.java:260)
	at org.apache.http.impl.DefaultBHttpClientConnection.receiveResponseHeader(DefaultBHttpClientConnection.java:161)
	at sun.reflect.GeneratedMethodAccessor9.invoke(Unknown Source)
	at sun.reflect.DelegatingMethodAccessorImpl.invoke(DelegatingMethodAccessorImpl.java:43)
	at java.lang.reflect.Method.invoke(Method.java:606)
	at org.apache.http.impl.conn.CPoolProxy.invoke(CPoolProxy.java:138)
	at com.sun.proxy.$Proxy9.receiveResponseHeader(Unknown Source)
	at org.apache.http.protocol.HttpRequestExecutor.doReceiveResponse(HttpRequestExecutor.java:271)
	at org.apache.http.protocol.HttpRequestExecutor.execute(HttpRequestExecutor.java:123)
	at org.apache.http.impl.execchain.MainClientExec.execute(MainClientExec.java:254)
	at org.apache.http.impl.execchain.ProtocolExec.execute(ProtocolExec.java:195)
	at org.apache.http.impl.execchain.RetryExec.execute(RetryExec.java:86)
	at org.apache.http.impl.execchain.RedirectExec.execute(RedirectExec.java:108)
	at org.apache.http.impl.client.InternalHttpClient.doExecute(InternalHttpClient.java:186)
	at org.apache.http.impl.client.CloseableHttpClient.execute(CloseableHttpClient.java:82)
	at org.apache.http.impl.client.CloseableHttpClient.execute(CloseableHttpClient.java:106)
	at org.apache.http.impl.client.CloseableHttpClient.execute(CloseableHttpClient.java:57)
	at org.dataone.client.rest.RestClient.doRequest(RestClient.java:294)
	at org.dataone.client.rest.RestClient.doRequestMMBody(RestClient.java:272)
	at org.dataone.client.rest.RestClient.doPostRequest(RestClient.java:192)
	at org.dataone.client.rest.HttpMultipartRestClient.doPostRequest(HttpMultipartRestClient.java:453)
	... 41 more
20151119-07:18:04: [INFO]: CREATING test object... pid: P1_201532223184558 with a sid: S1_201532223184560 obsoletes: null obsoletedBy: null [org.dataone.integration.ContextAwareTestCaseDataone]
20151119-07:18:04: [INFO]: certificate directory: /etc/dataone/client/testClientCerts/ [org.dataone.integration.ContextAwareTestCaseDataone]
20151119-07:18:04: [INFO]: certificate filename: cnDevUNM2 [org.dataone.integration.ContextAwareTestCaseDataone]
20151119-07:18:04: [INFO]: client setup as Subject: CN=urn:node:cnDevUNM2,DC=dataone,DC=org [org.dataone.integration.ContextAwareTestCaseDataone]
20151119-07:18:04: [WARN]: Unable to find a valid authoritative MN to use for the object: P1_201532223184558 [org.dataone.integration.ContextAwareTestCaseDataone]
20151119-07:18:04: [INFO]: creating a test object.  pid = P1_201532223184558 on https://mn-dev-unm-2.test.dataone.org/metacat/d1/mn/v2 [org.dataone.integration.ContextAwareTestCaseDataone]
20151119-07:18:04: [INFO]: SystemMetadata for pid: P1_201532223184558
<?xml version="1.0" encoding="UTF-8"?><d1_v2.0:systemMetadata xmlns:d1_v2.0="http://ns.dataone.org/service/types/v2.0" xmlns:d1="http://ns.dataone.org/service/types/v1"><serialVersion>1</serialVersion><identifier>P1_201532223184558</identifier><formatId>eml://ecoinformatics.org/eml-2.0.1</formatId><size>17181</size><checksum algorithm="MD5">03ce09c6b4c3efc1681f3023402998a2</checksum><submitter>CN=urn:node:cnDevUNM2,DC=dataone,DC=org</submitter><rightsHolder>CN=testRightsHolder,DC=dataone,DC=org</rightsHolder><accessPolicy><allow><subject>public</subject><permission>read</permission></allow></accessPolicy><dateUploaded>2015-11-19T07:18:04.576+00:00</dateUploaded><dateSysMetadataModified>2015-11-19T07:18:04.576+00:00</dateSysMetadataModified><originMemberNode>bogusAuthoritativeNode</originMemberNode><authoritativeMemberNode>bogusAuthoritativeNode</authoritativeMemberNode><seriesId>S1_201532223184560</seriesId></d1_v2.0:systemMetadata> [org.dataone.integration.ContextAwareTestCaseDataone]
20151119-07:18:06: [INFO]: rest call info: POST https://mn-dev-unm-2.test.dataone.org/metacat/d1/mn/v2/object; MMP message has: ParamPart:pid = P1_201532223184558; FilePart:object = /tmp/mmp.output.7426760231970377454.tmp (17181 bytes); FilePart:sysmeta = /tmp/mmp.output.2412645806977525607.tmp (946 bytes);  [org.dataone.client.rest.RestClient]
20151119-07:18:06: [INFO]: object created.  pid = P1_201532223184558 [org.dataone.integration.ContextAwareTestCaseDataone]
20151119-07:18:16: [INFO]: Created SID (S1_201532223184560) and head PID (P1_201532223184558) pair. [org.dataone.integration.ContextAwareTestCaseDataone]
20151119-07:18:16: [INFO]: rest call info: HEAD https://mn-dev-unm-2.test.dataone.org/metacat/d1/mn/v2/object/S1_201532223184560 [org.dataone.client.rest.RestClient]
20151119-07:18:16: [INFO]: rest call info: HEAD https://mn-dev-unm-2.test.dataone.org/metacat/d1/mn/v2/object/P1_201532223184558 [org.dataone.client.rest.RestClient]
20151119-07:18:16: [INFO]: **************************************************** [org.dataone.integration.ContextAwareTestCaseDataone]
20151119-07:18:16: [INFO]: ***  context label:   DEV2 [org.dataone.integration.ContextAwareTestCaseDataone]
20151119-07:18:16: [INFO]: **************************************************** [org.dataone.integration.ContextAwareTestCaseDataone]
20151119-07:18:16: [INFO]: **************************************************** [org.dataone.integration.ContextAwareTestCaseDataone]
20151119-07:18:16: [INFO]: Testing create() method ...  [org.dataone.integration.ContextAwareTestCaseDataone]
20151119-07:18:17: [INFO]: rest call info: GET https://mn-dev-ucsb-1.test.dataone.org/metacat/d1/mn/v2/monitor/ping [org.dataone.client.rest.RestClient]
20151119-07:18:17: [INFO]: MN excluded from test: https://mn-dev-ucsb-1.test.dataone.org/metacat/d1/mn [org.dataone.integration.ContextAwareTestCaseDataone]
20151119-07:18:18: [INFO]: rest call info: GET https://mn-dev-ucsb-2.test.dataone.org/metacat/d1/mn/v2/monitor/ping [org.dataone.client.rest.RestClient]
20151119-07:18:18: [INFO]: MN included in test: https://mn-dev-ucsb-2.test.dataone.org/metacat/d1/mn [org.dataone.integration.ContextAwareTestCaseDataone]
20151119-07:18:18: [INFO]: rest call info: GET https://mn-dev-unm-1.test.dataone.org/metacat/d1/mn/v2/monitor/ping [org.dataone.client.rest.RestClient]
20151119-07:18:18: [INFO]: MN excluded from test: https://mn-dev-unm-1.test.dataone.org/metacat/d1/mn [org.dataone.integration.ContextAwareTestCaseDataone]
20151119-07:18:18: [INFO]: rest call info: GET https://mn-dev-unm-2.test.dataone.org/metacat/d1/mn/v2/monitor/ping [org.dataone.client.rest.RestClient]
20151119-07:18:18: [INFO]: MN included in test: https://mn-dev-unm-2.test.dataone.org/metacat/d1/mn [org.dataone.integration.ContextAwareTestCaseDataone]
20151119-07:18:48: [INFO]: rest call info: POST https://mn-dev-ucsb-2.test.dataone.org/metacat/d1/mn/v2/object; MMP message has: ParamPart:pid = P12015322231818550; FilePart:object = /tmp/mmp.output.1413578496693760643.tmp (17181 bytes); FilePart:sysmeta = /tmp/mmp.output.8221664054595676916.tmp (758 bytes);  [org.dataone.client.rest.RestClient]
org.dataone.service.exceptions.ServiceFailure: class org.dataone.client.exception.ClientSideException: /Read timed out
	at org.dataone.client.rest.HttpMultipartRestClient.doPostRequest(HttpMultipartRestClient.java:460)
	at org.dataone.client.v2.impl.MultipartMNode.create(MultipartMNode.java:495)
	at org.dataone.integration.adapters.CommonCallAdapter.create(CommonCallAdapter.java:505)
	at org.dataone.integration.it.testImplementations.SidCommonTestImplementations.testCreate(SidCommonTestImplementations.java:473)
	at sun.reflect.NativeMethodAccessorImpl.invoke0(Native Method)
	at sun.reflect.NativeMethodAccessorImpl.invoke(NativeMethodAccessorImpl.java:57)
	at sun.reflect.DelegatingMethodAccessorImpl.invoke(DelegatingMethodAccessorImpl.java:43)
	at java.lang.reflect.Method.invoke(Method.java:606)
	at org.junit.runners.model.FrameworkMethod$1.runReflectiveCall(FrameworkMethod.java:44)
	at org.junit.internal.runners.model.ReflectiveCallable.run(ReflectiveCallable.java:15)
	at org.junit.runners.model.FrameworkMethod.invokeExplosively(FrameworkMethod.java:41)
	at org.junit.internal.runners.statements.InvokeMethod.evaluate(InvokeMethod.java:20)
	at org.junit.rules.Verifier$1.evaluate(Verifier.java:34)
	at org.junit.internal.runners.statements.RunBefores.evaluate(RunBefores.java:28)
	at org.junit.runners.BlockJUnit4ClassRunner.runChild(BlockJUnit4ClassRunner.java:76)
	at org.junit.runners.BlockJUnit4ClassRunner.runChild(BlockJUnit4ClassRunner.java:50)
	at org.junit.runners.ParentRunner$3.run(ParentRunner.java:193)
	at org.junit.runners.ParentRunner$1.schedule(ParentRunner.java:52)
	at org.junit.runners.ParentRunner.runChildren(ParentRunner.java:191)
	at org.junit.runners.ParentRunner.access$000(ParentRunner.java:42)
	at org.junit.runners.ParentRunner$2.evaluate(ParentRunner.java:184)
	at org.junit.runners.ParentRunner.run(ParentRunner.java:236)
	at org.apache.maven.surefire.junit4.JUnit4TestSet.execute(JUnit4TestSet.java:53)
	at org.apache.maven.surefire.junit4.JUnit4Provider.executeTestSet(JUnit4Provider.java:119)
	at org.apache.maven.surefire.junit4.JUnit4Provider.invoke(JUnit4Provider.java:101)
	at sun.reflect.NativeMethodAccessorImpl.invoke0(Native Method)
	at sun.reflect.NativeMethodAccessorImpl.invoke(NativeMethodAccessorImpl.java:57)
	at sun.reflect.DelegatingMethodAccessorImpl.invoke(DelegatingMethodAccessorImpl.java:43)
	at java.lang.reflect.Method.invoke(Method.java:606)
	at org.apache.maven.surefire.booter.ProviderFactory$ClassLoaderProxy.invoke(ProviderFactory.java:103)
	at com.sun.proxy.$Proxy0.invoke(Unknown Source)
	at org.apache.maven.surefire.booter.SurefireStarter.invokeProvider(SurefireStarter.java:150)
	at org.apache.maven.surefire.booter.SurefireStarter.runSuitesInProcess(SurefireStarter.java:91)
	at org.apache.maven.surefire.booter.ForkedBooter.main(ForkedBooter.java:69)
Caused by: org.dataone.client.exception.ClientSideException: /Read timed out
	... 34 more
Caused by: java.net.SocketTimeoutException: Read timed out
	at java.net.SocketInputStream.socketRead0(Native Method)
	at java.net.SocketInputStream.read(SocketInputStream.java:152)
	at java.net.SocketInputStream.read(SocketInputStream.java:122)
	at sun.security.ssl.InputRecord.readFully(InputRecord.java:442)
	at sun.security.ssl.InputRecord.read(InputRecord.java:480)
	at sun.security.ssl.SSLSocketImpl.readRecord(SSLSocketImpl.java:946)
	at sun.security.ssl.SSLSocketImpl.readDataRecord(SSLSocketImpl.java:903)
	at sun.security.ssl.AppInputStream.read(AppInputStream.java:102)
	at org.apache.http.impl.io.SessionInputBufferImpl.streamRead(SessionInputBufferImpl.java:136)
	at org.apache.http.impl.io.SessionInputBufferImpl.fillBuffer(SessionInputBufferImpl.java:152)
	at org.apache.http.impl.io.SessionInputBufferImpl.readLine(SessionInputBufferImpl.java:270)
	at org.apache.http.impl.conn.DefaultHttpResponseParser.parseHead(DefaultHttpResponseParser.java:140)
	at org.apache.http.impl.conn.DefaultHttpResponseParser.parseHead(DefaultHttpResponseParser.java:57)
	at org.apache.http.impl.io.AbstractMessageParser.parse(AbstractMessageParser.java:260)
	at org.apache.http.impl.DefaultBHttpClientConnection.receiveResponseHeader(DefaultBHttpClientConnection.java:161)
	at sun.reflect.GeneratedMethodAccessor9.invoke(Unknown Source)
	at sun.reflect.DelegatingMethodAccessorImpl.invoke(DelegatingMethodAccessorImpl.java:43)
	at java.lang.reflect.Method.invoke(Method.java:606)
	at org.apache.http.impl.conn.CPoolProxy.invoke(CPoolProxy.java:138)
	at com.sun.proxy.$Proxy9.receiveResponseHeader(Unknown Source)
	at org.apache.http.protocol.HttpRequestExecutor.doReceiveResponse(HttpRequestExecutor.java:271)
	at org.apache.http.protocol.HttpRequestExecutor.execute(HttpRequestExecutor.java:123)
	at org.apache.http.impl.execchain.MainClientExec.execute(MainClientExec.java:254)
	at org.apache.http.impl.execchain.ProtocolExec.execute(ProtocolExec.java:195)
	at org.apache.http.impl.execchain.RetryExec.execute(RetryExec.java:86)
	at org.apache.http.impl.execchain.RedirectExec.execute(RedirectExec.java:108)
	at org.apache.http.impl.client.InternalHttpClient.doExecute(InternalHttpClient.java:186)
	at org.apache.http.impl.client.CloseableHttpClient.execute(CloseableHttpClient.java:82)
	at org.apache.http.impl.client.CloseableHttpClient.execute(CloseableHttpClient.java:106)
	at org.apache.http.impl.client.CloseableHttpClient.execute(CloseableHttpClient.java:57)
	at org.dataone.client.rest.RestClient.doRequest(RestClient.java:294)
	at org.dataone.client.rest.RestClient.doRequestMMBody(RestClient.java:272)
	at org.dataone.client.rest.RestClient.doPostRequest(RestClient.java:192)
	at org.dataone.client.rest.HttpMultipartRestClient.doPostRequest(HttpMultipartRestClient.java:453)
	... 33 more
20151119-07:18:50: [INFO]: rest call info: POST https://mn-dev-unm-2.test.dataone.org/metacat/d1/mn/v2/object; MMP message has: ParamPart:pid = P12015322231848816; FilePart:object = /tmp/mmp.output.4251102158699303964.tmp (17181 bytes); FilePart:sysmeta = /tmp/mmp.output.8932748220471969018.tmp (758 bytes);  [org.dataone.client.rest.RestClient]
20151119-07:18:50: [INFO]: Testing create(), created new object: org.dataone.service.types.v1.Identifier@df87b9a1 [org.dataone.integration.ContextAwareTestCaseDataone]
20151119-07:18:50: [INFO]: rest call info: GET https://mn-dev-unm-2.test.dataone.org/metacat/d1/mn/v2/meta/S12015322231848818 [org.dataone.client.rest.RestClient]
20151119-07:18:50: [INFO]: **************************************************** [org.dataone.integration.ContextAwareTestCaseDataone]
20151119-07:18:50: [INFO]: ***  context label:   DEV2 [org.dataone.integration.ContextAwareTestCaseDataone]
20151119-07:18:50: [INFO]: **************************************************** [org.dataone.integration.ContextAwareTestCaseDataone]
20151119-07:18:50: [INFO]: **************************************************** [org.dataone.integration.ContextAwareTestCaseDataone]
20151119-07:18:50: [INFO]: Testing delete() method ...  [org.dataone.integration.ContextAwareTestCaseDataone]
20151119-07:18:50: [INFO]: Testing delete(), Case1 [org.dataone.integration.ContextAwareTestCaseDataone]
20151119-07:18:51: [INFO]: rest call info: GET https://mn-dev-ucsb-1.test.dataone.org/metacat/d1/mn/v2/monitor/ping [org.dataone.client.rest.RestClient]
20151119-07:18:51: [INFO]: MN excluded from test: https://mn-dev-ucsb-1.test.dataone.org/metacat/d1/mn [org.dataone.integration.ContextAwareTestCaseDataone]
20151119-07:18:51: [INFO]: rest call info: GET https://mn-dev-ucsb-2.test.dataone.org/metacat/d1/mn/v2/monitor/ping [org.dataone.client.rest.RestClient]
20151119-07:18:51: [INFO]: MN included in test: https://mn-dev-ucsb-2.test.dataone.org/metacat/d1/mn [org.dataone.integration.ContextAwareTestCaseDataone]
20151119-07:18:52: [INFO]: rest call info: GET https://mn-dev-unm-1.test.dataone.org/metacat/d1/mn/v2/monitor/ping [org.dataone.client.rest.RestClient]
20151119-07:18:52: [INFO]: MN excluded from test: https://mn-dev-unm-1.test.dataone.org/metacat/d1/mn [org.dataone.integration.ContextAwareTestCaseDataone]
20151119-07:18:52: [INFO]: rest call info: GET https://mn-dev-unm-2.test.dataone.org/metacat/d1/mn/v2/monitor/ping [org.dataone.client.rest.RestClient]
20151119-07:18:52: [INFO]: MN included in test: https://mn-dev-unm-2.test.dataone.org/metacat/d1/mn [org.dataone.integration.ContextAwareTestCaseDataone]
20151119-07:18:52: [INFO]: CREATING test object... pid: P1_201532223185276 with a sid: S1_201532223185278 obsoletes: null obsoletedBy: null [org.dataone.integration.ContextAwareTestCaseDataone]
20151119-07:18:52: [INFO]: certificate directory: /etc/dataone/client/testClientCerts/ [org.dataone.integration.ContextAwareTestCaseDataone]
20151119-07:18:52: [INFO]: certificate filename: cnDevUNM2 [org.dataone.integration.ContextAwareTestCaseDataone]
20151119-07:18:52: [INFO]: client setup as Subject: CN=urn:node:cnDevUNM2,DC=dataone,DC=org [org.dataone.integration.ContextAwareTestCaseDataone]
20151119-07:18:52: [WARN]: Unable to find a valid authoritative MN to use for the object: P1_201532223185276 [org.dataone.integration.ContextAwareTestCaseDataone]
20151119-07:18:52: [INFO]: creating a test object.  pid = P1_201532223185276 on https://mn-dev-ucsb-2.test.dataone.org/metacat/d1/mn/v2 [org.dataone.integration.ContextAwareTestCaseDataone]
20151119-07:18:52: [INFO]: SystemMetadata for pid: P1_201532223185276
<?xml version="1.0" encoding="UTF-8"?><d1_v2.0:systemMetadata xmlns:d1_v2.0="http://ns.dataone.org/service/types/v2.0" xmlns:d1="http://ns.dataone.org/service/types/v1"><serialVersion>1</serialVersion><identifier>P1_201532223185276</identifier><formatId>eml://ecoinformatics.org/eml-2.0.1</formatId><size>17181</size><checksum algorithm="MD5">03ce09c6b4c3efc1681f3023402998a2</checksum><submitter>CN=urn:node:cnDevUNM2,DC=dataone,DC=org</submitter><rightsHolder>CN=testRightsHolder,DC=dataone,DC=org</rightsHolder><accessPolicy><allow><subject>public</subject><permission>read</permission></allow></accessPolicy><dateUploaded>2015-11-19T07:18:52.094+00:00</dateUploaded><dateSysMetadataModified>2015-11-19T07:18:52.094+00:00</dateSysMetadataModified><originMemberNode>bogusAuthoritativeNode</originMemberNode><authoritativeMemberNode>bogusAuthoritativeNode</authoritativeMemberNode><seriesId>S1_201532223185278</seriesId></d1_v2.0:systemMetadata> [org.dataone.integration.ContextAwareTestCaseDataone]
20151119-07:18:53: [INFO]: rest call info: POST https://mn-dev-ucsb-2.test.dataone.org/metacat/d1/mn/v2/object; MMP message has: ParamPart:pid = P1_201532223185276; FilePart:object = /tmp/mmp.output.8480832493651994946.tmp (17181 bytes); FilePart:sysmeta = /tmp/mmp.output.4901240241304668136.tmp (946 bytes);  [org.dataone.client.rest.RestClient]
20151119-07:18:53: [INFO]: object created.  pid = P1_201532223185276 [org.dataone.integration.ContextAwareTestCaseDataone]
20151119-07:19:03: [INFO]: Created SID (S1_201532223185278) and head PID (P1_201532223185276) pair. [org.dataone.integration.ContextAwareTestCaseDataone]
org.dataone.service.exceptions.ServiceFailure: class org.dataone.client.exception.ClientSideException: /Read timed out
	at org.dataone.client.rest.HttpMultipartRestClient.doDeleteRequest(HttpMultipartRestClient.java:384)
	at org.dataone.client.rest.MultipartD1Node.delete(MultipartD1Node.java:770)
	at org.dataone.client.v2.impl.MultipartMNode.delete(MultipartMNode.java:618)
	at org.dataone.integration.adapters.CommonCallAdapter.delete(CommonCallAdapter.java:533)
	at org.dataone.integration.it.testImplementations.SidCommonTestImplementations.testDelete(SidCommonTestImplementations.java:523)
	at sun.reflect.NativeMethodAccessorImpl.invoke0(Native Method)
	at sun.reflect.NativeMethodAccessorImpl.invoke(NativeMethodAccessorImpl.java:57)
	at sun.reflect.DelegatingMethodAccessorImpl.invoke(DelegatingMethodAccessorImpl.java:43)
	at java.lang.reflect.Method.invoke(Method.java:606)
	at org.junit.runners.model.FrameworkMethod$1.runReflectiveCall(FrameworkMethod.java:44)
	at org.junit.internal.runners.model.ReflectiveCallable.run(ReflectiveCallable.java:15)
	at org.junit.runners.model.FrameworkMethod.invokeExplosively(FrameworkMethod.java:41)
20151119-07:19:43: [INFO]: rest call info: DELETE https://mn-dev-ucsb-2.test.dataone.org/metacat/d1/mn/v2/object/S1_201532223185278 [org.dataone.client.rest.RestClient]
	at org.junit.internal.runners.statements.InvokeMethod.evaluate(InvokeMethod.java:20)
	at org.junit.rules.Verifier$1.evaluate(Verifier.java:34)
	at org.junit.internal.runners.statements.RunBefores.evaluate(RunBefores.java:28)
	at org.junit.runners.BlockJUnit4ClassRunner.runChild(BlockJUnit4ClassRunner.java:76)
	at org.junit.runners.BlockJUnit4ClassRunner.runChild(BlockJUnit4ClassRunner.java:50)
	at org.junit.runners.ParentRunner$3.run(ParentRunner.java:193)
	at org.junit.runners.ParentRunner$1.schedule(ParentRunner.java:52)
	at org.junit.runners.ParentRunner.runChildren(ParentRunner.java:191)
	at org.junit.runners.ParentRunner.access$000(ParentRunner.java:42)
	at org.junit.runners.ParentRunner$2.evaluate(ParentRunner.java:184)
	at org.junit.runners.ParentRunner.run(ParentRunner.java:236)
	at org.apache.maven.surefire.junit4.JUnit4TestSet.execute(JUnit4TestSet.java:53)
	at org.apache.maven.surefire.junit4.JUnit4Provider.executeTestSet(JUnit4Provider.java:119)
	at org.apache.maven.surefire.junit4.JUnit4Provider.invoke(JUnit4Provider.java:101)
	at sun.reflect.NativeMethodAccessorImpl.invoke0(Native Method)
	at sun.reflect.NativeMethodAccessorImpl.invoke(NativeMethodAccessorImpl.java:57)
	at sun.reflect.DelegatingMethodAccessorImpl.invoke(DelegatingMethodAccessorImpl.java:43)
	at java.lang.reflect.Method.invoke(Method.java:606)
	at org.apache.maven.surefire.booter.ProviderFactory$ClassLoaderProxy.invoke(ProviderFactory.java:103)
	at com.sun.proxy.$Proxy0.invoke(Unknown Source)
	at org.apache.maven.surefire.booter.SurefireStarter.invokeProvider(SurefireStarter.java:150)
	at org.apache.maven.surefire.booter.SurefireStarter.runSuitesInProcess(SurefireStarter.java:91)
	at org.apache.maven.surefire.booter.ForkedBooter.main(ForkedBooter.java:69)
Caused by: org.dataone.client.exception.ClientSideException: /Read timed out
	... 35 more
Caused by: java.net.SocketTimeoutException: Read timed out
	at java.net.SocketInputStream.socketRead0(Native Method)
	at java.net.SocketInputStream.read(SocketInputStream.java:152)
	at java.net.SocketInputStream.read(SocketInputStream.java:122)
	at sun.security.ssl.InputRecord.readFully(InputRecord.java:442)
	at sun.security.ssl.InputRecord.read(InputRecord.java:480)
	at sun.security.ssl.SSLSocketImpl.readRecord(SSLSocketImpl.java:946)
	at sun.security.ssl.SSLSocketImpl.readDataRecord(SSLSocketImpl.java:903)
	at sun.security.ssl.AppInputStream.read(AppInputStream.java:102)
	at org.apache.http.impl.io.SessionInputBufferImpl.streamRead(SessionInputBufferImpl.java:136)
	at org.apache.http.impl.io.SessionInputBufferImpl.fillBuffer(SessionInputBufferImpl.java:152)
	at org.apache.http.impl.io.SessionInputBufferImpl.readLine(SessionInputBufferImpl.java:270)
	at org.apache.http.impl.conn.DefaultHttpResponseParser.parseHead(DefaultHttpResponseParser.java:140)
	at org.apache.http.impl.conn.DefaultHttpResponseParser.parseHead(DefaultHttpResponseParser.java:57)
	at org.apache.http.impl.io.AbstractMessageParser.parse(AbstractMessageParser.java:260)
	at org.apache.http.impl.DefaultBHttpClientConnection.receiveResponseHeader(DefaultBHttpClientConnection.java:161)
	at sun.reflect.GeneratedMethodAccessor9.invoke(Unknown Source)
	at sun.reflect.DelegatingMethodAccessorImpl.invoke(DelegatingMethodAccessorImpl.java:43)
	at java.lang.reflect.Method.invoke(Method.java:606)
	at org.apache.http.impl.conn.CPoolProxy.invoke(CPoolProxy.java:138)
	at com.sun.proxy.$Proxy9.receiveResponseHeader(Unknown Source)
	at org.apache.http.protocol.HttpRequestExecutor.doReceiveResponse(HttpRequestExecutor.java:271)
	at org.apache.http.protocol.HttpRequestExecutor.execute(HttpRequestExecutor.java:123)
	at org.apache.http.impl.execchain.MainClientExec.execute(MainClientExec.java:254)
	at org.apache.http.impl.execchain.ProtocolExec.execute(ProtocolExec.java:195)
	at org.apache.http.impl.execchain.RetryExec.execute(RetryExec.java:86)
	at org.apache.http.impl.execchain.RedirectExec.execute(RedirectExec.java:108)
	at org.apache.http.impl.client.InternalHttpClient.doExecute(InternalHttpClient.java:186)
	at org.apache.http.impl.client.CloseableHttpClient.execute(CloseableHttpClient.java:82)
	at org.apache.http.impl.client.CloseableHttpClient.execute(CloseableHttpClient.java:106)
	at org.apache.http.impl.client.CloseableHttpClient.execute(CloseableHttpClient.java:57)
	at org.dataone.client.rest.RestClient.doRequest(RestClient.java:294)
	at org.dataone.client.rest.RestClient.doRequestNoBody(RestClient.java:230)
	at org.dataone.client.rest.RestClient.doDeleteRequest(RestClient.java:170)
	at org.dataone.client.rest.HttpMultipartRestClient.doDeleteRequest(HttpMultipartRestClient.java:377)
	... 34 more
20151119-07:19:43: [INFO]: CREATING test object... pid: P1_2015322231943521 with a sid: S1_2015322231943523 obsoletes: null obsoletedBy: null [org.dataone.integration.ContextAwareTestCaseDataone]
20151119-07:19:43: [INFO]: certificate directory: /etc/dataone/client/testClientCerts/ [org.dataone.integration.ContextAwareTestCaseDataone]
20151119-07:19:43: [INFO]: certificate filename: cnDevUNM2 [org.dataone.integration.ContextAwareTestCaseDataone]
20151119-07:19:43: [INFO]: client setup as Subject: CN=urn:node:cnDevUNM2,DC=dataone,DC=org [org.dataone.integration.ContextAwareTestCaseDataone]
20151119-07:19:43: [WARN]: Unable to find a valid authoritative MN to use for the object: P1_2015322231943521 [org.dataone.integration.ContextAwareTestCaseDataone]
20151119-07:19:43: [INFO]: creating a test object.  pid = P1_2015322231943521 on https://mn-dev-unm-2.test.dataone.org/metacat/d1/mn/v2 [org.dataone.integration.ContextAwareTestCaseDataone]
20151119-07:19:43: [INFO]: SystemMetadata for pid: P1_2015322231943521
<?xml version="1.0" encoding="UTF-8"?><d1_v2.0:systemMetadata xmlns:d1_v2.0="http://ns.dataone.org/service/types/v2.0" xmlns:d1="http://ns.dataone.org/service/types/v1"><serialVersion>1</serialVersion><identifier>P1_2015322231943521</identifier><formatId>eml://ecoinformatics.org/eml-2.0.1</formatId><size>17181</size><checksum algorithm="MD5">03ce09c6b4c3efc1681f3023402998a2</checksum><submitter>CN=urn:node:cnDevUNM2,DC=dataone,DC=org</submitter><rightsHolder>CN=testRightsHolder,DC=dataone,DC=org</rightsHolder><accessPolicy><allow><subject>public</subject><permission>read</permission></allow></accessPolicy><dateUploaded>2015-11-19T07:19:43.539+00:00</dateUploaded><dateSysMetadataModified>2015-11-19T07:19:43.539+00:00</dateSysMetadataModified><originMemberNode>bogusAuthoritativeNode</originMemberNode><authoritativeMemberNode>bogusAuthoritativeNode</authoritativeMemberNode><seriesId>S1_2015322231943523</seriesId></d1_v2.0:systemMetadata> [org.dataone.integration.ContextAwareTestCaseDataone]
20151119-07:19:44: [INFO]: rest call info: POST https://mn-dev-unm-2.test.dataone.org/metacat/d1/mn/v2/object; MMP message has: ParamPart:pid = P1_2015322231943521; FilePart:object = /tmp/mmp.output.4770872234005094499.tmp (17181 bytes); FilePart:sysmeta = /tmp/mmp.output.2787796262850847972.tmp (948 bytes);  [org.dataone.client.rest.RestClient]
20151119-07:19:44: [INFO]: object created.  pid = P1_2015322231943521 [org.dataone.integration.ContextAwareTestCaseDataone]
20151119-07:19:54: [INFO]: Created SID (S1_2015322231943523) and head PID (P1_2015322231943521) pair. [org.dataone.integration.ContextAwareTestCaseDataone]
20151119-07:20:05: [INFO]: rest call info: DELETE https://mn-dev-unm-2.test.dataone.org/metacat/d1/mn/v2/object/S1_2015322231943523 [org.dataone.client.rest.RestClient]
20151119-07:20:05: [INFO]: rest call info: GET https://mn-dev-unm-2.test.dataone.org/metacat/d1/mn/v2/object/P1_2015322231943521 [org.dataone.client.rest.RestClient]
20151119-07:20:05: [INFO]: **************************************************** [org.dataone.integration.ContextAwareTestCaseDataone]
20151119-07:20:05: [INFO]: ***  context label:   DEV2 [org.dataone.integration.ContextAwareTestCaseDataone]
20151119-07:20:05: [INFO]: **************************************************** [org.dataone.integration.ContextAwareTestCaseDataone]
20151119-07:20:05: [INFO]: **************************************************** [org.dataone.integration.ContextAwareTestCaseDataone]
20151119-07:20:05: [INFO]: Testing listObjects() method ...  [org.dataone.integration.ContextAwareTestCaseDataone]
20151119-07:20:05: [INFO]: Testing listObjects(), Case1 [org.dataone.integration.ContextAwareTestCaseDataone]
20151119-07:20:06: [INFO]: rest call info: GET https://mn-dev-ucsb-1.test.dataone.org/metacat/d1/mn/v2/monitor/ping [org.dataone.client.rest.RestClient]
20151119-07:20:06: [INFO]: MN excluded from test: https://mn-dev-ucsb-1.test.dataone.org/metacat/d1/mn [org.dataone.integration.ContextAwareTestCaseDataone]
20151119-07:20:06: [INFO]: rest call info: GET https://mn-dev-ucsb-2.test.dataone.org/metacat/d1/mn/v2/monitor/ping [org.dataone.client.rest.RestClient]
20151119-07:20:06: [INFO]: MN included in test: https://mn-dev-ucsb-2.test.dataone.org/metacat/d1/mn [org.dataone.integration.ContextAwareTestCaseDataone]
20151119-07:20:06: [INFO]: rest call info: GET https://mn-dev-unm-1.test.dataone.org/metacat/d1/mn/v2/monitor/ping [org.dataone.client.rest.RestClient]
20151119-07:20:06: [INFO]: MN excluded from test: https://mn-dev-unm-1.test.dataone.org/metacat/d1/mn [org.dataone.integration.ContextAwareTestCaseDataone]
20151119-07:20:06: [INFO]: rest call info: GET https://mn-dev-unm-2.test.dataone.org/metacat/d1/mn/v2/monitor/ping [org.dataone.client.rest.RestClient]
20151119-07:20:06: [INFO]: MN included in test: https://mn-dev-unm-2.test.dataone.org/metacat/d1/mn [org.dataone.integration.ContextAwareTestCaseDataone]
20151119-07:20:06: [INFO]: CREATING test object... pid: P1_201532223206847 with a sid: S1_201532223206849 obsoletes: null obsoletedBy: null [org.dataone.integration.ContextAwareTestCaseDataone]
20151119-07:20:06: [INFO]: certificate directory: /etc/dataone/client/testClientCerts/ [org.dataone.integration.ContextAwareTestCaseDataone]
20151119-07:20:06: [INFO]: certificate filename: cnDevUNM2 [org.dataone.integration.ContextAwareTestCaseDataone]
20151119-07:20:06: [INFO]: client setup as Subject: CN=urn:node:cnDevUNM2,DC=dataone,DC=org [org.dataone.integration.ContextAwareTestCaseDataone]
20151119-07:20:06: [WARN]: Unable to find a valid authoritative MN to use for the object: P1_201532223206847 [org.dataone.integration.ContextAwareTestCaseDataone]
20151119-07:20:06: [INFO]: creating a test object.  pid = P1_201532223206847 on https://mn-dev-ucsb-2.test.dataone.org/metacat/d1/mn/v2 [org.dataone.integration.ContextAwareTestCaseDataone]
20151119-07:20:06: [INFO]: SystemMetadata for pid: P1_201532223206847
<?xml version="1.0" encoding="UTF-8"?><d1_v2.0:systemMetadata xmlns:d1_v2.0="http://ns.dataone.org/service/types/v2.0" xmlns:d1="http://ns.dataone.org/service/types/v1"><serialVersion>1</serialVersion><identifier>P1_201532223206847</identifier><formatId>eml://ecoinformatics.org/eml-2.0.1</formatId><size>17181</size><checksum algorithm="MD5">03ce09c6b4c3efc1681f3023402998a2</checksum><submitter>CN=urn:node:cnDevUNM2,DC=dataone,DC=org</submitter><rightsHolder>CN=testRightsHolder,DC=dataone,DC=org</rightsHolder><accessPolicy><allow><subject>public</subject><permission>read</permission></allow></accessPolicy><dateUploaded>2015-11-19T07:20:06.868+00:00</dateUploaded><dateSysMetadataModified>2015-11-19T07:20:06.868+00:00</dateSysMetadataModified><originMemberNode>bogusAuthoritativeNode</originMemberNode><authoritativeMemberNode>bogusAuthoritativeNode</authoritativeMemberNode><seriesId>S1_201532223206849</seriesId></d1_v2.0:systemMetadata> [org.dataone.integration.ContextAwareTestCaseDataone]
20151119-07:20:37: [INFO]: rest call info: POST https://mn-dev-ucsb-2.test.dataone.org/metacat/d1/mn/v2/object; MMP message has: ParamPart:pid = P1_201532223206847; FilePart:object = /tmp/mmp.output.2943013966357758985.tmp (17181 bytes); FilePart:sysmeta = /tmp/mmp.output.1349521061714742112.tmp (946 bytes);  [org.dataone.client.rest.RestClient]
java.lang.reflect.InvocationTargetException
	at sun.reflect.NativeMethodAccessorImpl.invoke0(Native Method)
	at sun.reflect.NativeMethodAccessorImpl.invoke(NativeMethodAccessorImpl.java:57)
	at sun.reflect.DelegatingMethodAccessorImpl.invoke(DelegatingMethodAccessorImpl.java:43)
	at java.lang.reflect.Method.invoke(Method.java:606)
	at org.dataone.integration.it.testImplementations.SidCommonTestImplementations.testListObjects(SidCommonTestImplementations.java:577)
	at sun.reflect.NativeMethodAccessorImpl.invoke0(Native Method)
	at sun.reflect.NativeMethodAccessorImpl.invoke(NativeMethodAccessorImpl.java:57)
	at sun.reflect.DelegatingMethodAccessorImpl.invoke(DelegatingMethodAccessorImpl.java:43)
	at java.lang.reflect.Method.invoke(Method.java:606)
	at org.junit.runners.model.FrameworkMethod$1.runReflectiveCall(FrameworkMethod.java:44)
	at org.junit.internal.runners.model.ReflectiveCallable.run(ReflectiveCallable.java:15)
	at org.junit.runners.model.FrameworkMethod.invokeExplosively(FrameworkMethod.java:41)
	at org.junit.internal.runners.statements.InvokeMethod.evaluate(InvokeMethod.java:20)
	at org.junit.rules.Verifier$1.evaluate(Verifier.java:34)
	at org.junit.internal.runners.statements.RunBefores.evaluate(RunBefores.java:28)
	at org.junit.runners.BlockJUnit4ClassRunner.runChild(BlockJUnit4ClassRunner.java:76)
	at org.junit.runners.BlockJUnit4ClassRunner.runChild(BlockJUnit4ClassRunner.java:50)
	at org.junit.runners.ParentRunner$3.run(ParentRunner.java:193)
	at org.junit.runners.ParentRunner$1.schedule(ParentRunner.java:52)
	at org.junit.runners.ParentRunner.runChildren(ParentRunner.java:191)
	at org.junit.runners.ParentRunner.access$000(ParentRunner.java:42)
	at org.junit.runners.ParentRunner$2.evaluate(ParentRunner.java:184)
	at org.junit.runners.ParentRunner.run(ParentRunner.java:236)
	at org.apache.maven.surefire.junit4.JUnit4TestSet.execute(JUnit4TestSet.java:53)
	at org.apache.maven.surefire.junit4.JUnit4Provider.executeTestSet(JUnit4Provider.java:119)
	at org.apache.maven.surefire.junit4.JUnit4Provider.invoke(JUnit4Provider.java:101)
	at sun.reflect.NativeMethodAccessorImpl.invoke0(Native Method)
	at sun.reflect.NativeMethodAccessorImpl.invoke(NativeMethodAccessorImpl.java:57)
	at sun.reflect.DelegatingMethodAccessorImpl.invoke(DelegatingMethodAccessorImpl.java:43)
	at java.lang.reflect.Method.invoke(Method.java:606)
	at org.apache.maven.surefire.booter.ProviderFactory$ClassLoaderProxy.invoke(ProviderFactory.java:103)
	at com.sun.proxy.$Proxy0.invoke(Unknown Source)
	at org.apache.maven.surefire.booter.SurefireStarter.invokeProvider(SurefireStarter.java:150)
	at org.apache.maven.surefire.booter.SurefireStarter.runSuitesInProcess(SurefireStarter.java:91)
	at org.apache.maven.surefire.booter.ForkedBooter.main(ForkedBooter.java:69)
Caused by: org.dataone.client.exception.ClientSideException: Unable to create test object!/class org.dataone.client.exception.ClientSideException: /Read timed out
	at org.dataone.integration.ContextAwareTestCaseDataone.createTestObject(ContextAwareTestCaseDataone.java:1513)
	at org.dataone.integration.ContextAwareTestCaseDataone.createTestObject(ContextAwareTestCaseDataone.java:1345)
	at org.dataone.integration.it.testImplementations.SidCommonTestImplementations.createTestObject(SidCommonTestImplementations.java:216)
	at org.dataone.integration.it.testImplementations.SidMNTestImplementations.setupMNCase1(SidMNTestImplementations.java:88)
	... 35 more
Caused by: org.dataone.service.exceptions.ServiceFailure: class org.dataone.client.exception.ClientSideException: /Read timed out
	at org.dataone.client.rest.HttpMultipartRestClient.doPostRequest(HttpMultipartRestClient.java:460)
	at org.dataone.client.v2.impl.MultipartMNode.create(MultipartMNode.java:495)
	at org.dataone.integration.adapters.CommonCallAdapter.create(CommonCallAdapter.java:505)
	at org.dataone.integration.ContextAwareTestCaseDataone.createTestObject(ContextAwareTestCaseDataone.java:1504)
	... 38 more
Caused by: org.dataone.client.exception.ClientSideException: /Read timed out
	... 42 more
Caused by: java.net.SocketTimeoutException: Read timed out
	at java.net.SocketInputStream.socketRead0(Native Method)
	at java.net.SocketInputStream.read(SocketInputStream.java:152)
	at java.net.SocketInputStream.read(SocketInputStream.java:122)
	at sun.security.ssl.InputRecord.readFully(InputRecord.java:442)
	at sun.security.ssl.InputRecord.read(InputRecord.java:480)
	at sun.security.ssl.SSLSocketImpl.readRecord(SSLSocketImpl.java:946)
	at sun.security.ssl.SSLSocketImpl.readDataRecord(SSLSocketImpl.java:903)
	at sun.security.ssl.AppInputStream.read(AppInputStream.java:102)
	at org.apache.http.impl.io.SessionInputBufferImpl.streamRead(SessionInputBufferImpl.java:136)
	at org.apache.http.impl.io.SessionInputBufferImpl.fillBuffer(SessionInputBufferImpl.java:152)
	at org.apache.http.impl.io.SessionInputBufferImpl.readLine(SessionInputBufferImpl.java:270)
	at org.apache.http.impl.conn.DefaultHttpResponseParser.parseHead(DefaultHttpResponseParser.java:140)
	at org.apache.http.impl.conn.DefaultHttpResponseParser.parseHead(DefaultHttpResponseParser.java:57)
	at org.apache.http.impl.io.AbstractMessageParser.parse(AbstractMessageParser.java:260)
	at org.apache.http.impl.DefaultBHttpClientConnection.receiveResponseHeader(DefaultBHttpClientConnection.java:161)
	at sun.reflect.GeneratedMethodAccessor9.invoke(Unknown Source)
	at sun.reflect.DelegatingMethodAccessorImpl.invoke(DelegatingMethodAccessorImpl.java:43)
	at java.lang.reflect.Method.invoke(Method.java:606)
	at org.apache.http.impl.conn.CPoolProxy.invoke(CPoolProxy.java:138)
	at com.sun.proxy.$Proxy9.receiveResponseHeader(Unknown Source)
	at org.apache.http.protocol.HttpRequestExecutor.doReceiveResponse(HttpRequestExecutor.java:271)
	at org.apache.http.protocol.HttpRequestExecutor.execute(HttpRequestExecutor.java:123)
	at org.apache.http.impl.execchain.MainClientExec.execute(MainClientExec.java:254)
	at org.apache.http.impl.execchain.ProtocolExec.execute(ProtocolExec.java:195)
	at org.apache.http.impl.execchain.RetryExec.execute(RetryExec.java:86)
	at org.apache.http.impl.execchain.RedirectExec.execute(RedirectExec.java:108)
	at org.apache.http.impl.client.InternalHttpClient.doExecute(InternalHttpClient.java:186)
	at org.apache.http.impl.client.CloseableHttpClient.execute(CloseableHttpClient.java:82)
	at org.apache.http.impl.client.CloseableHttpClient.execute(CloseableHttpClient.java:106)
	at org.apache.http.impl.client.CloseableHttpClient.execute(CloseableHttpClient.java:57)
	at org.dataone.client.rest.RestClient.doRequest(RestClient.java:294)
	at org.dataone.client.rest.RestClient.doRequestMMBody(RestClient.java:272)
	at org.dataone.client.rest.RestClient.doPostRequest(RestClient.java:192)
	at org.dataone.client.rest.HttpMultipartRestClient.doPostRequest(HttpMultipartRestClient.java:453)
	... 41 more
20151119-07:20:37: [INFO]: CREATING test object... pid: P1_2015322232037118 with a sid: S1_2015322232037120 obsoletes: null obsoletedBy: null [org.dataone.integration.ContextAwareTestCaseDataone]
20151119-07:20:37: [INFO]: certificate directory: /etc/dataone/client/testClientCerts/ [org.dataone.integration.ContextAwareTestCaseDataone]
20151119-07:20:37: [INFO]: certificate filename: cnDevUNM2 [org.dataone.integration.ContextAwareTestCaseDataone]
20151119-07:20:37: [INFO]: client setup as Subject: CN=urn:node:cnDevUNM2,DC=dataone,DC=org [org.dataone.integration.ContextAwareTestCaseDataone]
20151119-07:20:37: [WARN]: Unable to find a valid authoritative MN to use for the object: P1_2015322232037118 [org.dataone.integration.ContextAwareTestCaseDataone]
20151119-07:20:37: [INFO]: creating a test object.  pid = P1_2015322232037118 on https://mn-dev-unm-2.test.dataone.org/metacat/d1/mn/v2 [org.dataone.integration.ContextAwareTestCaseDataone]
20151119-07:20:37: [INFO]: SystemMetadata for pid: P1_2015322232037118
<?xml version="1.0" encoding="UTF-8"?><d1_v2.0:systemMetadata xmlns:d1_v2.0="http://ns.dataone.org/service/types/v2.0" xmlns:d1="http://ns.dataone.org/service/types/v1"><serialVersion>1</serialVersion><identifier>P1_2015322232037118</identifier><formatId>eml://ecoinformatics.org/eml-2.0.1</formatId><size>17181</size><checksum algorithm="MD5">03ce09c6b4c3efc1681f3023402998a2</checksum><submitter>CN=urn:node:cnDevUNM2,DC=dataone,DC=org</submitter><rightsHolder>CN=testRightsHolder,DC=dataone,DC=org</rightsHolder><accessPolicy><allow><subject>public</subject><permission>read</permission></allow></accessPolicy><dateUploaded>2015-11-19T07:20:37.135+00:00</dateUploaded><dateSysMetadataModified>2015-11-19T07:20:37.135+00:00</dateSysMetadataModified><originMemberNode>bogusAuthoritativeNode</originMemberNode><authoritativeMemberNode>bogusAuthoritativeNode</authoritativeMemberNode><seriesId>S1_2015322232037120</seriesId></d1_v2.0:systemMetadata> [org.dataone.integration.ContextAwareTestCaseDataone]
20151119-07:20:38: [INFO]: rest call info: POST https://mn-dev-unm-2.test.dataone.org/metacat/d1/mn/v2/object; MMP message has: ParamPart:pid = P1_2015322232037118; FilePart:object = /tmp/mmp.output.1872397726458878987.tmp (17181 bytes); FilePart:sysmeta = /tmp/mmp.output.8012035300273875186.tmp (948 bytes);  [org.dataone.client.rest.RestClient]
20151119-07:20:38: [INFO]: object created.  pid = P1_2015322232037118 [org.dataone.integration.ContextAwareTestCaseDataone]
20151119-07:20:48: [INFO]: Created SID (S1_2015322232037120) and head PID (P1_2015322232037118) pair. [org.dataone.integration.ContextAwareTestCaseDataone]
20151119-07:20:58: [INFO]: rest call info: GET https://mn-dev-unm-2.test.dataone.org/metacat/d1/mn/v2/object?identifier=P1_2015322232037118 [org.dataone.client.rest.RestClient]
20151119-07:20:58: [INFO]: rest call info: GET https://mn-dev-unm-2.test.dataone.org/metacat/d1/mn/v2/object?identifier=S1_2015322232037120 [org.dataone.client.rest.RestClient]
20151119-07:20:58: [INFO]: **************************************************** [org.dataone.integration.ContextAwareTestCaseDataone]
20151119-07:20:58: [INFO]: ***  context label:   DEV2 [org.dataone.integration.ContextAwareTestCaseDataone]
20151119-07:20:58: [INFO]: **************************************************** [org.dataone.integration.ContextAwareTestCaseDataone]
20151119-07:20:58: [INFO]: **************************************************** [org.dataone.integration.ContextAwareTestCaseDataone]
20151119-07:20:58: [INFO]: Testing isAuthorized() method ...  [org.dataone.integration.ContextAwareTestCaseDataone]
20151119-07:20:58: [INFO]: Testing isAuthorized(), Case1 [org.dataone.integration.ContextAwareTestCaseDataone]
20151119-07:20:59: [INFO]: rest call info: GET https://mn-dev-ucsb-1.test.dataone.org/metacat/d1/mn/v2/monitor/ping [org.dataone.client.rest.RestClient]
20151119-07:20:59: [INFO]: MN excluded from test: https://mn-dev-ucsb-1.test.dataone.org/metacat/d1/mn [org.dataone.integration.ContextAwareTestCaseDataone]
20151119-07:20:59: [INFO]: rest call info: GET https://mn-dev-ucsb-2.test.dataone.org/metacat/d1/mn/v2/monitor/ping [org.dataone.client.rest.RestClient]
20151119-07:20:59: [INFO]: MN included in test: https://mn-dev-ucsb-2.test.dataone.org/metacat/d1/mn [org.dataone.integration.ContextAwareTestCaseDataone]
20151119-07:20:59: [INFO]: rest call info: GET https://mn-dev-unm-1.test.dataone.org/metacat/d1/mn/v2/monitor/ping [org.dataone.client.rest.RestClient]
20151119-07:20:59: [INFO]: MN excluded from test: https://mn-dev-unm-1.test.dataone.org/metacat/d1/mn [org.dataone.integration.ContextAwareTestCaseDataone]
20151119-07:20:59: [INFO]: rest call info: GET https://mn-dev-unm-2.test.dataone.org/metacat/d1/mn/v2/monitor/ping [org.dataone.client.rest.RestClient]
20151119-07:20:59: [INFO]: MN included in test: https://mn-dev-unm-2.test.dataone.org/metacat/d1/mn [org.dataone.integration.ContextAwareTestCaseDataone]
20151119-07:20:59: [INFO]: CREATING test object... pid: P1_2015322232059835 with a sid: S1_2015322232059838 obsoletes: null obsoletedBy: null [org.dataone.integration.ContextAwareTestCaseDataone]
20151119-07:20:59: [INFO]: certificate directory: /etc/dataone/client/testClientCerts/ [org.dataone.integration.ContextAwareTestCaseDataone]
20151119-07:20:59: [INFO]: certificate filename: cnDevUNM2 [org.dataone.integration.ContextAwareTestCaseDataone]
20151119-07:20:59: [INFO]: client setup as Subject: CN=urn:node:cnDevUNM2,DC=dataone,DC=org [org.dataone.integration.ContextAwareTestCaseDataone]
20151119-07:20:59: [WARN]: Unable to find a valid authoritative MN to use for the object: P1_2015322232059835 [org.dataone.integration.ContextAwareTestCaseDataone]
20151119-07:20:59: [INFO]: creating a test object.  pid = P1_2015322232059835 on https://mn-dev-ucsb-2.test.dataone.org/metacat/d1/mn/v2 [org.dataone.integration.ContextAwareTestCaseDataone]
20151119-07:20:59: [INFO]: SystemMetadata for pid: P1_2015322232059835
<?xml version="1.0" encoding="UTF-8"?><d1_v2.0:systemMetadata xmlns:d1_v2.0="http://ns.dataone.org/service/types/v2.0" xmlns:d1="http://ns.dataone.org/service/types/v1"><serialVersion>1</serialVersion><identifier>P1_2015322232059835</identifier><formatId>eml://ecoinformatics.org/eml-2.0.1</formatId><size>17181</size><checksum algorithm="MD5">03ce09c6b4c3efc1681f3023402998a2</checksum><submitter>CN=urn:node:cnDevUNM2,DC=dataone,DC=org</submitter><rightsHolder>CN=testRightsHolder,DC=dataone,DC=org</rightsHolder><accessPolicy><allow><subject>public</subject><permission>read</permission></allow></accessPolicy><dateUploaded>2015-11-19T07:20:59.852+00:00</dateUploaded><dateSysMetadataModified>2015-11-19T07:20:59.852+00:00</dateSysMetadataModified><originMemberNode>bogusAuthoritativeNode</originMemberNode><authoritativeMemberNode>bogusAuthoritativeNode</authoritativeMemberNode><seriesId>S1_2015322232059838</seriesId></d1_v2.0:systemMetadata> [org.dataone.integration.ContextAwareTestCaseDataone]
20151119-07:21:01: [INFO]: rest call info: POST https://mn-dev-ucsb-2.test.dataone.org/metacat/d1/mn/v2/object; MMP message has: ParamPart:pid = P1_2015322232059835; FilePart:object = /tmp/mmp.output.2521308767146864196.tmp (17181 bytes); FilePart:sysmeta = /tmp/mmp.output.1175609060600957132.tmp (948 bytes);  [org.dataone.client.rest.RestClient]
20151119-07:21:01: [INFO]: object created.  pid = P1_2015322232059835 [org.dataone.integration.ContextAwareTestCaseDataone]
20151119-07:21:11: [INFO]: Created SID (S1_2015322232059838) and head PID (P1_2015322232059835) pair. [org.dataone.integration.ContextAwareTestCaseDataone]
20151119-07:21:41: [INFO]: rest call info: GET https://mn-dev-ucsb-2.test.dataone.org/metacat/d1/mn/v2/isAuthorized/S1_2015322232059838?action=read [org.dataone.client.rest.RestClient]
20151119-07:21:44: [INFO]: rest call info: GET https://mn-dev-ucsb-2.test.dataone.org/metacat/d1/mn/v2/isAuthorized/P1_2015322232059835?action=read [org.dataone.client.rest.RestClient]
20151119-07:21:44: [INFO]: **************************************************** [org.dataone.integration.ContextAwareTestCaseDataone]
20151119-07:21:44: [INFO]: ***  context label:   DEV2 [org.dataone.integration.ContextAwareTestCaseDataone]
20151119-07:21:44: [INFO]: **************************************************** [org.dataone.integration.ContextAwareTestCaseDataone]
20151119-07:21:44: [INFO]: **************************************************** [org.dataone.integration.ContextAwareTestCaseDataone]
20151119-07:21:44: [INFO]: Testing view() method ...  [org.dataone.integration.ContextAwareTestCaseDataone]
20151119-07:21:44: [INFO]: Testing view(), Case1 [org.dataone.integration.ContextAwareTestCaseDataone]
20151119-07:21:44: [INFO]: rest call info: GET https://mn-dev-ucsb-1.test.dataone.org/metacat/d1/mn/v2/monitor/ping [org.dataone.client.rest.RestClient]
20151119-07:21:44: [INFO]: MN excluded from test: https://mn-dev-ucsb-1.test.dataone.org/metacat/d1/mn [org.dataone.integration.ContextAwareTestCaseDataone]
20151119-07:21:44: [INFO]: rest call info: GET https://mn-dev-ucsb-2.test.dataone.org/metacat/d1/mn/v2/monitor/ping [org.dataone.client.rest.RestClient]
20151119-07:21:44: [INFO]: MN included in test: https://mn-dev-ucsb-2.test.dataone.org/metacat/d1/mn [org.dataone.integration.ContextAwareTestCaseDataone]
20151119-07:21:45: [INFO]: rest call info: GET https://mn-dev-unm-1.test.dataone.org/metacat/d1/mn/v2/monitor/ping [org.dataone.client.rest.RestClient]
20151119-07:21:45: [INFO]: MN excluded from test: https://mn-dev-unm-1.test.dataone.org/metacat/d1/mn [org.dataone.integration.ContextAwareTestCaseDataone]
20151119-07:21:45: [INFO]: rest call info: GET https://mn-dev-unm-2.test.dataone.org/metacat/d1/mn/v2/monitor/ping [org.dataone.client.rest.RestClient]
20151119-07:21:45: [INFO]: MN included in test: https://mn-dev-unm-2.test.dataone.org/metacat/d1/mn [org.dataone.integration.ContextAwareTestCaseDataone]
20151119-07:21:45: [INFO]: CREATING test object... pid: P1_2015322232145747 with a sid: S1_2015322232145750 obsoletes: null obsoletedBy: null [org.dataone.integration.ContextAwareTestCaseDataone]
20151119-07:21:45: [INFO]: certificate directory: /etc/dataone/client/testClientCerts/ [org.dataone.integration.ContextAwareTestCaseDataone]
20151119-07:21:45: [INFO]: certificate filename: cnDevUNM2 [org.dataone.integration.ContextAwareTestCaseDataone]
20151119-07:21:45: [INFO]: client setup as Subject: CN=urn:node:cnDevUNM2,DC=dataone,DC=org [org.dataone.integration.ContextAwareTestCaseDataone]
20151119-07:21:45: [WARN]: Unable to find a valid authoritative MN to use for the object: P1_2015322232145747 [org.dataone.integration.ContextAwareTestCaseDataone]
20151119-07:21:45: [INFO]: creating a test object.  pid = P1_2015322232145747 on https://mn-dev-ucsb-2.test.dataone.org/metacat/d1/mn/v2 [org.dataone.integration.ContextAwareTestCaseDataone]
20151119-07:21:45: [INFO]: SystemMetadata for pid: P1_2015322232145747
<?xml version="1.0" encoding="UTF-8"?><d1_v2.0:systemMetadata xmlns:d1_v2.0="http://ns.dataone.org/service/types/v2.0" xmlns:d1="http://ns.dataone.org/service/types/v1"><serialVersion>1</serialVersion><identifier>P1_2015322232145747</identifier><formatId>eml://ecoinformatics.org/eml-2.0.1</formatId><size>17181</size><checksum algorithm="MD5">03ce09c6b4c3efc1681f3023402998a2</checksum><submitter>CN=urn:node:cnDevUNM2,DC=dataone,DC=org</submitter><rightsHolder>CN=testRightsHolder,DC=dataone,DC=org</rightsHolder><accessPolicy><allow><subject>public</subject><permission>read</permission></allow></accessPolicy><dateUploaded>2015-11-19T07:21:45.764+00:00</dateUploaded><dateSysMetadataModified>2015-11-19T07:21:45.764+00:00</dateSysMetadataModified><originMemberNode>bogusAuthoritativeNode</originMemberNode><authoritativeMemberNode>bogusAuthoritativeNode</authoritativeMemberNode><seriesId>S1_2015322232145750</seriesId></d1_v2.0:systemMetadata> [org.dataone.integration.ContextAwareTestCaseDataone]
20151119-07:22:16: [INFO]: rest call info: POST https://mn-dev-ucsb-2.test.dataone.org/metacat/d1/mn/v2/object; MMP message has: ParamPart:pid = P1_2015322232145747; FilePart:object = /tmp/mmp.output.7391108633191427861.tmp (17181 bytes); FilePart:sysmeta = /tmp/mmp.output.919187915924772672.tmp (948 bytes);  [org.dataone.client.rest.RestClient]
java.lang.reflect.InvocationTargetException
	at sun.reflect.NativeMethodAccessorImpl.invoke0(Native Method)
	at sun.reflect.NativeMethodAccessorImpl.invoke(NativeMethodAccessorImpl.java:57)
	at sun.reflect.DelegatingMethodAccessorImpl.invoke(DelegatingMethodAccessorImpl.java:43)
	at java.lang.reflect.Method.invoke(Method.java:606)
	at org.dataone.integration.it.testImplementations.SidCommonTestImplementations.testView(SidCommonTestImplementations.java:723)
	at sun.reflect.NativeMethodAccessorImpl.invoke0(Native Method)
	at sun.reflect.NativeMethodAccessorImpl.invoke(NativeMethodAccessorImpl.java:57)
	at sun.reflect.DelegatingMethodAccessorImpl.invoke(DelegatingMethodAccessorImpl.java:43)
	at java.lang.reflect.Method.invoke(Method.java:606)
	at org.junit.runners.model.FrameworkMethod$1.runReflectiveCall(FrameworkMethod.java:44)
	at org.junit.internal.runners.model.ReflectiveCallable.run(ReflectiveCallable.java:15)
	at org.junit.runners.model.FrameworkMethod.invokeExplosively(FrameworkMethod.java:41)
	at org.junit.internal.runners.statements.InvokeMethod.evaluate(InvokeMethod.java:20)
	at org.junit.rules.Verifier$1.evaluate(Verifier.java:34)
	at org.junit.internal.runners.statements.RunBefores.evaluate(RunBefores.java:28)
	at org.junit.runners.BlockJUnit4ClassRunner.runChild(BlockJUnit4ClassRunner.java:76)
	at org.junit.runners.BlockJUnit4ClassRunner.runChild(BlockJUnit4ClassRunner.java:50)
	at org.junit.runners.ParentRunner$3.run(ParentRunner.java:193)
	at org.junit.runners.ParentRunner$1.schedule(ParentRunner.java:52)
	at org.junit.runners.ParentRunner.runChildren(ParentRunner.java:191)
	at org.junit.runners.ParentRunner.access$000(ParentRunner.java:42)
	at org.junit.runners.ParentRunner$2.evaluate(ParentRunner.java:184)
	at org.junit.runners.ParentRunner.run(ParentRunner.java:236)
	at org.apache.maven.surefire.junit4.JUnit4TestSet.execute(JUnit4TestSet.java:53)
	at org.apache.maven.surefire.junit4.JUnit4Provider.executeTestSet(JUnit4Provider.java:119)
	at org.apache.maven.surefire.junit4.JUnit4Provider.invoke(JUnit4Provider.java:101)
	at sun.reflect.NativeMethodAccessorImpl.invoke0(Native Method)
	at sun.reflect.NativeMethodAccessorImpl.invoke(NativeMethodAccessorImpl.java:57)
	at sun.reflect.DelegatingMethodAccessorImpl.invoke(DelegatingMethodAccessorImpl.java:43)
	at java.lang.reflect.Method.invoke(Method.java:606)
	at org.apache.maven.surefire.booter.ProviderFactory$ClassLoaderProxy.invoke(ProviderFactory.java:103)
	at com.sun.proxy.$Proxy0.invoke(Unknown Source)
	at org.apache.maven.surefire.booter.SurefireStarter.invokeProvider(SurefireStarter.java:150)
	at org.apache.maven.surefire.booter.SurefireStarter.runSuitesInProcess(SurefireStarter.java:91)
	at org.apache.maven.surefire.booter.ForkedBooter.main(ForkedBooter.java:69)
Caused by: org.dataone.client.exception.ClientSideException: Unable to create test object!/class org.dataone.client.exception.ClientSideException: /Read timed out
	at org.dataone.integration.ContextAwareTestCaseDataone.createTestObject(ContextAwareTestCaseDataone.java:1513)
	at org.dataone.integration.ContextAwareTestCaseDataone.createTestObject(ContextAwareTestCaseDataone.java:1345)
	at org.dataone.integration.it.testImplementations.SidCommonTestImplementations.createTestObject(SidCommonTestImplementations.java:216)
	at org.dataone.integration.it.testImplementations.SidMNTestImplementations.setupMNCase1(SidMNTestImplementations.java:88)
	... 35 more
Caused by: org.dataone.service.exceptions.ServiceFailure: class org.dataone.client.exception.ClientSideException: /Read timed out
	at org.dataone.client.rest.HttpMultipartRestClient.doPostRequest(HttpMultipartRestClient.java:460)
	at org.dataone.client.v2.impl.MultipartMNode.create(MultipartMNode.java:495)
	at org.dataone.integration.adapters.CommonCallAdapter.create(CommonCallAdapter.java:505)
	at org.dataone.integration.ContextAwareTestCaseDataone.createTestObject(ContextAwareTestCaseDataone.java:1504)
	... 38 more
Caused by: org.dataone.client.exception.ClientSideException: /Read timed out
	... 42 more
Caused by: java.net.SocketTimeoutException: Read timed out
	at java.net.SocketInputStream.socketRead0(Native Method)
	at java.net.SocketInputStream.read(SocketInputStream.java:152)
	at java.net.SocketInputStream.read(SocketInputStream.java:122)
	at sun.security.ssl.InputRecord.readFully(InputRecord.java:442)
	at sun.security.ssl.InputRecord.read(InputRecord.java:480)
	at sun.security.ssl.SSLSocketImpl.readRecord(SSLSocketImpl.java:946)
	at sun.security.ssl.SSLSocketImpl.readDataRecord(SSLSocketImpl.java:903)
	at sun.security.ssl.AppInputStream.read(AppInputStream.java:102)
	at org.apache.http.impl.io.SessionInputBufferImpl.streamRead(SessionInputBufferImpl.java:136)
	at org.apache.http.impl.io.SessionInputBufferImpl.fillBuffer(SessionInputBufferImpl.java:152)
	at org.apache.http.impl.io.SessionInputBufferImpl.readLine(SessionInputBufferImpl.java:270)
	at org.apache.http.impl.conn.DefaultHttpResponseParser.parseHead(DefaultHttpResponseParser.java:140)
	at org.apache.http.impl.conn.DefaultHttpResponseParser.parseHead(DefaultHttpResponseParser.java:57)
	at org.apache.http.impl.io.AbstractMessageParser.parse(AbstractMessageParser.java:260)
	at org.apache.http.impl.DefaultBHttpClientConnection.receiveResponseHeader(DefaultBHttpClientConnection.java:161)
	at sun.reflect.GeneratedMethodAccessor9.invoke(Unknown Source)
	at sun.reflect.DelegatingMethodAccessorImpl.invoke(DelegatingMethodAccessorImpl.java:43)
	at java.lang.reflect.Method.invoke(Method.java:606)
	at org.apache.http.impl.conn.CPoolProxy.invoke(CPoolProxy.java:138)
	at com.sun.proxy.$Proxy9.receiveResponseHeader(Unknown Source)
	at org.apache.http.protocol.HttpRequestExecutor.doReceiveResponse(HttpRequestExecutor.java:271)
	at org.apache.http.protocol.HttpRequestExecutor.execute(HttpRequestExecutor.java:123)
	at org.apache.http.impl.execchain.MainClientExec.execute(MainClientExec.java:254)
	at org.apache.http.impl.execchain.ProtocolExec.execute(ProtocolExec.java:195)
	at org.apache.http.impl.execchain.RetryExec.execute(RetryExec.java:86)
	at org.apache.http.impl.execchain.RedirectExec.execute(RedirectExec.java:108)
	at org.apache.http.impl.client.InternalHttpClient.doExecute(InternalHttpClient.java:186)
	at org.apache.http.impl.client.CloseableHttpClient.execute(CloseableHttpClient.java:82)
	at org.apache.http.impl.client.CloseableHttpClient.execute(CloseableHttpClient.java:106)
	at org.apache.http.impl.client.CloseableHttpClient.execute(CloseableHttpClient.java:57)
	at org.dataone.client.rest.RestClient.doRequest(RestClient.java:294)
	at org.dataone.client.rest.RestClient.doRequestMMBody(RestClient.java:272)
	at org.dataone.client.rest.RestClient.doPostRequest(RestClient.java:192)
	at org.dataone.client.rest.HttpMultipartRestClient.doPostRequest(HttpMultipartRestClient.java:453)
	... 41 more
20151119-07:22:16: [INFO]: CREATING test object... pid: P1_2015322232216113 with a sid: S1_2015322232216115 obsoletes: null obsoletedBy: null [org.dataone.integration.ContextAwareTestCaseDataone]
20151119-07:22:16: [INFO]: certificate directory: /etc/dataone/client/testClientCerts/ [org.dataone.integration.ContextAwareTestCaseDataone]
20151119-07:22:16: [INFO]: certificate filename: cnDevUNM2 [org.dataone.integration.ContextAwareTestCaseDataone]
20151119-07:22:16: [INFO]: client setup as Subject: CN=urn:node:cnDevUNM2,DC=dataone,DC=org [org.dataone.integration.ContextAwareTestCaseDataone]
20151119-07:22:16: [WARN]: Unable to find a valid authoritative MN to use for the object: P1_2015322232216113 [org.dataone.integration.ContextAwareTestCaseDataone]
20151119-07:22:16: [INFO]: creating a test object.  pid = P1_2015322232216113 on https://mn-dev-unm-2.test.dataone.org/metacat/d1/mn/v2 [org.dataone.integration.ContextAwareTestCaseDataone]
20151119-07:22:16: [INFO]: SystemMetadata for pid: P1_2015322232216113
<?xml version="1.0" encoding="UTF-8"?><d1_v2.0:systemMetadata xmlns:d1_v2.0="http://ns.dataone.org/service/types/v2.0" xmlns:d1="http://ns.dataone.org/service/types/v1"><serialVersion>1</serialVersion><identifier>P1_2015322232216113</identifier><formatId>eml://ecoinformatics.org/eml-2.0.1</formatId><size>17181</size><checksum algorithm="MD5">03ce09c6b4c3efc1681f3023402998a2</checksum><submitter>CN=urn:node:cnDevUNM2,DC=dataone,DC=org</submitter><rightsHolder>CN=testRightsHolder,DC=dataone,DC=org</rightsHolder><accessPolicy><allow><subject>public</subject><permission>read</permission></allow></accessPolicy><dateUploaded>2015-11-19T07:22:16.129+00:00</dateUploaded><dateSysMetadataModified>2015-11-19T07:22:16.129+00:00</dateSysMetadataModified><originMemberNode>bogusAuthoritativeNode</originMemberNode><authoritativeMemberNode>bogusAuthoritativeNode</authoritativeMemberNode><seriesId>S1_2015322232216115</seriesId></d1_v2.0:systemMetadata> [org.dataone.integration.ContextAwareTestCaseDataone]
20151119-07:22:17: [INFO]: rest call info: POST https://mn-dev-unm-2.test.dataone.org/metacat/d1/mn/v2/object; MMP message has: ParamPart:pid = P1_2015322232216113; FilePart:object = /tmp/mmp.output.3596025547204903203.tmp (17181 bytes); FilePart:sysmeta = /tmp/mmp.output.7523246753717921924.tmp (948 bytes);  [org.dataone.client.rest.RestClient]
20151119-07:22:17: [INFO]: object created.  pid = P1_2015322232216113 [org.dataone.integration.ContextAwareTestCaseDataone]
20151119-07:22:27: [INFO]: Created SID (S1_2015322232216115) and head PID (P1_2015322232216113) pair. [org.dataone.integration.ContextAwareTestCaseDataone]
20151119-07:22:27: [INFO]: rest call info: GET https://mn-dev-unm-2.test.dataone.org/metacat/d1/mn/v2/views/default/S1_2015322232216115 [org.dataone.client.rest.RestClient]
20151119-07:22:28: [INFO]: rest call info: GET https://mn-dev-unm-2.test.dataone.org/metacat/d1/mn/v2/views/default/P1_2015322232216113 [org.dataone.client.rest.RestClient]
Tests run: 13, Failures: 12, Errors: 0, Skipped: 1, Time elapsed: 589.938 sec <<< FAILURE!

Results :

Failed tests: 
  testGetPackage(org.dataone.integration.it.testImplementations.SidMNTestImplementations): https://mn-dev-ucsb-2.test.dataone.org/metacat/d1/mn/v2 Case: 1 : InvocationTargetException : nullClientSideExceptionUnable to create metadata for MNPackage testing./Unable to create test object!/class org.dataone.client.exception.ClientSideException: /Read timed out
  testUpdate(org.dataone.integration.it.testImplementations.SidMNTestImplementations): testUpdate unable to set up : https://mn-dev-ucsb-2.test.dataone.org/metacat/d1/mn/v2 : InvocationTargetException : null
  testSidReuse(org.dataone.integration.it.testImplementations.SidMNTestImplementations): testSidReuse() : unable to set up test! : ClientSideException : Unable to create test object!/class org.dataone.client.exception.ClientSideException: /Read timed out
  testSidReuseDiffChain(org.dataone.integration.it.testImplementations.SidMNTestImplementations): testSidReuseDiffChain() : unable to set up test! : ClientSideException : Unable to create test object!/class org.dataone.client.exception.ClientSideException: /Read timed out
  testGetSystemMetadata(org.dataone.integration.it.testImplementations.SidMNTestImplementations): Case: 0 : class org.dataone.client.exception.ClientSideException: /Read timed out  [for host https://mn-dev-ucsb-2.test.dataone.org/metacat/d1/mn/v2 ]
  testGet(org.dataone.integration.it.testImplementations.SidMNTestImplementations): Case: 0 : class org.dataone.client.exception.ClientSideException: /Read timed out  [for host https://mn-dev-ucsb-2.test.dataone.org/metacat/d1/mn/v2 ]
  testDescribe(org.dataone.integration.it.testImplementations.SidMNTestImplementations): Case: 0 : nullUnable to create test object!/class org.dataone.client.exception.ClientSideException: /Read timed out  [for host https://mn-dev-ucsb-2.test.dataone.org/metacat/d1/mn/v2 ]
  testCreate(org.dataone.integration.it.testImplementations.SidMNTestImplementations): class org.dataone.client.exception.ClientSideException: /Read timed out  [for host https://mn-dev-ucsb-2.test.dataone.org/metacat/d1/mn/v2 ]
  testDelete(org.dataone.integration.it.testImplementations.SidMNTestImplementations): Case: 0 : class org.dataone.client.exception.ClientSideException: /Read timed out  [for host https://mn-dev-ucsb-2.test.dataone.org/metacat/d1/mn/v2 ]
  testListObjects(org.dataone.integration.it.testImplementations.SidMNTestImplementations): Case: 0 : nullUnable to create test object!/class org.dataone.client.exception.ClientSideException: /Read timed out  [for host https://mn-dev-ucsb-2.test.dataone.org/metacat/d1/mn/v2 ]
  testIsAuthorized(org.dataone.integration.it.testImplementations.SidMNTestImplementations): isAuthorized() Case 1, read permissions should match expected:<false> but was:<true>
  testView(org.dataone.integration.it.testImplementations.SidMNTestImplementations): nullUnable to create test object!/class org.dataone.client.exception.ClientSideException: /Read timed out  [for host https://mn-dev-ucsb-2.test.dataone.org/metacat/d1/mn/v2 ]

Tests run: 13, Failures: 12, Errors: 0, Skipped: 1

[WARNING] File encoding has not been set, using platform encoding UTF-8, i.e. build is platform dependent!
[JENKINS] Recording test results
[INFO] 
[INFO] --- maven-failsafe-plugin:2.8.1:verify (verify) @ d1_integration ---
[INFO] Failsafe report directory: /var/lib/jenkins/jobs/d1_integration_DEV2_MN_sid_functional/workspace/target/failsafe-reports
[WARNING] File encoding has not been set, using platform encoding UTF-8, i.e. build is platform dependent!
[ERROR] There are test failures.

Please refer to /var/lib/jenkins/jobs/d1_integration_DEV2_MN_sid_functional/workspace/target/failsafe-reports for the individual test results.
[JENKINS] Recording test results
Notifying upstream projects of job completion
Join notifier requires a CauseAction
[INFO] ------------------------------------------------------------------------
[INFO] BUILD SUCCESS
[INFO] ------------------------------------------------------------------------
[INFO] Total time: 10:16.422s
[INFO] Finished at: Thu Nov 19 07:22:30 UTC 2015
[INFO] Final Memory: 50M/741M
[INFO] ------------------------------------------------------------------------
Waiting for Jenkins to finish collecting data
[JENKINS] Archiving /var/lib/jenkins/jobs/d1_integration_DEV2_MN_sid_functional/workspace/pom.xml to org.dataone/d1_integration/2.0-SNAPSHOT/d1_integration-2.0-SNAPSHOT.pom
channel stopped
[WARNING] Couldn't clean up oid=3 from null
hudson.remoting.ChannelClosedException: channel is already closed
	at hudson.remoting.Channel.send(Channel.java:575)
	at hudson.remoting.RemoteInvocationHandler$PhantomReferenceImpl.cleanup(RemoteInvocationHandler.java:360)
	at hudson.remoting.RemoteInvocationHandler$PhantomReferenceImpl.access$700(RemoteInvocationHandler.java:319)
	at hudson.remoting.RemoteInvocationHandler$Unexporter.run(RemoteInvocationHandler.java:420)
	at java.util.concurrent.Executors$RunnableAdapter.call(Executors.java:471)
	at java.util.concurrent.FutureTask.run(FutureTask.java:262)
	at hudson.remoting.AtmostOneThreadExecutor$Worker.run(AtmostOneThreadExecutor.java:110)
	at java.lang.Thread.run(Thread.java:745)
Caused by: java.io.IOException
	at hudson.remoting.Channel.close(Channel.java:1160)
	at hudson.remoting.Channel.close(Channel.java:1135)
	at hudson.remoting.Channel$CloseCommand.execute(Channel.java:1076)
	at hudson.remoting.Channel$1.handle(Channel.java:498)
	at hudson.remoting.SynchronousCommandTransport$ReaderThread.run(SynchronousCommandTransport.java:60)
Notifying upstream projects of job completion
Warning: you have no plugins providing access control for builds, so falling back to legacy behavior of permitting any downstream builds to be triggered
Finished: UNSTABLE