UnstableConsole Output

Skipping 9 KB.. Full Log
uthTestImplementations.java
A         src/test/java/org/dataone/integration/it/testImplementations/V1V2InteropFunctionalTestImplementations.java
A         src/test/java/org/dataone/integration/it/testImplementations/MNUpdateSystemMetadataTestImplementations.java
A         src/test/java/org/dataone/integration/it/testImplementations/MNSystemMetadataMutabilityImplementations.java
A         src/test/java/org/dataone/integration/it/testImplementations/MNPackageTestImplementations.java
A         src/test/java/org/dataone/integration/it/testImplementations/CNDiagnosticFunctionalTestImplementations.java
A         src/test/java/org/dataone/integration/it/testImplementations/CoreTestImplementations.java
A         src/test/java/org/dataone/integration/it/testImplementations/UpdateSystemMetadataTestImplementations.java
A         src/test/java/org/dataone/integration/it/testImplementations/CNReplicationTestImplementations.java
A         src/test/java/org/dataone/integration/it/testImplementations/NodeRegistryExtensibilityTestImplementations.java
A         src/test/java/org/dataone/integration/it/testImplementations/MNSystemMetadataChangedMethodTestImplementations.java
A         src/test/java/org/dataone/integration/it/testImplementations/V1IsAuthorizedAuthorizationTestImpl.java
A         src/test/java/org/dataone/integration/it/testImplementations/V2IsAuthorizedAuthorizationTestImpl.java
A         src/test/java/org/dataone/integration/it/testImplementations/SidCNTestImplementations.java
A         src/test/java/org/dataone/integration/it/testImplementations/AuthTestImplementations.java
A         src/test/java/org/dataone/integration/it/testImplementations/MNReplicationTestImplementations.java
A         src/test/java/org/dataone/integration/it/testImplementations/QueryTestImplementations.java
A         src/test/java/org/dataone/integration/it/testImplementations/MNPackageFunctionalTestImplementations.java
A         src/test/java/org/dataone/integration/it/testImplementations/ContentIntegrityTestImplementations.java
A         src/test/java/org/dataone/integration/it/testImplementations/SidMNTestImplementations.java
A         src/test/java/org/dataone/integration/it/testImplementations/CNIdentityTestImplementations.java
A         src/test/java/org/dataone/integration/it/testImplementations/ViewTestImplementations.java
A         src/test/java/org/dataone/integration/it/testImplementations/AbstractAuthorizationTestImplementations.java
A         src/test/java/org/dataone/integration/it/testImplementations/SystemMetadataFunctionalTestImplementation.java
A         src/test/java/org/dataone/integration/it/testImplementations/SidCommonTestImplementations.java
A         src/test/java/org/dataone/integration/it/testImplementations/AuthAPITestImplementations.java
A         src/test/java/org/dataone/integration/it/testImplementations/IsAuthorizedAuthorizationTestImplementations.java
A         src/test/java/org/dataone/integration/it/testImplementations/CNReadTestImplementations.java
A         src/test/java/org/dataone/integration/it/testImplementations/ViewFunctionalTestImplementations.java
A         src/test/java/org/dataone/integration/it/testImplementations/MNStorageTestImplementations.java
A         src/test/java/org/dataone/integration/it/testImplementations/SSLTestImplementations.java
A         src/test/java/org/dataone/integration/it/testImplementations/CNDiagnosticTestImplementations.java
A         src/test/java/org/dataone/integration/it/testImplementations/CNRegisterTestImplementations.java
A         src/test/java/org/dataone/integration/it/CNodeTier4_metacat_IT.java
A         src/test/java/org/dataone/integration/it/CNodeTier1_cnService_IT.java
A         src/test/java/org/dataone/integration/it/testDefinitions
A         src/test/java/org/dataone/integration/it/testDefinitions/MNReplicationTestDefinitions.java
A         src/test/java/org/dataone/integration/it/testDefinitions/QueryTestDefinitions.java
A         src/test/java/org/dataone/integration/it/testDefinitions/MNReadSidTestDefinitions.java
A         src/test/java/org/dataone/integration/it/testDefinitions/MNv2StorageTestDefinitions.java
A         src/test/java/org/dataone/integration/it/testDefinitions/V2AuthorizationTestDefinitions.java
A         src/test/java/org/dataone/integration/it/testDefinitions/ContentIntegrityTestDefinitions.java
A         src/test/java/org/dataone/integration/it/testDefinitions/CNIdentityTestDefinitions.java
A         src/test/java/org/dataone/integration/it/testDefinitions/ViewTestDefinitions.java
A         src/test/java/org/dataone/integration/it/testDefinitions/MNAuthAPITestDefnitions.java
A         src/test/java/org/dataone/integration/it/testDefinitions/CNv2RegisterTestDefinitions.java
A         src/test/java/org/dataone/integration/it/testDefinitions/CNAuthorizationSidTestDefinitions.java
A         src/test/java/org/dataone/integration/it/testDefinitions/CNv2CoreTestDefinitions.java
A         src/test/java/org/dataone/integration/it/testDefinitions/MNCoreSlowTestDefinitions.java
A         src/test/java/org/dataone/integration/it/testDefinitions/SynchronizeMetadataTestDefinition.java
A         src/test/java/org/dataone/integration/it/testDefinitions/MNSystemMetadataChangedTestDefinitions.java
A         src/test/java/org/dataone/integration/it/testDefinitions/CNReplicationSidTestDefinitions.java
A         src/test/java/org/dataone/integration/it/testDefinitions/MNAuthorizationSidTestDefinitions.java
A         src/test/java/org/dataone/integration/it/testDefinitions/AuthAPITestDefinitions.java
A         src/test/java/org/dataone/integration/it/testDefinitions/CNReadTestDefinitions.java
A         src/test/java/org/dataone/integration/it/testDefinitions/GeneralAuthorizationTestDefinitions.java
A         src/test/java/org/dataone/integration/it/testDefinitions/MNStorageTestDefinitions.java
A         src/test/java/org/dataone/integration/it/testDefinitions/MNStorageSidTestDefinitions.java
A         src/test/java/org/dataone/integration/it/testDefinitions/MNQueryTestDefinitions.java
A         src/test/java/org/dataone/integration/it/testDefinitions/SSLTestDefinitions.java
A         src/test/java/org/dataone/integration/it/testDefinitions/CNDiagnosticTestDefinitions.java
A         src/test/java/org/dataone/integration/it/testDefinitions/CNRegisterTestDefinitions.java
A         src/test/java/org/dataone/integration/it/testDefinitions/MNReadTestDefinitions.java
A         src/test/java/org/dataone/integration/it/testDefinitions/CNCoreSidTestDefinitions.java
A         src/test/java/org/dataone/integration/it/testDefinitions/CNCoreTestDefinitions.java
A         src/test/java/org/dataone/integration/it/testDefinitions/CNUpdateSystemMetadataTestDefinitions.java
A         src/test/java/org/dataone/integration/it/testDefinitions/ReadTestDefinitions.java
A         src/test/java/org/dataone/integration/it/testDefinitions/CNAuthTestDefinitions.java
A         src/test/java/org/dataone/integration/it/testDefinitions/MNUpdateSystemMetadataTestDefinitions.java
A         src/test/java/org/dataone/integration/it/testDefinitions/MNCoreTestDefinitions.java
A         src/test/java/org/dataone/integration/it/testDefinitions/MNPackageTestDefinitions.java
A         src/test/java/org/dataone/integration/it/testDefinitions/SystemMetadataChangedMethodTestDefnitions.java
A         src/test/java/org/dataone/integration/it/testDefinitions/CoreTestDefinitions.java
A         src/test/java/org/dataone/integration/it/testDefinitions/CNReplicationTestDefinitions.java
A         src/test/java/org/dataone/integration/it/testDefinitions/NodeRegistryExtensibilityTestDefinitions.java
A         src/test/java/org/dataone/integration/it/testDefinitions/CNReadSidTestDefinitions.java
A         src/test/java/org/dataone/integration/it/testDefinitions/AuthTestDefinitions.java
A         src/test/java/org/dataone/integration/it/testDefinitions/MNv2SystemMetadataChangedTestDefinitions.java
A         src/test/java/org/dataone/integration/webTest
A         src/test/java/org/dataone/integration/webTest/TestLauncher.java
A         src/test/java/org/dataone/integration/webTest/TestManifestAccess.java
A         src/test/java/org/dataone/integration/webTest/MockV1ITCase.java
A         src/test/java/org/dataone/integration/webTest/TestingTestRunnerServlet.java
A         src/test/java/org/dataone/configuration
A         src/test/java/org/dataone/configuration/TestSettingsTest.java
A         src/test/java/org/dataone/client
A         src/test/java/org/dataone/client/V1ClientArchitectureConformityIT.java
A         src/test/java/org/dataone/client/CNRestURLTest.java
A         src/test/java/org/dataone/client/PoolingHttpClientConnectionManagerTest.java
A         src/test/java/org/dataone/client/ArchitectureUtils.java
A         src/test/java/org/dataone/client/RetryHandler.java
A         src/test/java/org/dataone/client/ClientArchitectureConformityIT.java
A         src/test/python
A         src/test/python/org
A         src/test/python/org/dataone
A         src/test/python/org/dataone/integration
A         src/test/python/org/dataone/integration/tier_1_mn_core_getstatus.py
A         src/test/python/org/dataone/integration/tier_1_mn_read_getchecksum.py
A         src/test/python/org/dataone/integration/tier_1_mn_read_synchronizationfailed.py
A         src/test/python/org/dataone/integration/tier_1_mn_core_getcapabilities.py
A         src/test/python/org/dataone/integration/tier_1_mn_core_ping.py
A         src/test/python/org/dataone/integration/tier_3_mn_storage_update.py
A         src/test/python/org/dataone/integration/tier_1_mn_read_get.py
AU        src/test/python/org/dataone/integration/test_all.py
A         src/test/python/org/dataone/integration/tier_1_mn_read_describe.py
A         src/test/python/org/dataone/integration/tier_1_mn_core_getlogrecords.py
A         src/test/python/org/dataone/integration/test_utilities.py
A         src/test/python/org/dataone/integration/tier_1_mn_read_listobjects.py
A         src/test/python/org/dataone/integration/tier_1_mn_read_getsystemmetadata.py
A         src/test/python/org/dataone/integration/tier_1_mn_core_getoperationstatistics.py
A         src/test/python/org/dataone/integration/context.py
A         src/test/python/org/dataone/integration/tier_3_mn_storage_create.py
A         src/test/python/org/dataone/integration/tier_1_mn_core_getobjectstatistics.py
A         src/test/python/org/dataone/client
AU        src/test/python/org/dataone/client/test_client.py
A         src/test/python/org/dataone/client/d1_test_case.py
A         src/test/resources
A         src/test/resources/nodes.json
A         src/test/resources/org
A         src/test/resources/org/dataone
A         src/test/resources/org/dataone/configuration
A         src/test/resources/org/dataone/configuration/overriding.properties
A         src/test/resources/d1_testdocs
A         src/test/resources/d1_testdocs/BAYXXX_015ADCP015R00_20051215.50.9.xml
A         src/test/resources/d1_testdocs/nodelist
A         src/test/resources/d1_testdocs/nodelist/nodeRegistry.xml
A         src/test/resources/d1_testdocs/EXAMPLE_MANIFEST.MF
A         src/test/resources/d1_testdocs/knb-lter-luq.76.2-broken.xml
A         src/test/resources/d1_testdocs/BAYXXX_015ADCP015R00_20051215.50.9_SYSMETA.xml
A         src/test/resources/d1_testdocs/ore_example_from_openarchives.xml
A         src/test/resources/d1_testdocs/iso19115
A         src/test/resources/d1_testdocs/iso19115/ornldaac_iso_122.xml
A         src/test/resources/d1_testdocs/iso19115/ornldaac_iso_868.xml
A         src/test/resources/d1_testdocs/iso19115/ornldaac_iso_645.xml
A         src/test/resources/d1_testdocs/iso19115/README.txt
A         src/test/resources/d1_testdocs/iso19115/test.xml
A         src/test/resources/d1_testdocs/knb-lter-gce.114.11.xml
A         src/test/resources/d1_testdocs/eml200
A         src/test/resources/d1_testdocs/eml200/dpennington.195.2
A         src/test/resources/d1_testdocs/eml200/SystemMetadata
A         src/test/resources/d1_testdocs/eml200/SystemMetadata/dpennington.195.2
A         src/test/resources/d1_testdocs/eml200/SystemMetadata/dpennington.resourcemap
A         src/test/resources/d1_testdocs/eml200/SystemMetadata/IPCC.200802107062739.1
A         src/test/resources/d1_testdocs/eml200/SystemMetadata/README.txt
A         src/test/resources/d1_testdocs/eml200/dpennington.resourcemap
A         src/test/resources/d1_testdocs/eml200/IPCC.200802107062739.1
A         src/test/resources/d1_testdocs/eml210
A         src/test/resources/d1_testdocs/eml210/peggym.127.1
A         src/test/resources/d1_testdocs/eml210/peggym.128.1
A         src/test/resources/d1_testdocs/eml210/peggym.129.1
A         src/test/resources/d1_testdocs/eml210/SystemMetadata
A         src/test/resources/d1_testdocs/eml210/SystemMetadata/peggym.127.1
A         src/test/resources/d1_testdocs/eml210/SystemMetadata/peggym.128.1
A         src/test/resources/d1_testdocs/eml210/SystemMetadata/peggym.129.1
A         src/test/resources/d1_testdocs/eml210/SystemMetadata/README.txt
A         src/test/resources/d1_testdocs/eml210/SystemMetadata/peggym.130.4
A         src/test/resources/d1_testdocs/eml210/SystemMetadata/peggym.resourcemap
A         src/test/resources/d1_testdocs/eml210/peggym.130.4
A         src/test/resources/d1_testdocs/eml210/peggym.resourcemap
A         src/test/resources/d1_testdocs/eml201
A         src/test/resources/d1_testdocs/eml201/TPT001_018MHP2000R00_20110121.50.1.xml
A         src/test/resources/d1_testdocs/eml201/SystemMetadata
A         src/test/resources/d1_testdocs/eml201/SystemMetadata/msucci.24.1
A         src/test/resources/d1_testdocs/eml201/SystemMetadata/msucci.23.3
A         src/test/resources/d1_testdocs/eml201/SystemMetadata/msucci.resourcemap
A         src/test/resources/d1_testdocs/eml201/SystemMetadata/README.txt
A         src/test/resources/d1_testdocs/eml201/msucci.24.1
A         src/test/resources/d1_testdocs/eml201/msucci.23.3
A         src/test/resources/d1_testdocs/eml201/msucci.resourcemap
A         src/test/resources/d1_testdocs/eml201/TPT001_018MHP2000R00_20110121.40.1.csv
A         src/test/resources/d1_testdocs/encodingTestSet
AU        src/test/resources/d1_testdocs/encodingTestSet/testUnicodeStrings.utf8.txt
A         src/test/resources/d1_testdocs/encodingTestSet/testAsciiStrings.utf8.txt
AU        src/test/resources/d1_testdocs/encodingTestSet/IMPORTANT_README.txt
A         src/test/resources/d1_testdocs/encodingTestSet/singleAsciiCharacterTests.utf8.txt
A         src/test/resources/d1_testdocs/knb-lter-cdr.329066.1.data
A         src/test/resources/d1_testdocs/fgdc
A         src/test/resources/d1_testdocs/fgdc/www.nbii.gov_metadata_mdata_NASA_nasa_d_FEDGPS1293.xml
A         src/test/resources/d1_testdocs/fgdc/www.nbii.gov_metadata_mdata_USGS_PIERC_brdpierc0020.xml
A         src/test/resources/d1_testdocs/fgdc/www.nbii.gov_metadata_mdata_CSIRO_csiro_d_abayadultprawns.xml
A         src/test/resources/d1_testdocs/fgdc/www.nbii.gov_metadata_mdata_NASA_nasa_d_FEDGPS1293.sysmeta.xml
A         src/test/resources/d1_testdocs/fgdc/www.nbii.gov_metadata_mdata_NPS_VegMap_nps_d_metawababdy.xml
A         src/test/resources/d1_testdocs/fgdc/www.nbii.gov_metadata_mdata_USGS_PIERC_brdpierc0020.sysmeta.xml
A         src/test/resources/d1_testdocs/fgdc/www.nbii.gov_metadata_mdata_CSIRO_csiro_d_abayadultprawns.sysmeta.xml
A         src/test/resources/d1_testdocs/fgdc/www.nbii.gov_metadata_mdata_NPS_VegMap_nps_d_metawababdy.sysmeta.xml
A         src/test/resources/d1_testdocs/fgdc/README.txt
A         src/test/resources/d1_testdocs/IT_contexts
A         src/test/resources/d1_testdocs/IT_contexts/default.LOCAL.test.properties
A         src/test/resources/d1_testdocs/IT_contexts/default.DEV.test.properties
A         src/test/resources/d1_testdocs/knb-lter-gce.247.12.xml
A         src/test/resources/d1_testdocs/knb-lter-luq.76.2.xml
A         src/test/resources/d1_testdocs/checksumTestSet
A         src/test/resources/d1_testdocs/checksumTestSet/sciMD-eml-201-NoLastLForCR.xml
A         src/main
A         src/main/java
A         src/main/java/org
A         src/main/java/org/dataone
A         src/main/java/org/dataone/service
A         src/main/java/org/dataone/service/util
A         src/main/java/org/dataone/integration
A         src/main/java/org/dataone/integration/TestIterationEndingException.java
A         src/main/java/org/dataone/integration/adapters
A         src/main/java/org/dataone/integration/adapters/CommonCallAdapter.java
A         src/main/java/org/dataone/integration/adapters/MNCallAdapter.java
A         src/main/java/org/dataone/integration/adapters/CNCallAdapter.java
A         src/main/java/org/dataone/integration/EMLBuilderUtils.java
AU        src/main/java/org/dataone/integration/ExampleUtilities.java
A         src/main/java/org/dataone/integration/APITestUtils.java
A         src/main/java/org/dataone/integration/ContextAwareTestCaseDataone.java
A         src/main/java/org/dataone/integration/IntegrationTestContextParameters.java
A         src/main/java/org/dataone/integration/webTest
A         src/main/java/org/dataone/integration/webTest/Launcher.java
A         src/main/java/org/dataone/integration/webTest/WebTestDescription.java
A         src/main/java/org/dataone/integration/webTest/WebTestImplementation.java
A         src/main/java/org/dataone/integration/webTest/WebTestListener.java
A         src/main/java/org/dataone/integration/webTest/MavenTestRunnerHttpServlet.java
AU        src/main/java/org/dataone/integration/webTest/TestRunnerIndexServlet.java
A         src/main/java/org/dataone/integration/webTest/StreamableSerializer.java
A         src/main/java/org/dataone/integration/webTest/TestRunnerApp.java
A         src/main/java/org/dataone/integration/webTest/AtomicTest.java
A         src/main/java/org/dataone/integration/webTest/StreamingWebTestListener.java
A         src/main/java/org/dataone/integration/webTest/TestRunnerHttpServlet.java
A         src/main/java/org/dataone/integration/webTest/WebTestName.java
A         src/main/java/org/dataone/integration/hazelcast
A         src/main/java/org/dataone/configuration
A         src/main/java/org/dataone/configuration/TestSettings.java
A         src/main/java/org/dataone/client
A         src/main/resources
AU        src/main/resources/logback.xml
A         src/main/resources/results.html
A         src/main/resources/results_head.html
A         src/main/resources/org
A         src/main/resources/org/dataone
A         src/main/resources/org/dataone/configuration
A         src/main/resources/org/dataone/configuration/context.STAGE.test.properties
A         src/main/resources/org/dataone/configuration/context.LOCAL_METACAT.test.properties
A         src/main/resources/org/dataone/configuration/default.common.test.properties
A         src/main/resources/org/dataone/configuration/context.LOCAL.test.properties
A         src/main/resources/org/dataone/configuration/context.DEV.test.properties
A         src/main/resources/org/dataone/configuration/context.SANDBOX.test.properties
A         src/main/resources/org/dataone/configuration/customHudsonDevNodelist.xml
AU        src/main/resources/org/dataone/configuration/context.DEV2.test.properties
A         src/main/resources/org/dataone/configuration/context.STAGE-2.test.properties
A         src/main/resources/commons-logging.properties
AU        src/main/resources/log4j.properties
A         src/main/webapp
A         src/main/webapp/index.jsp
A         src/main/webapp/results.html
A         src/main/webapp/images
AU        src/main/webapp/images/sunny.gif
AU        src/main/webapp/images/grey.png
AU        src/main/webapp/images/blue.png
AU        src/main/webapp/images/help.png
AU        src/main/webapp/images/red.png
AU        src/main/webapp/images/yellow.png
A         src/main/webapp/results_head.html
A         src/main/webapp/WEB-INF
AU        src/main/webapp/WEB-INF/web.xml
A         src/main/webapp/resultsHelp.html
A         src/license-header.txt
A         pom.xml
A         tierTestingMethodTemplater.pl
A         README.txt
 U        .
At revision 16917
no change for https://repository.dataone.org/software/cicore/trunk/d1_integration since the previous build
Parsing POMs
Established TCP socket on 40597
[workspace] $ /usr/lib/jvm/java-7-openjdk-amd64/bin/java -cp /var/lib/jenkins/plugins/maven-plugin/WEB-INF/lib/maven3-agent-1.7.jar:/usr/share/maven/boot/plexus-classworlds-2.x.jar org.jvnet.hudson.maven3.agent.Maven3Main /usr/share/maven /var/cache/jenkins/war/WEB-INF/lib/remoting-2.52.jar /var/lib/jenkins/plugins/maven-plugin/WEB-INF/lib/maven3-interceptor-1.7.jar /var/lib/jenkins/plugins/maven-plugin/WEB-INF/lib/maven3-interceptor-commons-1.7.jar 40597
<===[JENKINS REMOTING CAPACITY]===>channel started
Executing Maven:  -B -f /var/lib/jenkins/jobs/d1_integration_DEV2_MN_sid_functional/workspace/pom.xml -Dit.test=SidMNTestImplementations* -Dcontext.label=DEV2 -Dtest=foo -DfailIfNoTests=false verify
[INFO] Scanning for projects...
[WARNING] 
[WARNING] Some problems were encountered while building the effective model for org.dataone:d1_integration:war:2.0-SNAPSHOT
[WARNING] 'build.plugins.plugin.version' for org.apache.maven.plugins:maven-compiler-plugin is missing. @ line 197, column 15
[WARNING] 'build.plugins.plugin.version' for org.codehaus.mojo:buildnumber-maven-plugin is missing. @ line 221, column 15
[WARNING] 'build.plugins.plugin.version' for com.mycila.maven-license-plugin:maven-license-plugin is missing. @ line 214, column 15
[WARNING] 'build.plugins.plugin.version' for org.apache.maven.plugins:maven-war-plugin is missing. @ line 237, column 15
[WARNING] 
[WARNING] It is highly recommended to fix these problems because they threaten the stability of your build.
[WARNING] 
[WARNING] For this reason, future Maven versions might no longer support building such malformed projects.
[WARNING] 
[INFO]                                                                         
[INFO] ------------------------------------------------------------------------
[INFO] Building DataONE Integration Testing Package 2.0-SNAPSHOT
[INFO] ------------------------------------------------------------------------
[INFO] 
[INFO] --- buildnumber-maven-plugin:1.2:create (default) @ d1_integration ---
[INFO] Checking for local modifications: skipped.
[INFO] Updating project files from SCM: skipped.
[INFO] Executing: /bin/sh -c cd /var/lib/jenkins/jobs/d1_integration_DEV2_MN_sid_functional/workspace && svn --non-interactive info
[INFO] Working directory: /var/lib/jenkins/jobs/d1_integration_DEV2_MN_sid_functional/workspace
[INFO] Storing buildNumber: 16917 at timestamp: 1447745898648
[INFO] Executing: /bin/sh -c cd /var/lib/jenkins/jobs/d1_integration_DEV2_MN_sid_functional/workspace && svn --non-interactive info
[INFO] Working directory: /var/lib/jenkins/jobs/d1_integration_DEV2_MN_sid_functional/workspace
[INFO] Storing buildScmBranch: trunk
[INFO] 
[INFO] --- maven-resources-plugin:2.3:resources (default-resources) @ d1_integration ---
[WARNING] Using platform encoding (UTF-8 actually) to copy filtered resources, i.e. build is platform dependent!
[INFO] Copying 14 resources
[INFO] 
[INFO] --- maven-compiler-plugin:2.0.2:compile (default-compile) @ d1_integration ---
[INFO] Compiling 22 source files to /var/lib/jenkins/jobs/d1_integration_DEV2_MN_sid_functional/workspace/target/classes
[INFO] 
[INFO] --- maven-resources-plugin:2.3:testResources (default-testResources) @ d1_integration ---
[WARNING] Using platform encoding (UTF-8 actually) to copy filtered resources, i.e. build is platform dependent!
[INFO] Copying 60 resources
[INFO] 
[INFO] --- maven-compiler-plugin:2.0.2:testCompile (default-testCompile) @ d1_integration ---
[INFO] Compiling 144 source files to /var/lib/jenkins/jobs/d1_integration_DEV2_MN_sid_functional/workspace/target/test-classes
[INFO] 
[INFO] --- maven-surefire-plugin:2.10:test (default-test) @ d1_integration ---
[INFO] Surefire report directory: /var/lib/jenkins/jobs/d1_integration_DEV2_MN_sid_functional/workspace/target/surefire-reports

-------------------------------------------------------
 T E S T S
-------------------------------------------------------

Results :

Tests run: 0, Failures: 0, Errors: 0, Skipped: 0

[JENKINS] Recording test results
[INFO] 
[INFO] --- maven-antrun-plugin:1.3:run (execution1) @ d1_integration ---
[INFO] Executing tasks
     [copy] Copying 236 files to /var/lib/jenkins/jobs/d1_integration_DEV2_MN_sid_functional/workspace/target/classes
     [copy] Copying 3 files to /var/lib/jenkins/jobs/d1_integration_DEV2_MN_sid_functional/workspace/target/d1_integration-2.0-SNAPSHOT/org/dataone/integration/webTest
[INFO] Executed tasks
[INFO] 
[INFO] --- maven-dependency-plugin:2.3:unpack-dependencies (jetty-classpath) @ d1_integration ---
[INFO] Unpacking /var/lib/jenkins/.m2/repository/org/eclipse/jetty/orbit/org.apache.jasper.glassfish/2.2.2.v201112011158/org.apache.jasper.glassfish-2.2.2.v201112011158.jar to /var/lib/jenkins/jobs/d1_integration_DEV2_MN_sid_functional/workspace/target/d1_integration-2.0-SNAPSHOT with includes "" and excludes ""
[INFO] Unpacking /var/lib/jenkins/.m2/repository/org/slf4j/slf4j-simple/1.6.4/slf4j-simple-1.6.4.jar to /var/lib/jenkins/jobs/d1_integration_DEV2_MN_sid_functional/workspace/target/d1_integration-2.0-SNAPSHOT with includes "" and excludes ""
[INFO] Unpacking /var/lib/jenkins/.m2/repository/org/eclipse/jetty/jetty-websocket/8.1.15.v20140411/jetty-websocket-8.1.15.v20140411.jar to /var/lib/jenkins/jobs/d1_integration_DEV2_MN_sid_functional/workspace/target/d1_integration-2.0-SNAPSHOT with includes "" and excludes ""
[INFO] Unpacking /var/lib/jenkins/.m2/repository/org/eclipse/jetty/orbit/javax.security.auth.message/1.0.0.v201108011116/javax.security.auth.message-1.0.0.v201108011116.jar to /var/lib/jenkins/jobs/d1_integration_DEV2_MN_sid_functional/workspace/target/d1_integration-2.0-SNAPSHOT with includes "" and excludes ""
[INFO] Unpacking /var/lib/jenkins/.m2/repository/org/eclipse/jetty/orbit/javax.servlet.jsp.jstl/1.2.0.v201105211821/javax.servlet.jsp.jstl-1.2.0.v201105211821.jar to /var/lib/jenkins/jobs/d1_integration_DEV2_MN_sid_functional/workspace/target/d1_integration-2.0-SNAPSHOT with includes "" and excludes ""
[INFO] Unpacking /var/lib/jenkins/.m2/repository/org/eclipse/jetty/orbit/com.sun.el/2.2.0.v201108011116/com.sun.el-2.2.0.v201108011116.jar to /var/lib/jenkins/jobs/d1_integration_DEV2_MN_sid_functional/workspace/target/d1_integration-2.0-SNAPSHOT with includes "" and excludes ""
[INFO] Unpacking /var/lib/jenkins/.m2/repository/org/eclipse/jetty/orbit/javax.mail.glassfish/1.4.1.v201005082020/javax.mail.glassfish-1.4.1.v201005082020.jar to /var/lib/jenkins/jobs/d1_integration_DEV2_MN_sid_functional/workspace/target/d1_integration-2.0-SNAPSHOT with includes "" and excludes ""
[INFO] Unpacking /var/lib/jenkins/.m2/repository/org/slf4j/slf4j-api/1.6.4/slf4j-api-1.6.4.jar to /var/lib/jenkins/jobs/d1_integration_DEV2_MN_sid_functional/workspace/target/d1_integration-2.0-SNAPSHOT with includes "" and excludes ""
[INFO] Unpacking /var/lib/jenkins/.m2/repository/org/eclipse/jetty/jetty-io/8.1.15.v20140411/jetty-io-8.1.15.v20140411.jar to /var/lib/jenkins/jobs/d1_integration_DEV2_MN_sid_functional/workspace/target/d1_integration-2.0-SNAPSHOT with includes "" and excludes ""
[INFO] Unpacking /var/lib/jenkins/.m2/repository/org/eclipse/jetty/orbit/javax.servlet.jsp/2.2.0.v201112011158/javax.servlet.jsp-2.2.0.v201112011158.jar to /var/lib/jenkins/jobs/d1_integration_DEV2_MN_sid_functional/workspace/target/d1_integration-2.0-SNAPSHOT with includes "" and excludes ""
[INFO] Unpacking /var/lib/jenkins/.m2/repository/org/eclipse/jetty/aggregate/jetty-all-server/8.1.15.v20140411/jetty-all-server-8.1.15.v20140411.jar to /var/lib/jenkins/jobs/d1_integration_DEV2_MN_sid_functional/workspace/target/d1_integration-2.0-SNAPSHOT with includes "" and excludes ""
[INFO] Unpacking /var/lib/jenkins/.m2/repository/org/eclipse/jetty/jetty-jsp/8.1.15.v20140411/jetty-jsp-8.1.15.v20140411.jar to /var/lib/jenkins/jobs/d1_integration_DEV2_MN_sid_functional/workspace/target/d1_integration-2.0-SNAPSHOT with includes "" and excludes ""
[INFO] Unpacking /var/lib/jenkins/.m2/repository/org/eclipse/jetty/orbit/org.apache.taglibs.standard.glassfish/1.2.0.v201112081803/org.apache.taglibs.standard.glassfish-1.2.0.v201112081803.jar to /var/lib/jenkins/jobs/d1_integration_DEV2_MN_sid_functional/workspace/target/d1_integration-2.0-SNAPSHOT with includes "" and excludes ""
[INFO] Unpacking /var/lib/jenkins/.m2/repository/javax/servlet/servlet-api/2.5/servlet-api-2.5.jar to /var/lib/jenkins/jobs/d1_integration_DEV2_MN_sid_functional/workspace/target/d1_integration-2.0-SNAPSHOT with includes "" and excludes ""
[INFO] Unpacking /var/lib/jenkins/.m2/repository/org/eclipse/jetty/orbit/javax.activation/1.1.0.v201105071233/javax.activation-1.1.0.v201105071233.jar to /var/lib/jenkins/jobs/d1_integration_DEV2_MN_sid_functional/workspace/target/d1_integration-2.0-SNAPSHOT with includes "" and excludes ""
[INFO] Unpacking /var/lib/jenkins/.m2/repository/org/eclipse/jetty/orbit/javax.annotation/1.1.0.v201108011116/javax.annotation-1.1.0.v201108011116.jar to /var/lib/jenkins/jobs/d1_integration_DEV2_MN_sid_functional/workspace/target/d1_integration-2.0-SNAPSHOT with includes "" and excludes ""
[INFO] Unpacking /var/lib/jenkins/.m2/repository/org/eclipse/jetty/jetty-http/8.1.15.v20140411/jetty-http-8.1.15.v20140411.jar to /var/lib/jenkins/jobs/d1_integration_DEV2_MN_sid_functional/workspace/target/d1_integration-2.0-SNAPSHOT with includes "" and excludes ""
[INFO] Unpacking /var/lib/jenkins/.m2/repository/org/eclipse/jetty/jetty-util/8.1.15.v20140411/jetty-util-8.1.15.v20140411.jar to /var/lib/jenkins/jobs/d1_integration_DEV2_MN_sid_functional/workspace/target/d1_integration-2.0-SNAPSHOT with includes "" and excludes ""
[INFO] Unpacking /var/lib/jenkins/.m2/repository/org/eclipse/jetty/orbit/org.eclipse.jdt.core/3.7.1/org.eclipse.jdt.core-3.7.1.jar to /var/lib/jenkins/jobs/d1_integration_DEV2_MN_sid_functional/workspace/target/d1_integration-2.0-SNAPSHOT with includes "" and excludes ""
[INFO] Unpacking /var/lib/jenkins/.m2/repository/org/eclipse/jetty/orbit/javax.servlet/3.0.0.v201112011016/javax.servlet-3.0.0.v201112011016.jar to /var/lib/jenkins/jobs/d1_integration_DEV2_MN_sid_functional/workspace/target/d1_integration-2.0-SNAPSHOT with includes "" and excludes ""
[INFO] Unpacking /var/lib/jenkins/.m2/repository/org/eclipse/jetty/orbit/javax.el/2.2.0.v201108011116/javax.el-2.2.0.v201108011116.jar to /var/lib/jenkins/jobs/d1_integration_DEV2_MN_sid_functional/workspace/target/d1_integration-2.0-SNAPSHOT with includes "" and excludes ""
[INFO] 
[INFO] --- maven-war-plugin:2.1.1:war (default-war) @ d1_integration ---
[INFO] Packaging webapp
[INFO] Assembling webapp [d1_integration] in [/var/lib/jenkins/jobs/d1_integration_DEV2_MN_sid_functional/workspace/target/d1_integration-2.0-SNAPSHOT]
[INFO] Processing war project
[INFO] Copying webapp resources [/var/lib/jenkins/jobs/d1_integration_DEV2_MN_sid_functional/workspace/src/main/webapp]
[INFO] Webapp assembled in [389 msecs]
[INFO] Building war: /var/lib/jenkins/jobs/d1_integration_DEV2_MN_sid_functional/workspace/target/d1_integration-2.0-SNAPSHOT.war
[INFO] WEB-INF/web.xml already added, skipping
[INFO] 
[INFO] --- maven-antrun-plugin:1.3:run (execution2) @ d1_integration ---
[INFO] Executing tasks
     [move] Moving 1 file to /var/lib/jenkins/jobs/d1_integration_DEV2_MN_sid_functional/workspace/target
[INFO] Executed tasks
[INFO] 
[INFO] --- maven-failsafe-plugin:2.8.1:integration-test (integration-test) @ d1_integration ---
[INFO] Failsafe report directory: /var/lib/jenkins/jobs/d1_integration_DEV2_MN_sid_functional/workspace/target/failsafe-reports

-------------------------------------------------------
 T E S T S
-------------------------------------------------------
Running org.dataone.integration.it.testImplementations.SidMNTestImplementations
20151117-07:38:40: [INFO]: **************************************************** [org.dataone.integration.ContextAwareTestCaseDataone]
20151117-07:38:40: [INFO]: ***  context label:   DEV2 [org.dataone.integration.ContextAwareTestCaseDataone]
20151117-07:38:40: [INFO]: **************************************************** [org.dataone.integration.ContextAwareTestCaseDataone]
~~~ Context is from d1client.properties: https://cn-dev-2.test.dataone.org/cn
20151117-07:38:41: [INFO]: rest call info: GET https://cn-dev-2.test.dataone.org/cn/v1/node [org.dataone.client.rest.RestClient]
20151117-07:38:41: [INFO]: isNodeAlive for Node: https://cn-dev-2.test.dataone.org/cn ... [org.dataone.integration.ContextAwareTestCaseDataone]
20151117-07:38:41: [INFO]: ... calling node ... [org.dataone.integration.ContextAwareTestCaseDataone]
20151117-07:38:41: [INFO]: rest call info: GET https://cn-dev-2.test.dataone.org/cn [org.dataone.client.rest.RestClient]
20151117-07:38:41: [INFO]: ... called node [org.dataone.integration.ContextAwareTestCaseDataone]
20151117-07:38:41: [INFO]: *** Adding CN to list: cn-dev-2 [ https://cn-dev-2.test.dataone.org/cn ] [org.dataone.integration.ContextAwareTestCaseDataone]
20151117-07:38:41: [INFO]: isNodeAlive for Node: https://cn-dev-ucsb-2.test.dataone.org/cn ... [org.dataone.integration.ContextAwareTestCaseDataone]
20151117-07:38:41: [INFO]: ... calling node ... [org.dataone.integration.ContextAwareTestCaseDataone]
20151117-07:39:00: [INFO]: rest call info: GET https://cn-dev-ucsb-2.test.dataone.org/cn [org.dataone.client.rest.RestClient]
20151117-07:39:00: [INFO]: ... called node [org.dataone.integration.ContextAwareTestCaseDataone]
20151117-07:39:00: [WARN]: *** Failed to add CN to list: cn-dev-ucsb-2 [ https://cn-dev-ucsb-2.test.dataone.org/cn ].  Could not reach the node:GET https://cn-dev-2.test.dataone.org/cn/v1/node [org.dataone.integration.ContextAwareTestCaseDataone]
20151117-07:39:00: [INFO]: isNodeAlive for Node: https://cn-dev-unm-2.test.dataone.org/cn ... [org.dataone.integration.ContextAwareTestCaseDataone]
20151117-07:39:00: [INFO]: ... calling node ... [org.dataone.integration.ContextAwareTestCaseDataone]
20151117-07:39:00: [INFO]: rest call info: GET https://cn-dev-unm-2.test.dataone.org/cn [org.dataone.client.rest.RestClient]
20151117-07:39:00: [INFO]: ... called node [org.dataone.integration.ContextAwareTestCaseDataone]
20151117-07:39:00: [INFO]: *** Adding CN to list: cn-dev-unm-2 [ https://cn-dev-unm-2.test.dataone.org/cn ] [org.dataone.integration.ContextAwareTestCaseDataone]
20151117-07:39:00: [INFO]: isNodeAlive for Node: https://mn-dev-ucsb-1.test.dataone.org/metacat/d1/mn ... [org.dataone.integration.ContextAwareTestCaseDataone]
20151117-07:39:00: [INFO]: ... calling node ... [org.dataone.integration.ContextAwareTestCaseDataone]
20151117-07:39:01: [INFO]: rest call info: GET https://mn-dev-ucsb-1.test.dataone.org/metacat/d1/mn [org.dataone.client.rest.RestClient]
20151117-07:39:01: [INFO]: ... called node [org.dataone.integration.ContextAwareTestCaseDataone]
20151117-07:39:01: [INFO]: *** Adding MN to list: mn-dev-ucsb-1 [ https://mn-dev-ucsb-1.test.dataone.org/metacat/d1/mn ] [org.dataone.integration.ContextAwareTestCaseDataone]
20151117-07:39:01: [INFO]: isNodeAlive for Node: https://mn-dev-ucsb-2.test.dataone.org/metacat/d1/mn ... [org.dataone.integration.ContextAwareTestCaseDataone]
20151117-07:39:01: [INFO]: ... calling node ... [org.dataone.integration.ContextAwareTestCaseDataone]
20151117-07:39:01: [INFO]: rest call info: GET https://mn-dev-ucsb-2.test.dataone.org/metacat/d1/mn [org.dataone.client.rest.RestClient]
20151117-07:39:01: [INFO]: ... called node [org.dataone.integration.ContextAwareTestCaseDataone]
20151117-07:39:01: [INFO]: *** Adding MN to list: mn-dev-ucsb-2 [ https://mn-dev-ucsb-2.test.dataone.org/metacat/d1/mn ] [org.dataone.integration.ContextAwareTestCaseDataone]
20151117-07:39:01: [INFO]: isNodeAlive for Node: https://mn-dev-unm-1.test.dataone.org/metacat/d1/mn ... [org.dataone.integration.ContextAwareTestCaseDataone]
20151117-07:39:01: [INFO]: ... calling node ... [org.dataone.integration.ContextAwareTestCaseDataone]
20151117-07:39:02: [INFO]: rest call info: GET https://mn-dev-unm-1.test.dataone.org/metacat/d1/mn [org.dataone.client.rest.RestClient]
20151117-07:39:02: [INFO]: ... called node [org.dataone.integration.ContextAwareTestCaseDataone]
20151117-07:39:02: [INFO]: *** Adding MN to list: mn-dev-unm-1 [ https://mn-dev-unm-1.test.dataone.org/metacat/d1/mn ] [org.dataone.integration.ContextAwareTestCaseDataone]
20151117-07:39:02: [INFO]: isNodeAlive for Node: https://mn-dev-unm-2.test.dataone.org/metacat/d1/mn ... [org.dataone.integration.ContextAwareTestCaseDataone]
20151117-07:39:02: [INFO]: ... calling node ... [org.dataone.integration.ContextAwareTestCaseDataone]
20151117-07:39:02: [INFO]: rest call info: GET https://mn-dev-unm-2.test.dataone.org/metacat/d1/mn [org.dataone.client.rest.RestClient]
20151117-07:39:02: [INFO]: ... called node [org.dataone.integration.ContextAwareTestCaseDataone]
20151117-07:39:02: [INFO]: *** Adding MN to list: mn-dev-unm-2 [ https://mn-dev-unm-2.test.dataone.org/metacat/d1/mn ] [org.dataone.integration.ContextAwareTestCaseDataone]
20151117-07:39:02: [INFO]: trying to filter CN list for the round robin CN... original size: 2, includes nodes: [org.dataone.integration.ContextAwareTestCaseDataone]
20151117-07:39:02: [INFO]:     CN: https://cn-dev-2.test.dataone.org/cn "Development 2 Round Robin Router Node" [org.dataone.integration.ContextAwareTestCaseDataone]
20151117-07:39:02: [INFO]:     CN: https://cn-dev-unm-2.test.dataone.org/cn "UNM Development 2 Protocol Coordinating Node" [org.dataone.integration.ContextAwareTestCaseDataone]
20151117-07:39:02: [INFO]: excluding round robin CN: https://cn-dev-2.test.dataone.org/cn "Development 2 Round Robin Router Node" [org.dataone.integration.ContextAwareTestCaseDataone]
20151117-07:39:02: [INFO]: including CN: https://cn-dev-unm-2.test.dataone.org/cn "UNM Development 2 Protocol Coordinating Node" [org.dataone.integration.ContextAwareTestCaseDataone]
20151117-07:39:02: [INFO]: filtered CN list without round robin CN. size: 1, including nodes: [org.dataone.integration.ContextAwareTestCaseDataone]
20151117-07:39:02: [INFO]:     CN: https://cn-dev-unm-2.test.dataone.org/cn "UNM Development 2 Protocol Coordinating Node" [org.dataone.integration.ContextAwareTestCaseDataone]
20151117-07:39:02: [INFO]: **************************************************** [org.dataone.integration.ContextAwareTestCaseDataone]
20151117-07:39:02: [INFO]: Testing update() method ...  [org.dataone.integration.ContextAwareTestCaseDataone]
20151117-07:39:02: [INFO]: Testing update(), Case1 [org.dataone.integration.ContextAwareTestCaseDataone]
20151117-07:39:02: [INFO]: certificate directory: /etc/dataone/client/testClientCerts/ [org.dataone.integration.ContextAwareTestCaseDataone]
20151117-07:39:02: [INFO]: certificate filename: cnDevUNM2 [org.dataone.integration.ContextAwareTestCaseDataone]
20151117-07:39:02: [INFO]: client setup as Subject: CN=urn:node:cnDevUNM2,DC=dataone,DC=org [org.dataone.integration.ContextAwareTestCaseDataone]
20151117-07:39:02: [INFO]: rest call info: GET https://mn-dev-ucsb-1.test.dataone.org/metacat/d1/mn/v2/monitor/ping [org.dataone.client.rest.RestClient]
20151117-07:39:02: [INFO]: MN excluded from test: https://mn-dev-ucsb-1.test.dataone.org/metacat/d1/mn [org.dataone.integration.ContextAwareTestCaseDataone]
20151117-07:39:03: [INFO]: rest call info: GET https://mn-dev-ucsb-2.test.dataone.org/metacat/d1/mn/v2/monitor/ping [org.dataone.client.rest.RestClient]
20151117-07:39:03: [INFO]: MN included in test: https://mn-dev-ucsb-2.test.dataone.org/metacat/d1/mn [org.dataone.integration.ContextAwareTestCaseDataone]
20151117-07:39:03: [INFO]: rest call info: GET https://mn-dev-unm-1.test.dataone.org/metacat/d1/mn/v2/monitor/ping [org.dataone.client.rest.RestClient]
20151117-07:39:03: [INFO]: MN excluded from test: https://mn-dev-unm-1.test.dataone.org/metacat/d1/mn [org.dataone.integration.ContextAwareTestCaseDataone]
20151117-07:39:03: [INFO]: rest call info: GET https://mn-dev-unm-2.test.dataone.org/metacat/d1/mn/v2/monitor/ping [org.dataone.client.rest.RestClient]
20151117-07:39:03: [INFO]: MN included in test: https://mn-dev-unm-2.test.dataone.org/metacat/d1/mn [org.dataone.integration.ContextAwareTestCaseDataone]
20151117-07:39:03: [INFO]: certificate directory: /etc/dataone/client/testClientCerts/ [org.dataone.integration.ContextAwareTestCaseDataone]
20151117-07:39:03: [INFO]: certificate filename: testRightsHolder [org.dataone.integration.ContextAwareTestCaseDataone]
20151117-07:39:03: [INFO]: client setup as Subject: CN=testRightsHolder,DC=dataone,DC=org [org.dataone.integration.ContextAwareTestCaseDataone]
20151117-07:39:03: [INFO]: rest call info: GET https://mn-dev-ucsb-2.test.dataone.org/metacat/d1/mn/v2/node [org.dataone.client.rest.RestClient]
20151117-07:39:03: [INFO]: CREATING test object... pid: P1_201532023393831 with a sid: S1_201532023393833 obsoletes: null obsoletedBy: null [org.dataone.integration.ContextAwareTestCaseDataone]
20151117-07:39:03: [INFO]: certificate directory: /etc/dataone/client/testClientCerts/ [org.dataone.integration.ContextAwareTestCaseDataone]
20151117-07:39:03: [INFO]: certificate filename: cnDevUNM2 [org.dataone.integration.ContextAwareTestCaseDataone]
20151117-07:39:03: [INFO]: client setup as Subject: CN=urn:node:cnDevUNM2,DC=dataone,DC=org [org.dataone.integration.ContextAwareTestCaseDataone]
20151117-07:39:03: [INFO]: refreshing objectFormatCache from cn: null [org.dataone.client.v2.formats.ObjectFormatCache]
20151117-07:39:04: [INFO]: rest call info: GET https://cn-dev-2.test.dataone.org/cn/v2/formats [org.dataone.client.rest.RestClient]
20151117-07:39:04: [INFO]: successful cache refresh from cn.listFormats() [org.dataone.client.v2.formats.ObjectFormatCache]
20151117-07:39:04: [INFO]: creating a test object.  pid = P1_201532023393831 on https://mn-dev-ucsb-2.test.dataone.org/metacat/d1/mn/v2 [org.dataone.integration.ContextAwareTestCaseDataone]
20151117-07:39:04: [INFO]: SystemMetadata for pid: P1_201532023393831
<?xml version="1.0" encoding="UTF-8"?><d1_v2.0:systemMetadata xmlns:d1_v2.0="http://ns.dataone.org/service/types/v2.0" xmlns:d1="http://ns.dataone.org/service/types/v1"><serialVersion>1</serialVersion><identifier>P1_201532023393831</identifier><formatId>eml://ecoinformatics.org/eml-2.0.1</formatId><size>17181</size><checksum algorithm="MD5">03ce09c6b4c3efc1681f3023402998a2</checksum><submitter>CN=urn:node:cnDevUNM2,DC=dataone,DC=org</submitter><rightsHolder>CN=testRightsHolder,DC=dataone,DC=org</rightsHolder><accessPolicy><allow><subject>public</subject><permission>read</permission></allow></accessPolicy><dateUploaded>2015-11-17T07:39:04.168+00:00</dateUploaded><dateSysMetadataModified>2015-11-17T07:39:04.168+00:00</dateSysMetadataModified><originMemberNode>urn:node:mnDevUCSB2</originMemberNode><authoritativeMemberNode>urn:node:mnDevUCSB2</authoritativeMemberNode><seriesId>S1_201532023393833</seriesId></d1_v2.0:systemMetadata> [org.dataone.integration.ContextAwareTestCaseDataone]
20151117-07:39:16: [INFO]: rest call info: POST https://mn-dev-ucsb-2.test.dataone.org/metacat/d1/mn/v2/object; MMP message has: ParamPart:pid = P1_201532023393831; FilePart:object = /tmp/mmp.output.1918048081493590140.tmp (17181 bytes); FilePart:sysmeta = /tmp/mmp.output.5073389563616604.tmp (940 bytes);  [org.dataone.client.rest.RestClient]
20151117-07:39:16: [INFO]: object created.  pid = P1_201532023393831 [org.dataone.integration.ContextAwareTestCaseDataone]
20151117-07:39:26: [INFO]: Created SID (S1_201532023393833) and head PID (P1_201532023393831) pair. [org.dataone.integration.ContextAwareTestCaseDataone]
20151117-07:39:57: [INFO]: rest call info: PUT https://mn-dev-ucsb-2.test.dataone.org/metacat/d1/mn/v2/archive/P1_201532023393831; MMP entity is null [org.dataone.client.rest.RestClient]
20151117-07:40:22: [INFO]: rest call info: PUT https://mn-dev-ucsb-2.test.dataone.org/metacat/d1/mn/v2/object/S1_201532023393833; MMP message has: ParamPart:newPid = P9_2015320233957815; FilePart:object = /tmp/mmp.output.5408840075300633579.tmp (17181 bytes); FilePart:sysmeta = /tmp/mmp.output.6501906220685632097.tmp (758 bytes);  [org.dataone.client.rest.RestClient]
20151117-07:40:23: [INFO]: rest call info: GET https://mn-dev-unm-2.test.dataone.org/metacat/d1/mn/v2/node [org.dataone.client.rest.RestClient]
20151117-07:40:23: [INFO]: CREATING test object... pid: P1_2015320234023282 with a sid: S1_2015320234023284 obsoletes: null obsoletedBy: null [org.dataone.integration.ContextAwareTestCaseDataone]
20151117-07:40:23: [INFO]: certificate directory: /etc/dataone/client/testClientCerts/ [org.dataone.integration.ContextAwareTestCaseDataone]
20151117-07:40:23: [INFO]: certificate filename: cnDevUNM2 [org.dataone.integration.ContextAwareTestCaseDataone]
20151117-07:40:23: [INFO]: client setup as Subject: CN=urn:node:cnDevUNM2,DC=dataone,DC=org [org.dataone.integration.ContextAwareTestCaseDataone]
20151117-07:40:23: [INFO]: creating a test object.  pid = P1_2015320234023282 on https://mn-dev-unm-2.test.dataone.org/metacat/d1/mn/v2 [org.dataone.integration.ContextAwareTestCaseDataone]
20151117-07:40:23: [INFO]: SystemMetadata for pid: P1_2015320234023282
<?xml version="1.0" encoding="UTF-8"?><d1_v2.0:systemMetadata xmlns:d1_v2.0="http://ns.dataone.org/service/types/v2.0" xmlns:d1="http://ns.dataone.org/service/types/v1"><serialVersion>1</serialVersion><identifier>P1_2015320234023282</identifier><formatId>eml://ecoinformatics.org/eml-2.0.1</formatId><size>17181</size><checksum algorithm="MD5">03ce09c6b4c3efc1681f3023402998a2</checksum><submitter>CN=urn:node:cnDevUNM2,DC=dataone,DC=org</submitter><rightsHolder>CN=testRightsHolder,DC=dataone,DC=org</rightsHolder><accessPolicy><allow><subject>public</subject><permission>read</permission></allow></accessPolicy><dateUploaded>2015-11-17T07:40:23.304+00:00</dateUploaded><dateSysMetadataModified>2015-11-17T07:40:23.304+00:00</dateSysMetadataModified><originMemberNode>urn:node:mnDevUNM2</originMemberNode><authoritativeMemberNode>urn:node:mnDevUNM2</authoritativeMemberNode><seriesId>S1_2015320234023284</seriesId></d1_v2.0:systemMetadata> [org.dataone.integration.ContextAwareTestCaseDataone]
20151117-07:40:24: [INFO]: rest call info: POST https://mn-dev-unm-2.test.dataone.org/metacat/d1/mn/v2/object; MMP message has: ParamPart:pid = P1_2015320234023282; FilePart:object = /tmp/mmp.output.6921750692840037718.tmp (17181 bytes); FilePart:sysmeta = /tmp/mmp.output.3866103583427125853.tmp (940 bytes);  [org.dataone.client.rest.RestClient]
20151117-07:40:24: [INFO]: object created.  pid = P1_2015320234023282 [org.dataone.integration.ContextAwareTestCaseDataone]
20151117-07:40:34: [INFO]: Created SID (S1_2015320234023284) and head PID (P1_2015320234023282) pair. [org.dataone.integration.ContextAwareTestCaseDataone]
20151117-07:40:44: [INFO]: rest call info: PUT https://mn-dev-unm-2.test.dataone.org/metacat/d1/mn/v2/archive/P1_2015320234023282; MMP entity is null [org.dataone.client.rest.RestClient]
20151117-07:40:45: [INFO]: rest call info: PUT https://mn-dev-unm-2.test.dataone.org/metacat/d1/mn/v2/object/S1_2015320234023284; MMP message has: ParamPart:newPid = P9_2015320234044829; FilePart:object = /tmp/mmp.output.3612564629229223060.tmp (17181 bytes); FilePart:sysmeta = /tmp/mmp.output.789345966815453189.tmp (758 bytes);  [org.dataone.client.rest.RestClient]
20151117-07:40:45: [INFO]: **************************************************** [org.dataone.integration.ContextAwareTestCaseDataone]
20151117-07:40:45: [INFO]: ***  context label:   DEV2 [org.dataone.integration.ContextAwareTestCaseDataone]
20151117-07:40:45: [INFO]: **************************************************** [org.dataone.integration.ContextAwareTestCaseDataone]
20151117-07:40:45: [INFO]: **************************************************** [org.dataone.integration.ContextAwareTestCaseDataone]
20151117-07:40:45: [INFO]: testSidReuse() method ...  [org.dataone.integration.ContextAwareTestCaseDataone]
20151117-07:40:45: [INFO]: rest call info: GET https://mn-dev-ucsb-1.test.dataone.org/metacat/d1/mn/v2/monitor/ping [org.dataone.client.rest.RestClient]
20151117-07:40:45: [INFO]: MN excluded from test: https://mn-dev-ucsb-1.test.dataone.org/metacat/d1/mn [org.dataone.integration.ContextAwareTestCaseDataone]
20151117-07:40:46: [INFO]: rest call info: GET https://mn-dev-ucsb-2.test.dataone.org/metacat/d1/mn/v2/monitor/ping [org.dataone.client.rest.RestClient]
20151117-07:40:46: [INFO]: MN included in test: https://mn-dev-ucsb-2.test.dataone.org/metacat/d1/mn [org.dataone.integration.ContextAwareTestCaseDataone]
20151117-07:40:46: [INFO]: rest call info: GET https://mn-dev-unm-1.test.dataone.org/metacat/d1/mn/v2/monitor/ping [org.dataone.client.rest.RestClient]
20151117-07:40:46: [INFO]: MN excluded from test: https://mn-dev-unm-1.test.dataone.org/metacat/d1/mn [org.dataone.integration.ContextAwareTestCaseDataone]
20151117-07:40:46: [INFO]: rest call info: GET https://mn-dev-unm-2.test.dataone.org/metacat/d1/mn/v2/monitor/ping [org.dataone.client.rest.RestClient]
20151117-07:40:46: [INFO]: MN included in test: https://mn-dev-unm-2.test.dataone.org/metacat/d1/mn [org.dataone.integration.ContextAwareTestCaseDataone]
20151117-07:40:46: [INFO]: CREATING test object... pid: P1_2015320234046364 with a sid: S1_2015320234046371 obsoletes: null obsoletedBy: P2_2015320234046367 [org.dataone.integration.ContextAwareTestCaseDataone]
20151117-07:40:46: [INFO]: certificate directory: /etc/dataone/client/testClientCerts/ [org.dataone.integration.ContextAwareTestCaseDataone]
20151117-07:40:46: [INFO]: certificate filename: cnDevUNM2 [org.dataone.integration.ContextAwareTestCaseDataone]
20151117-07:40:46: [INFO]: client setup as Subject: CN=urn:node:cnDevUNM2,DC=dataone,DC=org [org.dataone.integration.ContextAwareTestCaseDataone]
20151117-07:40:46: [WARN]: Unable to find a valid authoritative MN to use for the object: org.dataone.service.types.v1.Identifier@7e19d801 [org.dataone.integration.ContextAwareTestCaseDataone]
20151117-07:40:46: [INFO]: creating a test object.  pid = P1_2015320234046364 on https://mn-dev-ucsb-2.test.dataone.org/metacat/d1/mn/v2 [org.dataone.integration.ContextAwareTestCaseDataone]
20151117-07:40:46: [INFO]: SystemMetadata for pid: P1_2015320234046364
<?xml version="1.0" encoding="UTF-8"?><d1_v2.0:systemMetadata xmlns:d1_v2.0="http://ns.dataone.org/service/types/v2.0" xmlns:d1="http://ns.dataone.org/service/types/v1"><serialVersion>1</serialVersion><identifier>P1_2015320234046364</identifier><formatId>eml://ecoinformatics.org/eml-2.0.1</formatId><size>17181</size><checksum algorithm="MD5">03ce09c6b4c3efc1681f3023402998a2</checksum><submitter>CN=urn:node:cnDevUNM2,DC=dataone,DC=org</submitter><rightsHolder>CN=testRightsHolder,DC=dataone,DC=org</rightsHolder><accessPolicy><allow><subject>public</subject><permission>read</permission></allow></accessPolicy><dateUploaded>2015-11-17T07:40:46.394+00:00</dateUploaded><dateSysMetadataModified>2015-11-17T07:40:46.394+00:00</dateSysMetadataModified><originMemberNode>bogusAuthoritativeNode</originMemberNode><authoritativeMemberNode>bogusAuthoritativeNode</authoritativeMemberNode><seriesId>S1_2015320234046371</seriesId></d1_v2.0:systemMetadata> [org.dataone.integration.ContextAwareTestCaseDataone]
20151117-07:40:55: [INFO]: rest call info: POST https://mn-dev-ucsb-2.test.dataone.org/metacat/d1/mn/v2/object; MMP message has: ParamPart:pid = P1_2015320234046364; FilePart:object = /tmp/mmp.output.3192574715728912717.tmp (17181 bytes); FilePart:sysmeta = /tmp/mmp.output.6375932388947170496.tmp (948 bytes);  [org.dataone.client.rest.RestClient]
20151117-07:40:55: [INFO]: object created.  pid = P1_2015320234046364 [org.dataone.integration.ContextAwareTestCaseDataone]
20151117-07:41:05: [INFO]: UPDATING test object... pid: P1_2015320234046364 with pid: P2_2015320234046367 with a sid: S2_2015320234046374 [org.dataone.integration.ContextAwareTestCaseDataone]
20151117-07:41:31: [INFO]: rest call info: PUT https://mn-dev-ucsb-2.test.dataone.org/metacat/d1/mn/v2/object/P1_2015320234046364; MMP message has: ParamPart:newPid = P2_2015320234046367; FilePart:object = /tmp/mmp.output.6318844753452289535.tmp (17181 bytes); FilePart:sysmeta = /tmp/mmp.output.4571860879236223280.tmp (799 bytes);  [org.dataone.client.rest.RestClient]
20151117-07:41:41: [INFO]: UPDATING test object... pid: P2_2015320234046367 with pid: P3_2015320234046369 with a sid: S1_2015320234046371 [org.dataone.integration.ContextAwareTestCaseDataone]
20151117-07:42:12: [INFO]: rest call info: PUT https://mn-dev-ucsb-2.test.dataone.org/metacat/d1/mn/v2/object/P2_2015320234046367; MMP message has: ParamPart:newPid = P3_2015320234046369; FilePart:object = /tmp/mmp.output.8667953886017051371.tmp (17181 bytes); FilePart:sysmeta = /tmp/mmp.output.6488458098782246821.tmp (799 bytes);  [org.dataone.client.rest.RestClient]
20151117-07:42:12: [INFO]: **************************************************** [org.dataone.integration.ContextAwareTestCaseDataone]
20151117-07:42:12: [INFO]: ***  context label:   DEV2 [org.dataone.integration.ContextAwareTestCaseDataone]
20151117-07:42:12: [INFO]: **************************************************** [org.dataone.integration.ContextAwareTestCaseDataone]
20151117-07:42:12: [INFO]: **************************************************** [org.dataone.integration.ContextAwareTestCaseDataone]
20151117-07:42:12: [INFO]: testSidReuseDiffChain() method ...  [org.dataone.integration.ContextAwareTestCaseDataone]
20151117-07:42:12: [INFO]: rest call info: GET https://mn-dev-ucsb-1.test.dataone.org/metacat/d1/mn/v2/monitor/ping [org.dataone.client.rest.RestClient]
20151117-07:42:12: [INFO]: MN excluded from test: https://mn-dev-ucsb-1.test.dataone.org/metacat/d1/mn [org.dataone.integration.ContextAwareTestCaseDataone]
20151117-07:42:12: [INFO]: rest call info: GET https://mn-dev-ucsb-2.test.dataone.org/metacat/d1/mn/v2/monitor/ping [org.dataone.client.rest.RestClient]
20151117-07:42:12: [INFO]: MN included in test: https://mn-dev-ucsb-2.test.dataone.org/metacat/d1/mn [org.dataone.integration.ContextAwareTestCaseDataone]
20151117-07:42:12: [INFO]: rest call info: GET https://mn-dev-unm-1.test.dataone.org/metacat/d1/mn/v2/monitor/ping [org.dataone.client.rest.RestClient]
20151117-07:42:12: [INFO]: MN excluded from test: https://mn-dev-unm-1.test.dataone.org/metacat/d1/mn [org.dataone.integration.ContextAwareTestCaseDataone]
20151117-07:42:13: [INFO]: rest call info: GET https://mn-dev-unm-2.test.dataone.org/metacat/d1/mn/v2/monitor/ping [org.dataone.client.rest.RestClient]
20151117-07:42:13: [INFO]: MN included in test: https://mn-dev-unm-2.test.dataone.org/metacat/d1/mn [org.dataone.integration.ContextAwareTestCaseDataone]
20151117-07:42:13: [INFO]: CREATING test object... pid: P1_201532023421357 with a sid: S1_201532023421367 obsoletes: null obsoletedBy: P2_201532023421359 [org.dataone.integration.ContextAwareTestCaseDataone]
20151117-07:42:13: [INFO]: certificate directory: /etc/dataone/client/testClientCerts/ [org.dataone.integration.ContextAwareTestCaseDataone]
20151117-07:42:13: [INFO]: certificate filename: cnDevUNM2 [org.dataone.integration.ContextAwareTestCaseDataone]
20151117-07:42:13: [INFO]: client setup as Subject: CN=urn:node:cnDevUNM2,DC=dataone,DC=org [org.dataone.integration.ContextAwareTestCaseDataone]
20151117-07:42:13: [WARN]: Unable to find a valid authoritative MN to use for the object: org.dataone.service.types.v1.Identifier@14b04174 [org.dataone.integration.ContextAwareTestCaseDataone]
20151117-07:42:13: [INFO]: creating a test object.  pid = P1_201532023421357 on https://mn-dev-ucsb-2.test.dataone.org/metacat/d1/mn/v2 [org.dataone.integration.ContextAwareTestCaseDataone]
20151117-07:42:13: [INFO]: SystemMetadata for pid: P1_201532023421357
<?xml version="1.0" encoding="UTF-8"?><d1_v2.0:systemMetadata xmlns:d1_v2.0="http://ns.dataone.org/service/types/v2.0" xmlns:d1="http://ns.dataone.org/service/types/v1"><serialVersion>1</serialVersion><identifier>P1_201532023421357</identifier><formatId>eml://ecoinformatics.org/eml-2.0.1</formatId><size>17181</size><checksum algorithm="MD5">03ce09c6b4c3efc1681f3023402998a2</checksum><submitter>CN=urn:node:cnDevUNM2,DC=dataone,DC=org</submitter><rightsHolder>CN=testRightsHolder,DC=dataone,DC=org</rightsHolder><accessPolicy><allow><subject>public</subject><permission>read</permission></allow></accessPolicy><dateUploaded>2015-11-17T07:42:13.090+00:00</dateUploaded><dateSysMetadataModified>2015-11-17T07:42:13.090+00:00</dateSysMetadataModified><originMemberNode>bogusAuthoritativeNode</originMemberNode><authoritativeMemberNode>bogusAuthoritativeNode</authoritativeMemberNode><seriesId>S1_201532023421367</seriesId></d1_v2.0:systemMetadata> [org.dataone.integration.ContextAwareTestCaseDataone]
20151117-07:42:30: [INFO]: rest call info: POST https://mn-dev-ucsb-2.test.dataone.org/metacat/d1/mn/v2/object; MMP message has: ParamPart:pid = P1_201532023421357; FilePart:object = /tmp/mmp.output.429000906551637369.tmp (17181 bytes); FilePart:sysmeta = /tmp/mmp.output.8669695970416969464.tmp (946 bytes);  [org.dataone.client.rest.RestClient]
20151117-07:42:30: [INFO]: object created.  pid = P1_201532023421357 [org.dataone.integration.ContextAwareTestCaseDataone]
20151117-07:42:40: [INFO]: UPDATING test object... pid: P1_201532023421357 with pid: P2_201532023421359 with a sid: S2_201532023421369 [org.dataone.integration.ContextAwareTestCaseDataone]
20151117-07:43:10: [INFO]: rest call info: PUT https://mn-dev-ucsb-2.test.dataone.org/metacat/d1/mn/v2/object/P1_201532023421357; MMP message has: ParamPart:newPid = P2_201532023421359; FilePart:object = /tmp/mmp.output.3419984630917259523.tmp (17181 bytes); FilePart:sysmeta = /tmp/mmp.output.2504031022316315574.tmp (796 bytes);  [org.dataone.client.rest.RestClient]
20151117-07:43:10: [INFO]: **************************************************** [org.dataone.integration.ContextAwareTestCaseDataone]
20151117-07:43:10: [INFO]: ***  context label:   DEV2 [org.dataone.integration.ContextAwareTestCaseDataone]
20151117-07:43:10: [INFO]: **************************************************** [org.dataone.integration.ContextAwareTestCaseDataone]
20151117-07:43:10: [INFO]: **************************************************** [org.dataone.integration.ContextAwareTestCaseDataone]
20151117-07:43:10: [INFO]: Testing getPackage() method ...  [org.dataone.integration.ContextAwareTestCaseDataone]
20151117-07:43:10: [INFO]: Testing getPackage(), Case1 [org.dataone.integration.ContextAwareTestCaseDataone]
20151117-07:43:10: [INFO]: rest call info: GET https://mn-dev-ucsb-1.test.dataone.org/metacat/d1/mn/v2/monitor/ping [org.dataone.client.rest.RestClient]
20151117-07:43:10: [INFO]: MN excluded from test: https://mn-dev-ucsb-1.test.dataone.org/metacat/d1/mn [org.dataone.integration.ContextAwareTestCaseDataone]
20151117-07:43:11: [INFO]: rest call info: GET https://mn-dev-ucsb-2.test.dataone.org/metacat/d1/mn/v2/monitor/ping [org.dataone.client.rest.RestClient]
20151117-07:43:11: [INFO]: MN included in test: https://mn-dev-ucsb-2.test.dataone.org/metacat/d1/mn [org.dataone.integration.ContextAwareTestCaseDataone]
20151117-07:43:11: [INFO]: rest call info: GET https://mn-dev-unm-1.test.dataone.org/metacat/d1/mn/v2/monitor/ping [org.dataone.client.rest.RestClient]
20151117-07:43:11: [INFO]: MN excluded from test: https://mn-dev-unm-1.test.dataone.org/metacat/d1/mn [org.dataone.integration.ContextAwareTestCaseDataone]
20151117-07:43:11: [INFO]: rest call info: GET https://mn-dev-unm-2.test.dataone.org/metacat/d1/mn/v2/monitor/ping [org.dataone.client.rest.RestClient]
20151117-07:43:11: [INFO]: MN included in test: https://mn-dev-unm-2.test.dataone.org/metacat/d1/mn [org.dataone.integration.ContextAwareTestCaseDataone]
20151117-07:43:11: [INFO]: certificate directory: /etc/dataone/client/testClientCerts/ [org.dataone.integration.ContextAwareTestCaseDataone]
20151117-07:43:11: [INFO]: certificate filename: cnDevUNM2 [org.dataone.integration.ContextAwareTestCaseDataone]
20151117-07:43:11: [INFO]: client setup as Subject: CN=urn:node:cnDevUNM2,DC=dataone,DC=org [org.dataone.integration.ContextAwareTestCaseDataone]
20151117-07:43:11: [INFO]: creating a test object.  pid = testPackage_scimeta_2015320234311716 on https://mn-dev-ucsb-2.test.dataone.org/metacat/d1/mn/v2 [org.dataone.integration.ContextAwareTestCaseDataone]
20151117-07:43:11: [INFO]: SystemMetadata for pid: testPackage_scimeta_2015320234311716
<?xml version="1.0" encoding="UTF-8"?><d1_v2.0:systemMetadata xmlns:d1_v2.0="http://ns.dataone.org/service/types/v2.0" xmlns:d1="http://ns.dataone.org/service/types/v1"><serialVersion>1</serialVersion><identifier>testPackage_scimeta_2015320234311716</identifier><formatId>eml://ecoinformatics.org/eml-2.0.1</formatId><size>17181</size><checksum algorithm="MD5">03ce09c6b4c3efc1681f3023402998a2</checksum><submitter>CN=urn:node:cnDevUNM2,DC=dataone,DC=org</submitter><rightsHolder>CN=testRightsHolder,DC=dataone,DC=org</rightsHolder><accessPolicy><allow><subject>CN=testRightsHolder,DC=dataone,DC=org</subject><permission>read</permission></allow></accessPolicy><dateUploaded>2015-11-17T07:43:11.735+00:00</dateUploaded><dateSysMetadataModified>2015-11-17T07:43:11.735+00:00</dateSysMetadataModified><originMemberNode>urn:node:mnDevUCSB2</originMemberNode><authoritativeMemberNode>urn:node:mnDevUCSB2</authoritativeMemberNode></d1_v2.0:systemMetadata> [org.dataone.integration.ContextAwareTestCaseDataone]
20151117-07:43:22: [INFO]: rest call info: POST https://mn-dev-ucsb-2.test.dataone.org/metacat/d1/mn/v2/object; MMP message has: ParamPart:pid = testPackage_scimeta_2015320234311716; FilePart:object = /tmp/mmp.output.5015003427780863374.tmp (17181 bytes); FilePart:sysmeta = /tmp/mmp.output.3248245056367526173.tmp (950 bytes);  [org.dataone.client.rest.RestClient]
20151117-07:43:22: [INFO]: object created.  pid = testPackage_scimeta_2015320234311716 [org.dataone.integration.ContextAwareTestCaseDataone]
20151117-07:43:22: [INFO]: certificate directory: /etc/dataone/client/testClientCerts/ [org.dataone.integration.ContextAwareTestCaseDataone]
20151117-07:43:22: [INFO]: certificate filename: cnDevUNM2 [org.dataone.integration.ContextAwareTestCaseDataone]
20151117-07:43:22: [INFO]: client setup as Subject: CN=urn:node:cnDevUNM2,DC=dataone,DC=org [org.dataone.integration.ContextAwareTestCaseDataone]
20151117-07:43:22: [INFO]: creating a test object.  pid = MNCallAdapterTierTests.mn-dev-ucsb-2.201532023432252.testPackage_dataObj_ on https://mn-dev-ucsb-2.test.dataone.org/metacat/d1/mn/v2 [org.dataone.integration.ContextAwareTestCaseDataone]
20151117-07:43:22: [INFO]: SystemMetadata for pid: MNCallAdapterTierTests.mn-dev-ucsb-2.201532023432252.testPackage_dataObj_
<?xml version="1.0" encoding="UTF-8"?><d1_v2.0:systemMetadata xmlns:d1_v2.0="http://ns.dataone.org/service/types/v2.0" xmlns:d1="http://ns.dataone.org/service/types/v1"><serialVersion>1</serialVersion><identifier>MNCallAdapterTierTests.mn-dev-ucsb-2.201532023432252.testPackage_dataObj_</identifier><formatId>eml://ecoinformatics.org/eml-2.0.1</formatId><size>17181</size><checksum algorithm="MD5">03ce09c6b4c3efc1681f3023402998a2</checksum><submitter>CN=urn:node:cnDevUNM2,DC=dataone,DC=org</submitter><rightsHolder>CN=testRightsHolder,DC=dataone,DC=org</rightsHolder><accessPolicy><allow><subject>CN=testRightsHolder,DC=dataone,DC=org</subject><permission>read</permission></allow></accessPolicy><dateUploaded>2015-11-17T07:43:22.068+00:00</dateUploaded><dateSysMetadataModified>2015-11-17T07:43:22.068+00:00</dateSysMetadataModified><originMemberNode>urn:node:mnDevUCSB2</originMemberNode><authoritativeMemberNode>urn:node:mnDevUCSB2</authoritativeMemberNode></d1_v2.0:systemMetadata> [org.dataone.integration.ContextAwareTestCaseDataone]
20151117-07:43:38: [INFO]: rest call info: POST https://mn-dev-ucsb-2.test.dataone.org/metacat/d1/mn/v2/object; MMP message has: ParamPart:pid = MNCallAdapterTierTests.mn-dev-ucsb-2.201532023432252.testPackage_dataObj_; FilePart:object = /tmp/mmp.output.9054199015985535190.tmp (17181 bytes); FilePart:sysmeta = /tmp/mmp.output.4705783812667287349.tmp (987 bytes);  [org.dataone.client.rest.RestClient]
20151117-07:43:38: [INFO]: object created.  pid = MNCallAdapterTierTests.mn-dev-ucsb-2.201532023432252.testPackage_dataObj_ [org.dataone.integration.ContextAwareTestCaseDataone]
20151117-07:43:54: [INFO]: rest call info: POST https://mn-dev-ucsb-2.test.dataone.org/metacat/d1/mn/v2/object; MMP message has: ParamPart:pid = P1_2015320234311713; FilePart:object = /tmp/mmp.output.7030461945809536488.tmp (2996 bytes); FilePart:sysmeta = /tmp/mmp.output.2329037522373815461.tmp (790 bytes);  [org.dataone.client.rest.RestClient]
20151117-07:43:54: [INFO]: Created SID (S1_2015320234311716) and head PID (P1_2015320234311713) pair. [org.dataone.integration.ContextAwareTestCaseDataone]
20151117-07:45:54: [INFO]: rest call info: GET https://mn-dev-ucsb-2.test.dataone.org/metacat/d1/mn/v2/packages/application%2Fbagit-097/S1_2015320234311716 [org.dataone.client.rest.RestClient]
org.dataone.service.exceptions.ServiceFailure: class org.dataone.client.exception.ClientSideException: /Read timed out
	at org.dataone.client.rest.HttpMultipartRestClient.doGetRequest(HttpMultipartRestClient.java:339)
	at org.dataone.client.rest.HttpMultipartRestClient.doGetRequest(HttpMultipartRestClient.java:318)
	at org.dataone.client.v2.impl.MultipartMNode.getPackage(MultipartMNode.java:739)
	at org.dataone.integration.adapters.MNCallAdapter.getPackage(MNCallAdapter.java:206)
	at org.dataone.integration.it.testImplementations.SidMNTestImplementations.testGetPackage(SidMNTestImplementations.java:646)
	at sun.reflect.NativeMethodAccessorImpl.invoke0(Native Method)
	at sun.reflect.NativeMethodAccessorImpl.invoke(NativeMethodAccessorImpl.java:57)
	at sun.reflect.DelegatingMethodAccessorImpl.invoke(DelegatingMethodAccessorImpl.java:43)
	at java.lang.reflect.Method.invoke(Method.java:606)
	at org.junit.runners.model.FrameworkMethod$1.runReflectiveCall(FrameworkMethod.java:44)
	at org.junit.internal.runners.model.ReflectiveCallable.run(ReflectiveCallable.java:15)
	at org.junit.runners.model.FrameworkMethod.invokeExplosively(FrameworkMethod.java:41)
	at org.junit.internal.runners.statements.InvokeMethod.evaluate(InvokeMethod.java:20)
	at org.junit.rules.Verifier$1.evaluate(Verifier.java:34)
	at org.junit.internal.runners.statements.RunBefores.evaluate(RunBefores.java:28)
	at org.junit.runners.BlockJUnit4ClassRunner.runChild(BlockJUnit4ClassRunner.java:76)
	at org.junit.runners.BlockJUnit4ClassRunner.runChild(BlockJUnit4ClassRunner.java:50)
	at org.junit.runners.ParentRunner$3.run(ParentRunner.java:193)
	at org.junit.runners.ParentRunner$1.schedule(ParentRunner.java:52)
	at org.junit.runners.ParentRunner.runChildren(ParentRunner.java:191)
	at org.junit.runners.ParentRunner.access$000(ParentRunner.java:42)
	at org.junit.runners.ParentRunner$2.evaluate(ParentRunner.java:184)
	at org.junit.runners.ParentRunner.run(ParentRunner.java:236)
	at org.apache.maven.surefire.junit4.JUnit4TestSet.execute(JUnit4TestSet.java:53)
	at org.apache.maven.surefire.junit4.JUnit4Provider.executeTestSet(JUnit4Provider.java:119)
	at org.apache.maven.surefire.junit4.JUnit4Provider.invoke(JUnit4Provider.java:101)
	at sun.reflect.NativeMethodAccessorImpl.invoke0(Native Method)
	at sun.reflect.NativeMethodAccessorImpl.invoke(NativeMethodAccessorImpl.java:57)
	at sun.reflect.DelegatingMethodAccessorImpl.invoke(DelegatingMethodAccessorImpl.java:43)
	at java.lang.reflect.Method.invoke(Method.java:606)
	at org.apache.maven.surefire.booter.ProviderFactory$ClassLoaderProxy.invoke(ProviderFactory.java:103)
	at com.sun.proxy.$Proxy0.invoke(Unknown Source)
	at org.apache.maven.surefire.booter.SurefireStarter.invokeProvider(SurefireStarter.java:150)
	at org.apache.maven.surefire.booter.SurefireStarter.runSuitesInProcess(SurefireStarter.java:91)
	at org.apache.maven.surefire.booter.ForkedBooter.main(ForkedBooter.java:69)
Caused by: org.dataone.client.exception.ClientSideException: /Read timed out
	... 35 more
Caused by: java.net.SocketTimeoutException: Read timed out
	at java.net.SocketInputStream.socketRead0(Native Method)
	at java.net.SocketInputStream.read(SocketInputStream.java:152)
	at java.net.SocketInputStream.read(SocketInputStream.java:122)
	at sun.security.ssl.InputRecord.readFully(InputRecord.java:442)
	at sun.security.ssl.InputRecord.read(InputRecord.java:480)
	at sun.security.ssl.SSLSocketImpl.readRecord(SSLSocketImpl.java:946)
	at sun.security.ssl.SSLSocketImpl.readDataRecord(SSLSocketImpl.java:903)
	at sun.security.ssl.AppInputStream.read(AppInputStream.java:102)
	at org.apache.http.impl.io.SessionInputBufferImpl.streamRead(SessionInputBufferImpl.java:136)
	at org.apache.http.impl.io.SessionInputBufferImpl.fillBuffer(SessionInputBufferImpl.java:152)
	at org.apache.http.impl.io.SessionInputBufferImpl.readLine(SessionInputBufferImpl.java:270)
	at org.apache.http.impl.conn.DefaultHttpResponseParser.parseHead(DefaultHttpResponseParser.java:140)
	at org.apache.http.impl.conn.DefaultHttpResponseParser.parseHead(DefaultHttpResponseParser.java:57)
	at org.apache.http.impl.io.AbstractMessageParser.parse(AbstractMessageParser.java:260)
	at org.apache.http.impl.DefaultBHttpClientConnection.receiveResponseHeader(DefaultBHttpClientConnection.java:161)
	at sun.reflect.GeneratedMethodAccessor9.invoke(Unknown Source)
	at sun.reflect.DelegatingMethodAccessorImpl.invoke(DelegatingMethodAccessorImpl.java:43)
	at java.lang.reflect.Method.invoke(Method.java:606)
	at org.apache.http.impl.conn.CPoolProxy.invoke(CPoolProxy.java:138)
	at com.sun.proxy.$Proxy9.receiveResponseHeader(Unknown Source)
	at org.apache.http.protocol.HttpRequestExecutor.doReceiveResponse(HttpRequestExecutor.java:271)
	at org.apache.http.protocol.HttpRequestExecutor.execute(HttpRequestExecutor.java:123)
	at org.apache.http.impl.execchain.MainClientExec.execute(MainClientExec.java:254)
	at org.apache.http.impl.execchain.ProtocolExec.execute(ProtocolExec.java:195)
	at org.apache.http.impl.execchain.RetryExec.execute(RetryExec.java:86)
	at org.apache.http.impl.execchain.RedirectExec.execute(RedirectExec.java:108)
	at org.apache.http.impl.client.InternalHttpClient.doExecute(InternalHttpClient.java:186)
	at org.apache.http.impl.client.CloseableHttpClient.execute(CloseableHttpClient.java:82)
	at org.apache.http.impl.client.CloseableHttpClient.execute(CloseableHttpClient.java:106)
	at org.apache.http.impl.client.CloseableHttpClient.execute(CloseableHttpClient.java:57)
	at org.dataone.client.rest.RestClient.doRequest(RestClient.java:294)
	at org.dataone.client.rest.RestClient.doRequestNoBody(RestClient.java:230)
	at org.dataone.client.rest.RestClient.doGetRequest(RestClient.java:148)
	at org.dataone.client.rest.HttpMultipartRestClient.doGetRequest(HttpMultipartRestClient.java:329)
	... 34 more
20151117-07:45:54: [INFO]: **************************************************** [org.dataone.integration.ContextAwareTestCaseDataone]
20151117-07:45:54: [INFO]: ***  context label:   DEV2 [org.dataone.integration.ContextAwareTestCaseDataone]
20151117-07:45:54: [INFO]: **************************************************** [org.dataone.integration.ContextAwareTestCaseDataone]
20151117-07:45:54: [INFO]: **************************************************** [org.dataone.integration.ContextAwareTestCaseDataone]
20151117-07:45:54: [INFO]: Testing getSystemMetadata() method ...  [org.dataone.integration.ContextAwareTestCaseDataone]
20151117-07:45:54: [INFO]: Testing getSystemMetadata(), Case1 [org.dataone.integration.ContextAwareTestCaseDataone]
20151117-07:45:55: [INFO]: rest call info: GET https://mn-dev-ucsb-1.test.dataone.org/metacat/d1/mn/v2/monitor/ping [org.dataone.client.rest.RestClient]
20151117-07:45:55: [INFO]: MN excluded from test: https://mn-dev-ucsb-1.test.dataone.org/metacat/d1/mn [org.dataone.integration.ContextAwareTestCaseDataone]
20151117-07:45:56: [INFO]: rest call info: GET https://mn-dev-ucsb-2.test.dataone.org/metacat/d1/mn/v2/monitor/ping [org.dataone.client.rest.RestClient]
20151117-07:45:56: [INFO]: MN included in test: https://mn-dev-ucsb-2.test.dataone.org/metacat/d1/mn [org.dataone.integration.ContextAwareTestCaseDataone]
20151117-07:45:56: [INFO]: rest call info: GET https://mn-dev-unm-1.test.dataone.org/metacat/d1/mn/v2/monitor/ping [org.dataone.client.rest.RestClient]
20151117-07:45:56: [INFO]: MN excluded from test: https://mn-dev-unm-1.test.dataone.org/metacat/d1/mn [org.dataone.integration.ContextAwareTestCaseDataone]
20151117-07:45:56: [INFO]: rest call info: GET https://mn-dev-unm-2.test.dataone.org/metacat/d1/mn/v2/monitor/ping [org.dataone.client.rest.RestClient]
20151117-07:45:56: [INFO]: MN included in test: https://mn-dev-unm-2.test.dataone.org/metacat/d1/mn [org.dataone.integration.ContextAwareTestCaseDataone]
20151117-07:45:56: [INFO]: CREATING test object... pid: P1_2015320234556804 with a sid: S1_2015320234556807 obsoletes: null obsoletedBy: null [org.dataone.integration.ContextAwareTestCaseDataone]
20151117-07:45:56: [INFO]: certificate directory: /etc/dataone/client/testClientCerts/ [org.dataone.integration.ContextAwareTestCaseDataone]
20151117-07:45:56: [INFO]: certificate filename: cnDevUNM2 [org.dataone.integration.ContextAwareTestCaseDataone]
20151117-07:45:56: [INFO]: client setup as Subject: CN=urn:node:cnDevUNM2,DC=dataone,DC=org [org.dataone.integration.ContextAwareTestCaseDataone]
20151117-07:45:56: [WARN]: Unable to find a valid authoritative MN to use for the object: org.dataone.service.types.v1.Identifier@86b03ca8 [org.dataone.integration.ContextAwareTestCaseDataone]
20151117-07:45:56: [INFO]: creating a test object.  pid = P1_2015320234556804 on https://mn-dev-ucsb-2.test.dataone.org/metacat/d1/mn/v2 [org.dataone.integration.ContextAwareTestCaseDataone]
20151117-07:45:56: [INFO]: SystemMetadata for pid: P1_2015320234556804
<?xml version="1.0" encoding="UTF-8"?><d1_v2.0:systemMetadata xmlns:d1_v2.0="http://ns.dataone.org/service/types/v2.0" xmlns:d1="http://ns.dataone.org/service/types/v1"><serialVersion>1</serialVersion><identifier>P1_2015320234556804</identifier><formatId>eml://ecoinformatics.org/eml-2.0.1</formatId><size>17181</size><checksum algorithm="MD5">03ce09c6b4c3efc1681f3023402998a2</checksum><submitter>CN=urn:node:cnDevUNM2,DC=dataone,DC=org</submitter><rightsHolder>CN=testRightsHolder,DC=dataone,DC=org</rightsHolder><accessPolicy><allow><subject>public</subject><permission>read</permission></allow></accessPolicy><dateUploaded>2015-11-17T07:45:56.823+00:00</dateUploaded><dateSysMetadataModified>2015-11-17T07:45:56.823+00:00</dateSysMetadataModified><originMemberNode>bogusAuthoritativeNode</originMemberNode><authoritativeMemberNode>bogusAuthoritativeNode</authoritativeMemberNode><seriesId>S1_2015320234556807</seriesId></d1_v2.0:systemMetadata> [org.dataone.integration.ContextAwareTestCaseDataone]
20151117-07:46:07: [INFO]: rest call info: POST https://mn-dev-ucsb-2.test.dataone.org/metacat/d1/mn/v2/object; MMP message has: ParamPart:pid = P1_2015320234556804; FilePart:object = /tmp/mmp.output.1142971561936386670.tmp (17181 bytes); FilePart:sysmeta = /tmp/mmp.output.1114527451587611727.tmp (948 bytes);  [org.dataone.client.rest.RestClient]
20151117-07:46:07: [INFO]: object created.  pid = P1_2015320234556804 [org.dataone.integration.ContextAwareTestCaseDataone]
20151117-07:46:17: [INFO]: Created SID (S1_2015320234556807) and head PID (P1_2015320234556804) pair. [org.dataone.integration.ContextAwareTestCaseDataone]
20151117-07:46:39: [INFO]: rest call info: GET https://mn-dev-ucsb-2.test.dataone.org/metacat/d1/mn/v2/meta/S1_2015320234556807 [org.dataone.client.rest.RestClient]
20151117-07:46:39: [INFO]: CREATING test object... pid: P1_2015320234639919 with a sid: S1_2015320234639921 obsoletes: null obsoletedBy: null [org.dataone.integration.ContextAwareTestCaseDataone]
20151117-07:46:39: [INFO]: certificate directory: /etc/dataone/client/testClientCerts/ [org.dataone.integration.ContextAwareTestCaseDataone]
20151117-07:46:39: [INFO]: certificate filename: cnDevUNM2 [org.dataone.integration.ContextAwareTestCaseDataone]
20151117-07:46:39: [INFO]: client setup as Subject: CN=urn:node:cnDevUNM2,DC=dataone,DC=org [org.dataone.integration.ContextAwareTestCaseDataone]
20151117-07:46:39: [WARN]: Unable to find a valid authoritative MN to use for the object: org.dataone.service.types.v1.Identifier@884a4747 [org.dataone.integration.ContextAwareTestCaseDataone]
20151117-07:46:39: [INFO]: creating a test object.  pid = P1_2015320234639919 on https://mn-dev-unm-2.test.dataone.org/metacat/d1/mn/v2 [org.dataone.integration.ContextAwareTestCaseDataone]
20151117-07:46:39: [INFO]: SystemMetadata for pid: P1_2015320234639919
<?xml version="1.0" encoding="UTF-8"?><d1_v2.0:systemMetadata xmlns:d1_v2.0="http://ns.dataone.org/service/types/v2.0" xmlns:d1="http://ns.dataone.org/service/types/v1"><serialVersion>1</serialVersion><identifier>P1_2015320234639919</identifier><formatId>eml://ecoinformatics.org/eml-2.0.1</formatId><size>17181</size><checksum algorithm="MD5">03ce09c6b4c3efc1681f3023402998a2</checksum><submitter>CN=urn:node:cnDevUNM2,DC=dataone,DC=org</submitter><rightsHolder>CN=testRightsHolder,DC=dataone,DC=org</rightsHolder><accessPolicy><allow><subject>public</subject><permission>read</permission></allow></accessPolicy><dateUploaded>2015-11-17T07:46:39.938+00:00</dateUploaded><dateSysMetadataModified>2015-11-17T07:46:39.938+00:00</dateSysMetadataModified><originMemberNode>bogusAuthoritativeNode</originMemberNode><authoritativeMemberNode>bogusAuthoritativeNode</authoritativeMemberNode><seriesId>S1_2015320234639921</seriesId></d1_v2.0:systemMetadata> [org.dataone.integration.ContextAwareTestCaseDataone]
20151117-07:46:40: [INFO]: rest call info: POST https://mn-dev-unm-2.test.dataone.org/metacat/d1/mn/v2/object; MMP message has: ParamPart:pid = P1_2015320234639919; FilePart:object = /tmp/mmp.output.8801671860505989165.tmp (17181 bytes); FilePart:sysmeta = /tmp/mmp.output.4978871406218345888.tmp (948 bytes);  [org.dataone.client.rest.RestClient]
20151117-07:46:40: [INFO]: object created.  pid = P1_2015320234639919 [org.dataone.integration.ContextAwareTestCaseDataone]
20151117-07:46:50: [INFO]: Created SID (S1_2015320234639921) and head PID (P1_2015320234639919) pair. [org.dataone.integration.ContextAwareTestCaseDataone]
20151117-07:47:01: [INFO]: rest call info: GET https://mn-dev-unm-2.test.dataone.org/metacat/d1/mn/v2/meta/S1_2015320234639921 [org.dataone.client.rest.RestClient]
20151117-07:47:01: [INFO]: **************************************************** [org.dataone.integration.ContextAwareTestCaseDataone]
20151117-07:47:01: [INFO]: ***  context label:   DEV2 [org.dataone.integration.ContextAwareTestCaseDataone]
20151117-07:47:01: [INFO]: **************************************************** [org.dataone.integration.ContextAwareTestCaseDataone]
20151117-07:47:01: [INFO]: **************************************************** [org.dataone.integration.ContextAwareTestCaseDataone]
20151117-07:47:01: [INFO]: Testing get() method ...  [org.dataone.integration.ContextAwareTestCaseDataone]
20151117-07:47:01: [INFO]: Testing get(), Case1 [org.dataone.integration.ContextAwareTestCaseDataone]
20151117-07:47:01: [INFO]: rest call info: GET https://mn-dev-ucsb-1.test.dataone.org/metacat/d1/mn/v2/monitor/ping [org.dataone.client.rest.RestClient]
20151117-07:47:01: [INFO]: MN excluded from test: https://mn-dev-ucsb-1.test.dataone.org/metacat/d1/mn [org.dataone.integration.ContextAwareTestCaseDataone]
20151117-07:47:01: [INFO]: rest call info: GET https://mn-dev-ucsb-2.test.dataone.org/metacat/d1/mn/v2/monitor/ping [org.dataone.client.rest.RestClient]
20151117-07:47:01: [INFO]: MN included in test: https://mn-dev-ucsb-2.test.dataone.org/metacat/d1/mn [org.dataone.integration.ContextAwareTestCaseDataone]
20151117-07:47:02: [INFO]: rest call info: GET https://mn-dev-unm-1.test.dataone.org/metacat/d1/mn/v2/monitor/ping [org.dataone.client.rest.RestClient]
20151117-07:47:02: [INFO]: MN excluded from test: https://mn-dev-unm-1.test.dataone.org/metacat/d1/mn [org.dataone.integration.ContextAwareTestCaseDataone]
20151117-07:47:02: [INFO]: rest call info: GET https://mn-dev-unm-2.test.dataone.org/metacat/d1/mn/v2/monitor/ping [org.dataone.client.rest.RestClient]
20151117-07:47:02: [INFO]: MN included in test: https://mn-dev-unm-2.test.dataone.org/metacat/d1/mn [org.dataone.integration.ContextAwareTestCaseDataone]
20151117-07:47:02: [INFO]: CREATING test object... pid: P1_201532023472141 with a sid: S1_201532023472143 obsoletes: null obsoletedBy: null [org.dataone.integration.ContextAwareTestCaseDataone]
20151117-07:47:02: [INFO]: certificate directory: /etc/dataone/client/testClientCerts/ [org.dataone.integration.ContextAwareTestCaseDataone]
20151117-07:47:02: [INFO]: certificate filename: cnDevUNM2 [org.dataone.integration.ContextAwareTestCaseDataone]
20151117-07:47:02: [INFO]: client setup as Subject: CN=urn:node:cnDevUNM2,DC=dataone,DC=org [org.dataone.integration.ContextAwareTestCaseDataone]
20151117-07:47:02: [WARN]: Unable to find a valid authoritative MN to use for the object: org.dataone.service.types.v1.Identifier@14f723b1 [org.dataone.integration.ContextAwareTestCaseDataone]
20151117-07:47:02: [INFO]: creating a test object.  pid = P1_201532023472141 on https://mn-dev-ucsb-2.test.dataone.org/metacat/d1/mn/v2 [org.dataone.integration.ContextAwareTestCaseDataone]
20151117-07:47:02: [INFO]: SystemMetadata for pid: P1_201532023472141
<?xml version="1.0" encoding="UTF-8"?><d1_v2.0:systemMetadata xmlns:d1_v2.0="http://ns.dataone.org/service/types/v2.0" xmlns:d1="http://ns.dataone.org/service/types/v1"><serialVersion>1</serialVersion><identifier>P1_201532023472141</identifier><formatId>eml://ecoinformatics.org/eml-2.0.1</formatId><size>17181</size><checksum algorithm="MD5">03ce09c6b4c3efc1681f3023402998a2</checksum><submitter>CN=urn:node:cnDevUNM2,DC=dataone,DC=org</submitter><rightsHolder>CN=testRightsHolder,DC=dataone,DC=org</rightsHolder><accessPolicy><allow><subject>public</subject><permission>read</permission></allow></accessPolicy><dateUploaded>2015-11-17T07:47:02.159+00:00</dateUploaded><dateSysMetadataModified>2015-11-17T07:47:02.159+00:00</dateSysMetadataModified><originMemberNode>bogusAuthoritativeNode</originMemberNode><authoritativeMemberNode>bogusAuthoritativeNode</authoritativeMemberNode><seriesId>S1_201532023472143</seriesId></d1_v2.0:systemMetadata> [org.dataone.integration.ContextAwareTestCaseDataone]
20151117-07:47:13: [INFO]: rest call info: POST https://mn-dev-ucsb-2.test.dataone.org/metacat/d1/mn/v2/object; MMP message has: ParamPart:pid = P1_201532023472141; FilePart:object = /tmp/mmp.output.1162529167614400468.tmp (17181 bytes); FilePart:sysmeta = /tmp/mmp.output.1064222447486395626.tmp (946 bytes);  [org.dataone.client.rest.RestClient]
20151117-07:47:13: [INFO]: object created.  pid = P1_201532023472141 [org.dataone.integration.ContextAwareTestCaseDataone]
20151117-07:47:23: [INFO]: Created SID (S1_201532023472143) and head PID (P1_201532023472141) pair. [org.dataone.integration.ContextAwareTestCaseDataone]
20151117-07:47:54: [INFO]: rest call info: GET https://mn-dev-ucsb-2.test.dataone.org/metacat/d1/mn/v2/object/S1_201532023472143 [org.dataone.client.rest.RestClient]
org.dataone.service.exceptions.ServiceFailure: class org.dataone.client.exception.ClientSideException: /Read timed out
	at org.dataone.client.rest.HttpMultipartRestClient.doGetRequest(HttpMultipartRestClient.java:339)
	at org.dataone.client.rest.HttpMultipartRestClient.doGetRequest(HttpMultipartRestClient.java:318)
	at org.dataone.client.rest.MultipartD1Node.get(MultipartD1Node.java:392)
	at org.dataone.client.v2.impl.MultipartMNode.get(MultipartMNode.java:279)
	at org.dataone.integration.adapters.CommonCallAdapter.get(CommonCallAdapter.java:215)
	at org.dataone.integration.it.testImplementations.SidCommonTestImplementations.testGet(SidCommonTestImplementations.java:373)
	at sun.reflect.NativeMethodAccessorImpl.invoke0(Native Method)
	at sun.reflect.NativeMethodAccessorImpl.invoke(NativeMethodAccessorImpl.java:57)
	at sun.reflect.DelegatingMethodAccessorImpl.invoke(DelegatingMethodAccessorImpl.java:43)
	at java.lang.reflect.Method.invoke(Method.java:606)
	at org.junit.runners.model.FrameworkMethod$1.runReflectiveCall(FrameworkMethod.java:44)
	at org.junit.internal.runners.model.ReflectiveCallable.run(ReflectiveCallable.java:15)
	at org.junit.runners.model.FrameworkMethod.invokeExplosively(FrameworkMethod.java:41)
	at org.junit.internal.runners.statements.InvokeMethod.evaluate(InvokeMethod.java:20)
	at org.junit.rules.Verifier$1.evaluate(Verifier.java:34)
	at org.junit.internal.runners.statements.RunBefores.evaluate(RunBefores.java:28)
	at org.junit.runners.BlockJUnit4ClassRunner.runChild(BlockJUnit4ClassRunner.java:76)
	at org.junit.runners.BlockJUnit4ClassRunner.runChild(BlockJUnit4ClassRunner.java:50)
	at org.junit.runners.ParentRunner$3.run(ParentRunner.java:193)
	at org.junit.runners.ParentRunner$1.schedule(ParentRunner.java:52)
	at org.junit.runners.ParentRunner.runChildren(ParentRunner.java:191)
	at org.junit.runners.ParentRunner.access$000(ParentRunner.java:42)
	at org.junit.runners.ParentRunner$2.evaluate(ParentRunner.java:184)
	at org.junit.runners.ParentRunner.run(ParentRunner.java:236)
	at org.apache.maven.surefire.junit4.JUnit4TestSet.execute(JUnit4TestSet.java:53)
	at org.apache.maven.surefire.junit4.JUnit4Provider.executeTestSet(JUnit4Provider.java:119)
	at org.apache.maven.surefire.junit4.JUnit4Provider.invoke(JUnit4Provider.java:101)
	at sun.reflect.NativeMethodAccessorImpl.invoke0(Native Method)
	at sun.reflect.NativeMethodAccessorImpl.invoke(NativeMethodAccessorImpl.java:57)
	at sun.reflect.DelegatingMethodAccessorImpl.invoke(DelegatingMethodAccessorImpl.java:43)
	at java.lang.reflect.Method.invoke(Method.java:606)
	at org.apache.maven.surefire.booter.ProviderFactory$ClassLoaderProxy.invoke(ProviderFactory.java:103)
	at com.sun.proxy.$Proxy0.invoke(Unknown Source)
	at org.apache.maven.surefire.booter.SurefireStarter.invokeProvider(SurefireStarter.java:150)
	at org.apache.maven.surefire.booter.SurefireStarter.runSuitesInProcess(SurefireStarter.java:91)
	at org.apache.maven.surefire.booter.ForkedBooter.main(ForkedBooter.java:69)
Caused by: org.dataone.client.exception.ClientSideException: /Read timed out
	... 36 more
Caused by: java.net.SocketTimeoutException: Read timed out
	at java.net.SocketInputStream.socketRead0(Native Method)
	at java.net.SocketInputStream.read(SocketInputStream.java:152)
	at java.net.SocketInputStream.read(SocketInputStream.java:122)
	at sun.security.ssl.InputRecord.readFully(InputRecord.java:442)
	at sun.security.ssl.InputRecord.read(InputRecord.java:480)
	at sun.security.ssl.SSLSocketImpl.readRecord(SSLSocketImpl.java:946)
	at sun.security.ssl.SSLSocketImpl.readDataRecord(SSLSocketImpl.java:903)
	at sun.security.ssl.AppInputStream.read(AppInputStream.java:102)
	at org.apache.http.impl.io.SessionInputBufferImpl.streamRead(SessionInputBufferImpl.java:136)
	at org.apache.http.impl.io.SessionInputBufferImpl.fillBuffer(SessionInputBufferImpl.java:152)
	at org.apache.http.impl.io.SessionInputBufferImpl.readLine(SessionInputBufferImpl.java:270)
	at org.apache.http.impl.conn.DefaultHttpResponseParser.parseHead(DefaultHttpResponseParser.java:140)
	at org.apache.http.impl.conn.DefaultHttpResponseParser.parseHead(DefaultHttpResponseParser.java:57)
	at org.apache.http.impl.io.AbstractMessageParser.parse(AbstractMessageParser.java:260)
	at org.apache.http.impl.DefaultBHttpClientConnection.receiveResponseHeader(DefaultBHttpClientConnection.java:161)
	at sun.reflect.GeneratedMethodAccessor9.invoke(Unknown Source)
	at sun.reflect.DelegatingMethodAccessorImpl.invoke(DelegatingMethodAccessorImpl.java:43)
	at java.lang.reflect.Method.invoke(Method.java:606)
	at org.apache.http.impl.conn.CPoolProxy.invoke(CPoolProxy.java:138)
	at com.sun.proxy.$Proxy9.receiveResponseHeader(Unknown Source)
	at org.apache.http.protocol.HttpRequestExecutor.doReceiveResponse(HttpRequestExecutor.java:271)
	at org.apache.http.protocol.HttpRequestExecutor.execute(HttpRequestExecutor.java:123)
	at org.apache.http.impl.execchain.MainClientExec.execute(MainClientExec.java:254)
	at org.apache.http.impl.execchain.ProtocolExec.execute(ProtocolExec.java:195)
	at org.apache.http.impl.execchain.RetryExec.execute(RetryExec.java:86)
	at org.apache.http.impl.execchain.RedirectExec.execute(RedirectExec.java:108)
	at org.apache.http.impl.client.InternalHttpClient.doExecute(InternalHttpClient.java:186)
	at org.apache.http.impl.client.CloseableHttpClient.execute(CloseableHttpClient.java:82)
	at org.apache.http.impl.client.CloseableHttpClient.execute(CloseableHttpClient.java:106)
	at org.apache.http.impl.client.CloseableHttpClient.execute(CloseableHttpClient.java:57)
	at org.dataone.client.rest.RestClient.doRequest(RestClient.java:294)
	at org.dataone.client.rest.RestClient.doRequestNoBody(RestClient.java:230)
	at org.dataone.client.rest.RestClient.doGetRequest(RestClient.java:148)
	at org.dataone.client.rest.HttpMultipartRestClient.doGetRequest(HttpMultipartRestClient.java:329)
	... 35 more
20151117-07:47:54: [INFO]: CREATING test object... pid: P1_201532023475458 with a sid: S1_201532023475461 obsoletes: null obsoletedBy: null [org.dataone.integration.ContextAwareTestCaseDataone]
20151117-07:47:54: [INFO]: certificate directory: /etc/dataone/client/testClientCerts/ [org.dataone.integration.ContextAwareTestCaseDataone]
20151117-07:47:54: [INFO]: certificate filename: cnDevUNM2 [org.dataone.integration.ContextAwareTestCaseDataone]
20151117-07:47:54: [INFO]: client setup as Subject: CN=urn:node:cnDevUNM2,DC=dataone,DC=org [org.dataone.integration.ContextAwareTestCaseDataone]
20151117-07:47:54: [WARN]: Unable to find a valid authoritative MN to use for the object: org.dataone.service.types.v1.Identifier@14f88c37 [org.dataone.integration.ContextAwareTestCaseDataone]
20151117-07:47:54: [INFO]: creating a test object.  pid = P1_201532023475458 on https://mn-dev-unm-2.test.dataone.org/metacat/d1/mn/v2 [org.dataone.integration.ContextAwareTestCaseDataone]
20151117-07:47:54: [INFO]: SystemMetadata for pid: P1_201532023475458
<?xml version="1.0" encoding="UTF-8"?><d1_v2.0:systemMetadata xmlns:d1_v2.0="http://ns.dataone.org/service/types/v2.0" xmlns:d1="http://ns.dataone.org/service/types/v1"><serialVersion>1</serialVersion><identifier>P1_201532023475458</identifier><formatId>eml://ecoinformatics.org/eml-2.0.1</formatId><size>17181</size><checksum algorithm="MD5">03ce09c6b4c3efc1681f3023402998a2</checksum><submitter>CN=urn:node:cnDevUNM2,DC=dataone,DC=org</submitter><rightsHolder>CN=testRightsHolder,DC=dataone,DC=org</rightsHolder><accessPolicy><allow><subject>public</subject><permission>read</permission></allow></accessPolicy><dateUploaded>2015-11-17T07:47:54.077+00:00</dateUploaded><dateSysMetadataModified>2015-11-17T07:47:54.077+00:00</dateSysMetadataModified><originMemberNode>bogusAuthoritativeNode</originMemberNode><authoritativeMemberNode>bogusAuthoritativeNode</authoritativeMemberNode><seriesId>S1_201532023475461</seriesId></d1_v2.0:systemMetadata> [org.dataone.integration.ContextAwareTestCaseDataone]
20151117-07:47:55: [INFO]: rest call info: POST https://mn-dev-unm-2.test.dataone.org/metacat/d1/mn/v2/object; MMP message has: ParamPart:pid = P1_201532023475458; FilePart:object = /tmp/mmp.output.6520557855295782499.tmp (17181 bytes); FilePart:sysmeta = /tmp/mmp.output.2365549256187929700.tmp (946 bytes);  [org.dataone.client.rest.RestClient]
20151117-07:47:55: [INFO]: object created.  pid = P1_201532023475458 [org.dataone.integration.ContextAwareTestCaseDataone]
20151117-07:48:05: [INFO]: Created SID (S1_201532023475461) and head PID (P1_201532023475458) pair. [org.dataone.integration.ContextAwareTestCaseDataone]
20151117-07:48:05: [INFO]: rest call info: GET https://mn-dev-unm-2.test.dataone.org/metacat/d1/mn/v2/object/S1_201532023475461 [org.dataone.client.rest.RestClient]
20151117-07:48:05: [INFO]: rest call info: GET https://mn-dev-unm-2.test.dataone.org/metacat/d1/mn/v2/object/P1_201532023475458 [org.dataone.client.rest.RestClient]
20151117-07:48:05: [INFO]: **************************************************** [org.dataone.integration.ContextAwareTestCaseDataone]
20151117-07:48:05: [INFO]: ***  context label:   DEV2 [org.dataone.integration.ContextAwareTestCaseDataone]
20151117-07:48:05: [INFO]: **************************************************** [org.dataone.integration.ContextAwareTestCaseDataone]
20151117-07:48:05: [INFO]: **************************************************** [org.dataone.integration.ContextAwareTestCaseDataone]
20151117-07:48:05: [INFO]: Testing describe() method ...  [org.dataone.integration.ContextAwareTestCaseDataone]
20151117-07:48:05: [INFO]: Testing describe(), Case1 [org.dataone.integration.ContextAwareTestCaseDataone]
20151117-07:48:06: [INFO]: rest call info: GET https://mn-dev-ucsb-1.test.dataone.org/metacat/d1/mn/v2/monitor/ping [org.dataone.client.rest.RestClient]
20151117-07:48:06: [INFO]: MN excluded from test: https://mn-dev-ucsb-1.test.dataone.org/metacat/d1/mn [org.dataone.integration.ContextAwareTestCaseDataone]
20151117-07:48:06: [INFO]: rest call info: GET https://mn-dev-ucsb-2.test.dataone.org/metacat/d1/mn/v2/monitor/ping [org.dataone.client.rest.RestClient]
20151117-07:48:06: [INFO]: MN included in test: https://mn-dev-ucsb-2.test.dataone.org/metacat/d1/mn [org.dataone.integration.ContextAwareTestCaseDataone]
20151117-07:48:06: [INFO]: rest call info: GET https://mn-dev-unm-1.test.dataone.org/metacat/d1/mn/v2/monitor/ping [org.dataone.client.rest.RestClient]
20151117-07:48:06: [INFO]: MN excluded from test: https://mn-dev-unm-1.test.dataone.org/metacat/d1/mn [org.dataone.integration.ContextAwareTestCaseDataone]
20151117-07:48:06: [INFO]: rest call info: GET https://mn-dev-unm-2.test.dataone.org/metacat/d1/mn/v2/monitor/ping [org.dataone.client.rest.RestClient]
20151117-07:48:06: [INFO]: MN included in test: https://mn-dev-unm-2.test.dataone.org/metacat/d1/mn [org.dataone.integration.ContextAwareTestCaseDataone]
20151117-07:48:06: [INFO]: CREATING test object... pid: P1_201532023486737 with a sid: S1_201532023486739 obsoletes: null obsoletedBy: null [org.dataone.integration.ContextAwareTestCaseDataone]
20151117-07:48:06: [INFO]: certificate directory: /etc/dataone/client/testClientCerts/ [org.dataone.integration.ContextAwareTestCaseDataone]
20151117-07:48:06: [INFO]: certificate filename: cnDevUNM2 [org.dataone.integration.ContextAwareTestCaseDataone]
20151117-07:48:06: [INFO]: client setup as Subject: CN=urn:node:cnDevUNM2,DC=dataone,DC=org [org.dataone.integration.ContextAwareTestCaseDataone]
20151117-07:48:06: [WARN]: Unable to find a valid authoritative MN to use for the object: org.dataone.service.types.v1.Identifier@1507231b [org.dataone.integration.ContextAwareTestCaseDataone]
20151117-07:48:06: [INFO]: creating a test object.  pid = P1_201532023486737 on https://mn-dev-ucsb-2.test.dataone.org/metacat/d1/mn/v2 [org.dataone.integration.ContextAwareTestCaseDataone]
20151117-07:48:06: [INFO]: SystemMetadata for pid: P1_201532023486737
<?xml version="1.0" encoding="UTF-8"?><d1_v2.0:systemMetadata xmlns:d1_v2.0="http://ns.dataone.org/service/types/v2.0" xmlns:d1="http://ns.dataone.org/service/types/v1"><serialVersion>1</serialVersion><identifier>P1_201532023486737</identifier><formatId>eml://ecoinformatics.org/eml-2.0.1</formatId><size>17181</size><checksum algorithm="MD5">03ce09c6b4c3efc1681f3023402998a2</checksum><submitter>CN=urn:node:cnDevUNM2,DC=dataone,DC=org</submitter><rightsHolder>CN=testRightsHolder,DC=dataone,DC=org</rightsHolder><accessPolicy><allow><subject>public</subject><permission>read</permission></allow></accessPolicy><dateUploaded>2015-11-17T07:48:06.755+00:00</dateUploaded><dateSysMetadataModified>2015-11-17T07:48:06.755+00:00</dateSysMetadataModified><originMemberNode>bogusAuthoritativeNode</originMemberNode><authoritativeMemberNode>bogusAuthoritativeNode</authoritativeMemberNode><seriesId>S1_201532023486739</seriesId></d1_v2.0:systemMetadata> [org.dataone.integration.ContextAwareTestCaseDataone]
20151117-07:48:36: [INFO]: rest call info: POST https://mn-dev-ucsb-2.test.dataone.org/metacat/d1/mn/v2/object; MMP message has: ParamPart:pid = P1_201532023486737; FilePart:object = /tmp/mmp.output.692316200686892445.tmp (17181 bytes); FilePart:sysmeta = /tmp/mmp.output.1762056917342503019.tmp (946 bytes);  [org.dataone.client.rest.RestClient]
java.lang.reflect.InvocationTargetException
	at sun.reflect.NativeMethodAccessorImpl.invoke0(Native Method)
	at sun.reflect.NativeMethodAccessorImpl.invoke(NativeMethodAccessorImpl.java:57)
	at sun.reflect.DelegatingMethodAccessorImpl.invoke(DelegatingMethodAccessorImpl.java:43)
	at java.lang.reflect.Method.invoke(Method.java:606)
	at org.dataone.integration.it.testImplementations.SidCommonTestImplementations.testDescribe(SidCommonTestImplementations.java:416)
	at sun.reflect.NativeMethodAccessorImpl.invoke0(Native Method)
	at sun.reflect.NativeMethodAccessorImpl.invoke(NativeMethodAccessorImpl.java:57)
	at sun.reflect.DelegatingMethodAccessorImpl.invoke(DelegatingMethodAccessorImpl.java:43)
	at java.lang.reflect.Method.invoke(Method.java:606)
	at org.junit.runners.model.FrameworkMethod$1.runReflectiveCall(FrameworkMethod.java:44)
	at org.junit.internal.runners.model.ReflectiveCallable.run(ReflectiveCallable.java:15)
	at org.junit.runners.model.FrameworkMethod.invokeExplosively(FrameworkMethod.java:41)
	at org.junit.internal.runners.statements.InvokeMethod.evaluate(InvokeMethod.java:20)
	at org.junit.rules.Verifier$1.evaluate(Verifier.java:34)
	at org.junit.internal.runners.statements.RunBefores.evaluate(RunBefores.java:28)
	at org.junit.runners.BlockJUnit4ClassRunner.runChild(BlockJUnit4ClassRunner.java:76)
	at org.junit.runners.BlockJUnit4ClassRunner.runChild(BlockJUnit4ClassRunner.java:50)
	at org.junit.runners.ParentRunner$3.run(ParentRunner.java:193)
	at org.junit.runners.ParentRunner$1.schedule(ParentRunner.java:52)
	at org.junit.runners.ParentRunner.runChildren(ParentRunner.java:191)
	at org.junit.runners.ParentRunner.access$000(ParentRunner.java:42)
	at org.junit.runners.ParentRunner$2.evaluate(ParentRunner.java:184)
	at org.junit.runners.ParentRunner.run(ParentRunner.java:236)
	at org.apache.maven.surefire.junit4.JUnit4TestSet.execute(JUnit4TestSet.java:53)
	at org.apache.maven.surefire.junit4.JUnit4Provider.executeTestSet(JUnit4Provider.java:119)
	at org.apache.maven.surefire.junit4.JUnit4Provider.invoke(JUnit4Provider.java:101)
	at sun.reflect.NativeMethodAccessorImpl.invoke0(Native Method)
	at sun.reflect.NativeMethodAccessorImpl.invoke(NativeMethodAccessorImpl.java:57)
	at sun.reflect.DelegatingMethodAccessorImpl.invoke(DelegatingMethodAccessorImpl.java:43)
	at java.lang.reflect.Method.invoke(Method.java:606)
	at org.apache.maven.surefire.booter.ProviderFactory$ClassLoaderProxy.invoke(ProviderFactory.java:103)
	at com.sun.proxy.$Proxy0.invoke(Unknown Source)
	at org.apache.maven.surefire.booter.SurefireStarter.invokeProvider(SurefireStarter.java:150)
	at org.apache.maven.surefire.booter.SurefireStarter.runSuitesInProcess(SurefireStarter.java:91)
	at org.apache.maven.surefire.booter.ForkedBooter.main(ForkedBooter.java:69)
Caused by: org.dataone.client.exception.ClientSideException: Unable to create test object!/class org.dataone.client.exception.ClientSideException: /Read timed out
	at org.dataone.integration.ContextAwareTestCaseDataone.createTestObject(ContextAwareTestCaseDataone.java:1474)
	at org.dataone.integration.ContextAwareTestCaseDataone.createTestObject(ContextAwareTestCaseDataone.java:1306)
	at org.dataone.integration.it.testImplementations.SidCommonTestImplementations.createTestObject(SidCommonTestImplementations.java:216)
	at org.dataone.integration.it.testImplementations.SidMNTestImplementations.setupMNCase1(SidMNTestImplementations.java:88)
	... 35 more
Caused by: org.dataone.service.exceptions.ServiceFailure: class org.dataone.client.exception.ClientSideException: /Read timed out
	at org.dataone.client.rest.HttpMultipartRestClient.doPostRequest(HttpMultipartRestClient.java:460)
	at org.dataone.client.v2.impl.MultipartMNode.create(MultipartMNode.java:495)
	at org.dataone.integration.adapters.CommonCallAdapter.create(CommonCallAdapter.java:505)
	at org.dataone.integration.ContextAwareTestCaseDataone.createTestObject(ContextAwareTestCaseDataone.java:1465)
	... 38 more
Caused by: org.dataone.client.exception.ClientSideException: /Read timed out
	... 42 more
Caused by: java.net.SocketTimeoutException: Read timed out
	at java.net.SocketInputStream.socketRead0(Native Method)
	at java.net.SocketInputStream.read(SocketInputStream.java:152)
	at java.net.SocketInputStream.read(SocketInputStream.java:122)
	at sun.security.ssl.InputRecord.readFully(InputRecord.java:442)
	at sun.security.ssl.InputRecord.read(InputRecord.java:480)
	at sun.security.ssl.SSLSocketImpl.readRecord(SSLSocketImpl.java:946)
	at sun.security.ssl.SSLSocketImpl.readDataRecord(SSLSocketImpl.java:903)
	at sun.security.ssl.AppInputStream.read(AppInputStream.java:102)
	at org.apache.http.impl.io.SessionInputBufferImpl.streamRead(SessionInputBufferImpl.java:136)
	at org.apache.http.impl.io.SessionInputBufferImpl.fillBuffer(SessionInputBufferImpl.java:152)
	at org.apache.http.impl.io.SessionInputBufferImpl.readLine(SessionInputBufferImpl.java:270)
	at org.apache.http.impl.conn.DefaultHttpResponseParser.parseHead(DefaultHttpResponseParser.java:140)
	at org.apache.http.impl.conn.DefaultHttpResponseParser.parseHead(DefaultHttpResponseParser.java:57)
	at org.apache.http.impl.io.AbstractMessageParser.parse(AbstractMessageParser.java:260)
	at org.apache.http.impl.DefaultBHttpClientConnection.receiveResponseHeader(DefaultBHttpClientConnection.java:161)
	at sun.reflect.GeneratedMethodAccessor9.invoke(Unknown Source)
	at sun.reflect.DelegatingMethodAccessorImpl.invoke(DelegatingMethodAccessorImpl.java:43)
	at java.lang.reflect.Method.invoke(Method.java:606)
	at org.apache.http.impl.conn.CPoolProxy.invoke(CPoolProxy.java:138)
	at com.sun.proxy.$Proxy9.receiveResponseHeader(Unknown Source)
	at org.apache.http.protocol.HttpRequestExecutor.doReceiveResponse(HttpRequestExecutor.java:271)
	at org.apache.http.protocol.HttpRequestExecutor.execute(HttpRequestExecutor.java:123)
	at org.apache.http.impl.execchain.MainClientExec.execute(MainClientExec.java:254)
	at org.apache.http.impl.execchain.ProtocolExec.execute(ProtocolExec.java:195)
	at org.apache.http.impl.execchain.RetryExec.execute(RetryExec.java:86)
	at org.apache.http.impl.execchain.RedirectExec.execute(RedirectExec.java:108)
	at org.apache.http.impl.client.InternalHttpClient.doExecute(InternalHttpClient.java:186)
	at org.apache.http.impl.client.CloseableHttpClient.execute(CloseableHttpClient.java:82)
	at org.apache.http.impl.client.CloseableHttpClient.execute(CloseableHttpClient.java:106)
	at org.apache.http.impl.client.CloseableHttpClient.execute(CloseableHttpClient.java:57)
	at org.dataone.client.rest.RestClient.doRequest(RestClient.java:294)
	at org.dataone.client.rest.RestClient.doRequestMMBody(RestClient.java:272)
	at org.dataone.client.rest.RestClient.doPostRequest(RestClient.java:192)
	at org.dataone.client.rest.HttpMultipartRestClient.doPostRequest(HttpMultipartRestClient.java:453)
	... 41 more
20151117-07:48:36: [INFO]: CREATING test object... pid: P1_2015320234836911 with a sid: S1_2015320234836914 obsoletes: null obsoletedBy: null [org.dataone.integration.ContextAwareTestCaseDataone]
20151117-07:48:36: [INFO]: certificate directory: /etc/dataone/client/testClientCerts/ [org.dataone.integration.ContextAwareTestCaseDataone]
20151117-07:48:36: [INFO]: certificate filename: cnDevUNM2 [org.dataone.integration.ContextAwareTestCaseDataone]
20151117-07:48:36: [INFO]: client setup as Subject: CN=urn:node:cnDevUNM2,DC=dataone,DC=org [org.dataone.integration.ContextAwareTestCaseDataone]
20151117-07:48:36: [WARN]: Unable to find a valid authoritative MN to use for the object: org.dataone.service.types.v1.Identifier@8bb29b60 [org.dataone.integration.ContextAwareTestCaseDataone]
20151117-07:48:36: [INFO]: creating a test object.  pid = P1_2015320234836911 on https://mn-dev-unm-2.test.dataone.org/metacat/d1/mn/v2 [org.dataone.integration.ContextAwareTestCaseDataone]
20151117-07:48:36: [INFO]: SystemMetadata for pid: P1_2015320234836911
<?xml version="1.0" encoding="UTF-8"?><d1_v2.0:systemMetadata xmlns:d1_v2.0="http://ns.dataone.org/service/types/v2.0" xmlns:d1="http://ns.dataone.org/service/types/v1"><serialVersion>1</serialVersion><identifier>P1_2015320234836911</identifier><formatId>eml://ecoinformatics.org/eml-2.0.1</formatId><size>17181</size><checksum algorithm="MD5">03ce09c6b4c3efc1681f3023402998a2</checksum><submitter>CN=urn:node:cnDevUNM2,DC=dataone,DC=org</submitter><rightsHolder>CN=testRightsHolder,DC=dataone,DC=org</rightsHolder><accessPolicy><allow><subject>public</subject><permission>read</permission></allow></accessPolicy><dateUploaded>2015-11-17T07:48:36.929+00:00</dateUploaded><dateSysMetadataModified>2015-11-17T07:48:36.929+00:00</dateSysMetadataModified><originMemberNode>bogusAuthoritativeNode</originMemberNode><authoritativeMemberNode>bogusAuthoritativeNode</authoritativeMemberNode><seriesId>S1_2015320234836914</seriesId></d1_v2.0:systemMetadata> [org.dataone.integration.ContextAwareTestCaseDataone]
20151117-07:48:37: [INFO]: rest call info: POST https://mn-dev-unm-2.test.dataone.org/metacat/d1/mn/v2/object; MMP message has: ParamPart:pid = P1_2015320234836911; FilePart:object = /tmp/mmp.output.6793505333752938478.tmp (17181 bytes); FilePart:sysmeta = /tmp/mmp.output.8356012022342217774.tmp (948 bytes);  [org.dataone.client.rest.RestClient]
20151117-07:48:37: [INFO]: object created.  pid = P1_2015320234836911 [org.dataone.integration.ContextAwareTestCaseDataone]
20151117-07:48:47: [INFO]: Created SID (S1_2015320234836914) and head PID (P1_2015320234836911) pair. [org.dataone.integration.ContextAwareTestCaseDataone]
20151117-07:48:48: [INFO]: rest call info: HEAD https://mn-dev-unm-2.test.dataone.org/metacat/d1/mn/v2/object/S1_2015320234836914 [org.dataone.client.rest.RestClient]
20151117-07:48:48: [INFO]: rest call info: HEAD https://mn-dev-unm-2.test.dataone.org/metacat/d1/mn/v2/object/P1_2015320234836911 [org.dataone.client.rest.RestClient]
20151117-07:48:48: [INFO]: **************************************************** [org.dataone.integration.ContextAwareTestCaseDataone]
20151117-07:48:48: [INFO]: ***  context label:   DEV2 [org.dataone.integration.ContextAwareTestCaseDataone]
20151117-07:48:48: [INFO]: **************************************************** [org.dataone.integration.ContextAwareTestCaseDataone]
20151117-07:48:48: [INFO]: **************************************************** [org.dataone.integration.ContextAwareTestCaseDataone]
20151117-07:48:48: [INFO]: Testing create() method ...  [org.dataone.integration.ContextAwareTestCaseDataone]
20151117-07:48:48: [INFO]: rest call info: GET https://mn-dev-ucsb-1.test.dataone.org/metacat/d1/mn/v2/monitor/ping [org.dataone.client.rest.RestClient]
20151117-07:48:48: [INFO]: MN excluded from test: https://mn-dev-ucsb-1.test.dataone.org/metacat/d1/mn [org.dataone.integration.ContextAwareTestCaseDataone]
20151117-07:48:49: [INFO]: rest call info: GET https://mn-dev-ucsb-2.test.dataone.org/metacat/d1/mn/v2/monitor/ping [org.dataone.client.rest.RestClient]
20151117-07:48:49: [INFO]: MN included in test: https://mn-dev-ucsb-2.test.dataone.org/metacat/d1/mn [org.dataone.integration.ContextAwareTestCaseDataone]
20151117-07:48:49: [INFO]: rest call info: GET https://mn-dev-unm-1.test.dataone.org/metacat/d1/mn/v2/monitor/ping [org.dataone.client.rest.RestClient]
20151117-07:48:49: [INFO]: MN excluded from test: https://mn-dev-unm-1.test.dataone.org/metacat/d1/mn [org.dataone.integration.ContextAwareTestCaseDataone]
20151117-07:48:49: [INFO]: rest call info: GET https://mn-dev-unm-2.test.dataone.org/metacat/d1/mn/v2/monitor/ping [org.dataone.client.rest.RestClient]
20151117-07:48:49: [INFO]: MN included in test: https://mn-dev-unm-2.test.dataone.org/metacat/d1/mn [org.dataone.integration.ContextAwareTestCaseDataone]
20151117-07:49:19: [INFO]: rest call info: POST https://mn-dev-ucsb-2.test.dataone.org/metacat/d1/mn/v2/object; MMP message has: ParamPart:pid = P12015320234849337; FilePart:object = /tmp/mmp.output.41381913172832329.tmp (17181 bytes); FilePart:sysmeta = /tmp/mmp.output.7406669880052908497.tmp (758 bytes);  [org.dataone.client.rest.RestClient]
org.dataone.service.exceptions.ServiceFailure: class org.dataone.client.exception.ClientSideException: /Read timed out
	at org.dataone.client.rest.HttpMultipartRestClient.doPostRequest(HttpMultipartRestClient.java:460)
	at org.dataone.client.v2.impl.MultipartMNode.create(MultipartMNode.java:495)
	at org.dataone.integration.adapters.CommonCallAdapter.create(CommonCallAdapter.java:505)
	at org.dataone.integration.it.testImplementations.SidCommonTestImplementations.testCreate(SidCommonTestImplementations.java:473)
	at sun.reflect.NativeMethodAccessorImpl.invoke0(Native Method)
	at sun.reflect.NativeMethodAccessorImpl.invoke(NativeMethodAccessorImpl.java:57)
	at sun.reflect.DelegatingMethodAccessorImpl.invoke(DelegatingMethodAccessorImpl.java:43)
	at java.lang.reflect.Method.invoke(Method.java:606)
	at org.junit.runners.model.FrameworkMethod$1.runReflectiveCall(FrameworkMethod.java:44)
	at org.junit.internal.runners.model.ReflectiveCallable.run(ReflectiveCallable.java:15)
	at org.junit.runners.model.FrameworkMethod.invokeExplosively(FrameworkMethod.java:41)
	at org.junit.internal.runners.statements.InvokeMethod.evaluate(InvokeMethod.java:20)
	at org.junit.rules.Verifier$1.evaluate(Verifier.java:34)
	at org.junit.internal.runners.statements.RunBefores.evaluate(RunBefores.java:28)
	at org.junit.runners.BlockJUnit4ClassRunner.runChild(BlockJUnit4ClassRunner.java:76)
	at org.junit.runners.BlockJUnit4ClassRunner.runChild(BlockJUnit4ClassRunner.java:50)
	at org.junit.runners.ParentRunner$3.run(ParentRunner.java:193)
	at org.junit.runners.ParentRunner$1.schedule(ParentRunner.java:52)
	at org.junit.runners.ParentRunner.runChildren(ParentRunner.java:191)
	at org.junit.runners.ParentRunner.access$000(ParentRunner.java:42)
	at org.junit.runners.ParentRunner$2.evaluate(ParentRunner.java:184)
	at org.junit.runners.ParentRunner.run(ParentRunner.java:236)
	at org.apache.maven.surefire.junit4.JUnit4TestSet.execute(JUnit4TestSet.java:53)
	at org.apache.maven.surefire.junit4.JUnit4Provider.executeTestSet(JUnit4Provider.java:119)
	at org.apache.maven.surefire.junit4.JUnit4Provider.invoke(JUnit4Provider.java:101)
	at sun.reflect.NativeMethodAccessorImpl.invoke0(Native Method)
	at sun.reflect.NativeMethodAccessorImpl.invoke(NativeMethodAccessorImpl.java:57)
	at sun.reflect.DelegatingMethodAccessorImpl.invoke(DelegatingMethodAccessorImpl.java:43)
	at java.lang.reflect.Method.invoke(Method.java:606)
	at org.apache.maven.surefire.booter.ProviderFactory$ClassLoaderProxy.invoke(ProviderFactory.java:103)
	at com.sun.proxy.$Proxy0.invoke(Unknown Source)
	at org.apache.maven.surefire.booter.SurefireStarter.invokeProvider(SurefireStarter.java:150)
	at org.apache.maven.surefire.booter.SurefireStarter.runSuitesInProcess(SurefireStarter.java:91)
	at org.apache.maven.surefire.booter.ForkedBooter.main(ForkedBooter.java:69)
Caused by: org.dataone.client.exception.ClientSideException: /Read timed out
	... 34 more
Caused by: java.net.SocketTimeoutException: Read timed out
	at java.net.SocketInputStream.socketRead0(Native Method)
	at java.net.SocketInputStream.read(SocketInputStream.java:152)
	at java.net.SocketInputStream.read(SocketInputStream.java:122)
	at sun.security.ssl.InputRecord.readFully(InputRecord.java:442)
	at sun.security.ssl.InputRecord.read(InputRecord.java:480)
	at sun.security.ssl.SSLSocketImpl.readRecord(SSLSocketImpl.java:946)
	at sun.security.ssl.SSLSocketImpl.readDataRecord(SSLSocketImpl.java:903)
	at sun.security.ssl.AppInputStream.read(AppInputStream.java:102)
	at org.apache.http.impl.io.SessionInputBufferImpl.streamRead(SessionInputBufferImpl.java:136)
	at org.apache.http.impl.io.SessionInputBufferImpl.fillBuffer(SessionInputBufferImpl.java:152)
	at org.apache.http.impl.io.SessionInputBufferImpl.readLine(SessionInputBufferImpl.java:270)
	at org.apache.http.impl.conn.DefaultHttpResponseParser.parseHead(DefaultHttpResponseParser.java:140)
	at org.apache.http.impl.conn.DefaultHttpResponseParser.parseHead(DefaultHttpResponseParser.java:57)
	at org.apache.http.impl.io.AbstractMessageParser.parse(AbstractMessageParser.java:260)
	at org.apache.http.impl.DefaultBHttpClientConnection.receiveResponseHeader(DefaultBHttpClientConnection.java:161)
	at sun.reflect.GeneratedMethodAccessor9.invoke(Unknown Source)
	at sun.reflect.DelegatingMethodAccessorImpl.invoke(DelegatingMethodAccessorImpl.java:43)
	at java.lang.reflect.Method.invoke(Method.java:606)
	at org.apache.http.impl.conn.CPoolProxy.invoke(CPoolProxy.java:138)
	at com.sun.proxy.$Proxy9.receiveResponseHeader(Unknown Source)
	at org.apache.http.protocol.HttpRequestExecutor.doReceiveResponse(HttpRequestExecutor.java:271)
	at org.apache.http.protocol.HttpRequestExecutor.execute(HttpRequestExecutor.java:123)
	at org.apache.http.impl.execchain.MainClientExec.execute(MainClientExec.java:254)
	at org.apache.http.impl.execchain.ProtocolExec.execute(ProtocolExec.java:195)
	at org.apache.http.impl.execchain.RetryExec.execute(RetryExec.java:86)
	at org.apache.http.impl.execchain.RedirectExec.execute(RedirectExec.java:108)
	at org.apache.http.impl.client.InternalHttpClient.doExecute(InternalHttpClient.java:186)
	at org.apache.http.impl.client.CloseableHttpClient.execute(CloseableHttpClient.java:82)
	at org.apache.http.impl.client.CloseableHttpClient.execute(CloseableHttpClient.java:106)
	at org.apache.http.impl.client.CloseableHttpClient.execute(CloseableHttpClient.java:57)
	at org.dataone.client.rest.RestClient.doRequest(RestClient.java:294)
	at org.dataone.client.rest.RestClient.doRequestMMBody(RestClient.java:272)
	at org.dataone.client.rest.RestClient.doPostRequest(RestClient.java:192)
	at org.dataone.client.rest.HttpMultipartRestClient.doPostRequest(HttpMultipartRestClient.java:453)
	... 33 more
20151117-07:49:20: [INFO]: rest call info: POST https://mn-dev-unm-2.test.dataone.org/metacat/d1/mn/v2/object; MMP message has: ParamPart:pid = P12015320234919483; FilePart:object = /tmp/mmp.output.3013415408368832964.tmp (17181 bytes); FilePart:sysmeta = /tmp/mmp.output.3335554039571943496.tmp (758 bytes);  [org.dataone.client.rest.RestClient]
20151117-07:49:20: [INFO]: Testing create(), created new object: org.dataone.service.types.v1.Identifier@97328173 [org.dataone.integration.ContextAwareTestCaseDataone]
20151117-07:49:20: [INFO]: rest call info: GET https://mn-dev-unm-2.test.dataone.org/metacat/d1/mn/v2/meta/S12015320234919485 [org.dataone.client.rest.RestClient]
20151117-07:49:20: [INFO]: **************************************************** [org.dataone.integration.ContextAwareTestCaseDataone]
20151117-07:49:20: [INFO]: ***  context label:   DEV2 [org.dataone.integration.ContextAwareTestCaseDataone]
20151117-07:49:20: [INFO]: **************************************************** [org.dataone.integration.ContextAwareTestCaseDataone]
20151117-07:49:20: [INFO]: **************************************************** [org.dataone.integration.ContextAwareTestCaseDataone]
20151117-07:49:20: [INFO]: Testing delete() method ...  [org.dataone.integration.ContextAwareTestCaseDataone]
20151117-07:49:20: [INFO]: Testing delete(), Case1 [org.dataone.integration.ContextAwareTestCaseDataone]
20151117-07:49:21: [INFO]: rest call info: GET https://mn-dev-ucsb-1.test.dataone.org/metacat/d1/mn/v2/monitor/ping [org.dataone.client.rest.RestClient]
20151117-07:49:21: [INFO]: MN excluded from test: https://mn-dev-ucsb-1.test.dataone.org/metacat/d1/mn [org.dataone.integration.ContextAwareTestCaseDataone]
20151117-07:49:21: [INFO]: rest call info: GET https://mn-dev-ucsb-2.test.dataone.org/metacat/d1/mn/v2/monitor/ping [org.dataone.client.rest.RestClient]
20151117-07:49:21: [INFO]: MN included in test: https://mn-dev-ucsb-2.test.dataone.org/metacat/d1/mn [org.dataone.integration.ContextAwareTestCaseDataone]
20151117-07:49:21: [INFO]: rest call info: GET https://mn-dev-unm-1.test.dataone.org/metacat/d1/mn/v2/monitor/ping [org.dataone.client.rest.RestClient]
20151117-07:49:21: [INFO]: MN excluded from test: https://mn-dev-unm-1.test.dataone.org/metacat/d1/mn [org.dataone.integration.ContextAwareTestCaseDataone]
20151117-07:49:21: [INFO]: rest call info: GET https://mn-dev-unm-2.test.dataone.org/metacat/d1/mn/v2/monitor/ping [org.dataone.client.rest.RestClient]
20151117-07:49:21: [INFO]: MN included in test: https://mn-dev-unm-2.test.dataone.org/metacat/d1/mn [org.dataone.integration.ContextAwareTestCaseDataone]
20151117-07:49:21: [INFO]: CREATING test object... pid: P1_2015320234921513 with a sid: S1_2015320234921515 obsoletes: null obsoletedBy: null [org.dataone.integration.ContextAwareTestCaseDataone]
20151117-07:49:21: [INFO]: certificate directory: /etc/dataone/client/testClientCerts/ [org.dataone.integration.ContextAwareTestCaseDataone]
20151117-07:49:21: [INFO]: certificate filename: cnDevUNM2 [org.dataone.integration.ContextAwareTestCaseDataone]
20151117-07:49:21: [INFO]: client setup as Subject: CN=urn:node:cnDevUNM2,DC=dataone,DC=org [org.dataone.integration.ContextAwareTestCaseDataone]
20151117-07:49:21: [WARN]: Unable to find a valid authoritative MN to use for the object: org.dataone.service.types.v1.Identifier@8d5707a1 [org.dataone.integration.ContextAwareTestCaseDataone]
20151117-07:49:21: [INFO]: creating a test object.  pid = P1_2015320234921513 on https://mn-dev-ucsb-2.test.dataone.org/metacat/d1/mn/v2 [org.dataone.integration.ContextAwareTestCaseDataone]
20151117-07:49:21: [INFO]: SystemMetadata for pid: P1_2015320234921513
<?xml version="1.0" encoding="UTF-8"?><d1_v2.0:systemMetadata xmlns:d1_v2.0="http://ns.dataone.org/service/types/v2.0" xmlns:d1="http://ns.dataone.org/service/types/v1"><serialVersion>1</serialVersion><identifier>P1_2015320234921513</identifier><formatId>eml://ecoinformatics.org/eml-2.0.1</formatId><size>17181</size><checksum algorithm="MD5">03ce09c6b4c3efc1681f3023402998a2</checksum><submitter>CN=urn:node:cnDevUNM2,DC=dataone,DC=org</submitter><rightsHolder>CN=testRightsHolder,DC=dataone,DC=org</rightsHolder><accessPolicy><allow><subject>public</subject><permission>read</permission></allow></accessPolicy><dateUploaded>2015-11-17T07:49:21.572+00:00</dateUploaded><dateSysMetadataModified>2015-11-17T07:49:21.572+00:00</dateSysMetadataModified><originMemberNode>bogusAuthoritativeNode</originMemberNode><authoritativeMemberNode>bogusAuthoritativeNode</authoritativeMemberNode><seriesId>S1_2015320234921515</seriesId></d1_v2.0:systemMetadata> [org.dataone.integration.ContextAwareTestCaseDataone]
20151117-07:49:51: [INFO]: rest call info: POST https://mn-dev-ucsb-2.test.dataone.org/metacat/d1/mn/v2/object; MMP message has: ParamPart:pid = P1_2015320234921513; FilePart:object = /tmp/mmp.output.1499898635787659111.tmp (17181 bytes); FilePart:sysmeta = /tmp/mmp.output.7058187297730509903.tmp (948 bytes);  [org.dataone.client.rest.RestClient]
20151117-07:49:51: [INFO]: object created.  pid = P1_2015320234921513 [org.dataone.integration.ContextAwareTestCaseDataone]
20151117-07:50:01: [INFO]: Created SID (S1_2015320234921515) and head PID (P1_2015320234921513) pair. [org.dataone.integration.ContextAwareTestCaseDataone]
20151117-07:50:23: [INFO]: rest call info: DELETE https://mn-dev-ucsb-2.test.dataone.org/metacat/d1/mn/v2/object/S1_2015320234921515 [org.dataone.client.rest.RestClient]
20151117-07:50:40: [INFO]: rest call info: GET https://mn-dev-ucsb-2.test.dataone.org/metacat/d1/mn/v2/object/P1_2015320234921513 [org.dataone.client.rest.RestClient]
20151117-07:50:40: [INFO]: CREATING test object... pid: P1_20153202350409 with a sid: S1_201532023504011 obsoletes: null obsoletedBy: null [org.dataone.integration.ContextAwareTestCaseDataone]
20151117-07:50:40: [INFO]: certificate directory: /etc/dataone/client/testClientCerts/ [org.dataone.integration.ContextAwareTestCaseDataone]
20151117-07:50:40: [INFO]: certificate filename: cnDevUNM2 [org.dataone.integration.ContextAwareTestCaseDataone]
20151117-07:50:40: [INFO]: client setup as Subject: CN=urn:node:cnDevUNM2,DC=dataone,DC=org [org.dataone.integration.ContextAwareTestCaseDataone]
20151117-07:50:40: [WARN]: Unable to find a valid authoritative MN to use for the object: org.dataone.service.types.v1.Identifier@a5e15cd0 [org.dataone.integration.ContextAwareTestCaseDataone]
20151117-07:50:40: [INFO]: creating a test object.  pid = P1_20153202350409 on https://mn-dev-unm-2.test.dataone.org/metacat/d1/mn/v2 [org.dataone.integration.ContextAwareTestCaseDataone]
20151117-07:50:40: [INFO]: SystemMetadata for pid: P1_20153202350409
<?xml version="1.0" encoding="UTF-8"?><d1_v2.0:systemMetadata xmlns:d1_v2.0="http://ns.dataone.org/service/types/v2.0" xmlns:d1="http://ns.dataone.org/service/types/v1"><serialVersion>1</serialVersion><identifier>P1_20153202350409</identifier><formatId>eml://ecoinformatics.org/eml-2.0.1</formatId><size>17181</size><checksum algorithm="MD5">03ce09c6b4c3efc1681f3023402998a2</checksum><submitter>CN=urn:node:cnDevUNM2,DC=dataone,DC=org</submitter><rightsHolder>CN=testRightsHolder,DC=dataone,DC=org</rightsHolder><accessPolicy><allow><subject>public</subject><permission>read</permission></allow></accessPolicy><dateUploaded>2015-11-17T07:50:40.027+00:00</dateUploaded><dateSysMetadataModified>2015-11-17T07:50:40.027+00:00</dateSysMetadataModified><originMemberNode>bogusAuthoritativeNode</originMemberNode><authoritativeMemberNode>bogusAuthoritativeNode</authoritativeMemberNode><seriesId>S1_201532023504011</seriesId></d1_v2.0:systemMetadata> [org.dataone.integration.ContextAwareTestCaseDataone]
20151117-07:50:41: [INFO]: rest call info: POST https://mn-dev-unm-2.test.dataone.org/metacat/d1/mn/v2/object; MMP message has: ParamPart:pid = P1_20153202350409; FilePart:object = /tmp/mmp.output.4378077655874518035.tmp (17181 bytes); FilePart:sysmeta = /tmp/mmp.output.7038818141050601313.tmp (945 bytes);  [org.dataone.client.rest.RestClient]
20151117-07:50:41: [INFO]: object created.  pid = P1_20153202350409 [org.dataone.integration.ContextAwareTestCaseDataone]
20151117-07:50:51: [INFO]: Created SID (S1_201532023504011) and head PID (P1_20153202350409) pair. [org.dataone.integration.ContextAwareTestCaseDataone]
20151117-07:51:01: [INFO]: rest call info: DELETE https://mn-dev-unm-2.test.dataone.org/metacat/d1/mn/v2/object/S1_201532023504011 [org.dataone.client.rest.RestClient]
20151117-07:51:01: [INFO]: rest call info: GET https://mn-dev-unm-2.test.dataone.org/metacat/d1/mn/v2/object/P1_20153202350409 [org.dataone.client.rest.RestClient]
20151117-07:51:01: [INFO]: **************************************************** [org.dataone.integration.ContextAwareTestCaseDataone]
20151117-07:51:01: [INFO]: ***  context label:   DEV2 [org.dataone.integration.ContextAwareTestCaseDataone]
20151117-07:51:01: [INFO]: **************************************************** [org.dataone.integration.ContextAwareTestCaseDataone]
20151117-07:51:01: [INFO]: **************************************************** [org.dataone.integration.ContextAwareTestCaseDataone]
20151117-07:51:01: [INFO]: Testing listObjects() method ...  [org.dataone.integration.ContextAwareTestCaseDataone]
20151117-07:51:01: [INFO]: Testing listObjects(), Case1 [org.dataone.integration.ContextAwareTestCaseDataone]
20151117-07:51:02: [INFO]: rest call info: GET https://mn-dev-ucsb-1.test.dataone.org/metacat/d1/mn/v2/monitor/ping [org.dataone.client.rest.RestClient]
20151117-07:51:02: [INFO]: MN excluded from test: https://mn-dev-ucsb-1.test.dataone.org/metacat/d1/mn [org.dataone.integration.ContextAwareTestCaseDataone]
20151117-07:51:02: [INFO]: rest call info: GET https://mn-dev-ucsb-2.test.dataone.org/metacat/d1/mn/v2/monitor/ping [org.dataone.client.rest.RestClient]
20151117-07:51:02: [INFO]: MN included in test: https://mn-dev-ucsb-2.test.dataone.org/metacat/d1/mn [org.dataone.integration.ContextAwareTestCaseDataone]
20151117-07:51:03: [INFO]: rest call info: GET https://mn-dev-unm-1.test.dataone.org/metacat/d1/mn/v2/monitor/ping [org.dataone.client.rest.RestClient]
20151117-07:51:03: [INFO]: MN excluded from test: https://mn-dev-unm-1.test.dataone.org/metacat/d1/mn [org.dataone.integration.ContextAwareTestCaseDataone]
20151117-07:51:03: [INFO]: rest call info: GET https://mn-dev-unm-2.test.dataone.org/metacat/d1/mn/v2/monitor/ping [org.dataone.client.rest.RestClient]
20151117-07:51:03: [INFO]: MN included in test: https://mn-dev-unm-2.test.dataone.org/metacat/d1/mn [org.dataone.integration.ContextAwareTestCaseDataone]
20151117-07:51:03: [INFO]: CREATING test object... pid: P1_201532023513244 with a sid: S1_201532023513246 obsoletes: null obsoletedBy: null [org.dataone.integration.ContextAwareTestCaseDataone]
20151117-07:51:03: [INFO]: certificate directory: /etc/dataone/client/testClientCerts/ [org.dataone.integration.ContextAwareTestCaseDataone]
20151117-07:51:03: [INFO]: certificate filename: cnDevUNM2 [org.dataone.integration.ContextAwareTestCaseDataone]
20151117-07:51:03: [INFO]: client setup as Subject: CN=urn:node:cnDevUNM2,DC=dataone,DC=org [org.dataone.integration.ContextAwareTestCaseDataone]
20151117-07:51:03: [WARN]: Unable to find a valid authoritative MN to use for the object: org.dataone.service.types.v1.Identifier@1657e76d [org.dataone.integration.ContextAwareTestCaseDataone]
20151117-07:51:03: [INFO]: creating a test object.  pid = P1_201532023513244 on https://mn-dev-ucsb-2.test.dataone.org/metacat/d1/mn/v2 [org.dataone.integration.ContextAwareTestCaseDataone]
20151117-07:51:03: [INFO]: SystemMetadata for pid: P1_201532023513244
<?xml version="1.0" encoding="UTF-8"?><d1_v2.0:systemMetadata xmlns:d1_v2.0="http://ns.dataone.org/service/types/v2.0" xmlns:d1="http://ns.dataone.org/service/types/v1"><serialVersion>1</serialVersion><identifier>P1_201532023513244</identifier><formatId>eml://ecoinformatics.org/eml-2.0.1</formatId><size>17181</size><checksum algorithm="MD5">03ce09c6b4c3efc1681f3023402998a2</checksum><submitter>CN=urn:node:cnDevUNM2,DC=dataone,DC=org</submitter><rightsHolder>CN=testRightsHolder,DC=dataone,DC=org</rightsHolder><accessPolicy><allow><subject>public</subject><permission>read</permission></allow></accessPolicy><dateUploaded>2015-11-17T07:51:03.260+00:00</dateUploaded><dateSysMetadataModified>2015-11-17T07:51:03.260+00:00</dateSysMetadataModified><originMemberNode>bogusAuthoritativeNode</originMemberNode><authoritativeMemberNode>bogusAuthoritativeNode</authoritativeMemberNode><seriesId>S1_201532023513246</seriesId></d1_v2.0:systemMetadata> [org.dataone.integration.ContextAwareTestCaseDataone]
20151117-07:51:13: [INFO]: rest call info: POST https://mn-dev-ucsb-2.test.dataone.org/metacat/d1/mn/v2/object; MMP message has: ParamPart:pid = P1_201532023513244; FilePart:object = /tmp/mmp.output.3346989141876292724.tmp (17181 bytes); FilePart:sysmeta = /tmp/mmp.output.4107456919561168794.tmp (946 bytes);  [org.dataone.client.rest.RestClient]
20151117-07:51:13: [INFO]: object created.  pid = P1_201532023513244 [org.dataone.integration.ContextAwareTestCaseDataone]
20151117-07:51:23: [INFO]: Created SID (S1_201532023513246) and head PID (P1_201532023513244) pair. [org.dataone.integration.ContextAwareTestCaseDataone]
20151117-07:51:34: [INFO]: rest call info: GET https://mn-dev-ucsb-2.test.dataone.org/metacat/d1/mn/v2/object?identifier=P1_201532023513244 [org.dataone.client.rest.RestClient]
20151117-07:51:34: [INFO]: rest call info: GET https://mn-dev-ucsb-2.test.dataone.org/metacat/d1/mn/v2/object?identifier=S1_201532023513246 [org.dataone.client.rest.RestClient]
20151117-07:51:34: [INFO]: CREATING test object... pid: P1_2015320235134388 with a sid: S1_2015320235134390 obsoletes: null obsoletedBy: null [org.dataone.integration.ContextAwareTestCaseDataone]
20151117-07:51:34: [INFO]: certificate directory: /etc/dataone/client/testClientCerts/ [org.dataone.integration.ContextAwareTestCaseDataone]
20151117-07:51:34: [INFO]: certificate filename: cnDevUNM2 [org.dataone.integration.ContextAwareTestCaseDataone]
20151117-07:51:34: [INFO]: client setup as Subject: CN=urn:node:cnDevUNM2,DC=dataone,DC=org [org.dataone.integration.ContextAwareTestCaseDataone]
20151117-07:51:34: [WARN]: Unable to find a valid authoritative MN to use for the object: org.dataone.service.types.v1.Identifier@b4a5ebe4 [org.dataone.integration.ContextAwareTestCaseDataone]
20151117-07:51:34: [INFO]: creating a test object.  pid = P1_2015320235134388 on https://mn-dev-unm-2.test.dataone.org/metacat/d1/mn/v2 [org.dataone.integration.ContextAwareTestCaseDataone]
20151117-07:51:34: [INFO]: SystemMetadata for pid: P1_2015320235134388
<?xml version="1.0" encoding="UTF-8"?><d1_v2.0:systemMetadata xmlns:d1_v2.0="http://ns.dataone.org/service/types/v2.0" xmlns:d1="http://ns.dataone.org/service/types/v1"><serialVersion>1</serialVersion><identifier>P1_2015320235134388</identifier><formatId>eml://ecoinformatics.org/eml-2.0.1</formatId><size>17181</size><checksum algorithm="MD5">03ce09c6b4c3efc1681f3023402998a2</checksum><submitter>CN=urn:node:cnDevUNM2,DC=dataone,DC=org</submitter><rightsHolder>CN=testRightsHolder,DC=dataone,DC=org</rightsHolder><accessPolicy><allow><subject>public</subject><permission>read</permission></allow></accessPolicy><dateUploaded>2015-11-17T07:51:34.405+00:00</dateUploaded><dateSysMetadataModified>2015-11-17T07:51:34.405+00:00</dateSysMetadataModified><originMemberNode>bogusAuthoritativeNode</originMemberNode><authoritativeMemberNode>bogusAuthoritativeNode</authoritativeMemberNode><seriesId>S1_2015320235134390</seriesId></d1_v2.0:systemMetadata> [org.dataone.integration.ContextAwareTestCaseDataone]
20151117-07:51:35: [INFO]: rest call info: POST https://mn-dev-unm-2.test.dataone.org/metacat/d1/mn/v2/object; MMP message has: ParamPart:pid = P1_2015320235134388; FilePart:object = /tmp/mmp.output.1490960917074210083.tmp (17181 bytes); FilePart:sysmeta = /tmp/mmp.output.7781668739174605052.tmp (948 bytes);  [org.dataone.client.rest.RestClient]
20151117-07:51:35: [INFO]: object created.  pid = P1_2015320235134388 [org.dataone.integration.ContextAwareTestCaseDataone]
20151117-07:51:45: [INFO]: Created SID (S1_2015320235134390) and head PID (P1_2015320235134388) pair. [org.dataone.integration.ContextAwareTestCaseDataone]
20151117-07:51:55: [INFO]: rest call info: GET https://mn-dev-unm-2.test.dataone.org/metacat/d1/mn/v2/object?identifier=P1_2015320235134388 [org.dataone.client.rest.RestClient]
20151117-07:51:55: [INFO]: rest call info: GET https://mn-dev-unm-2.test.dataone.org/metacat/d1/mn/v2/object?identifier=S1_2015320235134390 [org.dataone.client.rest.RestClient]
20151117-07:51:55: [INFO]: **************************************************** [org.dataone.integration.ContextAwareTestCaseDataone]
20151117-07:51:55: [INFO]: ***  context label:   DEV2 [org.dataone.integration.ContextAwareTestCaseDataone]
20151117-07:51:55: [INFO]: **************************************************** [org.dataone.integration.ContextAwareTestCaseDataone]
20151117-07:51:55: [INFO]: **************************************************** [org.dataone.integration.ContextAwareTestCaseDataone]
20151117-07:51:55: [INFO]: Testing isAuthorized() method ...  [org.dataone.integration.ContextAwareTestCaseDataone]
20151117-07:51:55: [INFO]: Testing isAuthorized(), Case1 [org.dataone.integration.ContextAwareTestCaseDataone]
20151117-07:51:55: [INFO]: rest call info: GET https://mn-dev-ucsb-1.test.dataone.org/metacat/d1/mn/v2/monitor/ping [org.dataone.client.rest.RestClient]
20151117-07:51:55: [INFO]: MN excluded from test: https://mn-dev-ucsb-1.test.dataone.org/metacat/d1/mn [org.dataone.integration.ContextAwareTestCaseDataone]
20151117-07:51:56: [INFO]: rest call info: GET https://mn-dev-ucsb-2.test.dataone.org/metacat/d1/mn/v2/monitor/ping [org.dataone.client.rest.RestClient]
20151117-07:51:56: [INFO]: MN included in test: https://mn-dev-ucsb-2.test.dataone.org/metacat/d1/mn [org.dataone.integration.ContextAwareTestCaseDataone]
20151117-07:51:56: [INFO]: rest call info: GET https://mn-dev-unm-1.test.dataone.org/metacat/d1/mn/v2/monitor/ping [org.dataone.client.rest.RestClient]
20151117-07:51:56: [INFO]: MN excluded from test: https://mn-dev-unm-1.test.dataone.org/metacat/d1/mn [org.dataone.integration.ContextAwareTestCaseDataone]
20151117-07:51:56: [INFO]: rest call info: GET https://mn-dev-unm-2.test.dataone.org/metacat/d1/mn/v2/monitor/ping [org.dataone.client.rest.RestClient]
20151117-07:51:56: [INFO]: MN included in test: https://mn-dev-unm-2.test.dataone.org/metacat/d1/mn [org.dataone.integration.ContextAwareTestCaseDataone]
20151117-07:51:56: [INFO]: CREATING test object... pid: P1_2015320235156194 with a sid: S1_2015320235156196 obsoletes: null obsoletedBy: null [org.dataone.integration.ContextAwareTestCaseDataone]
20151117-07:51:56: [INFO]: certificate directory: /etc/dataone/client/testClientCerts/ [org.dataone.integration.ContextAwareTestCaseDataone]
20151117-07:51:56: [INFO]: certificate filename: cnDevUNM2 [org.dataone.integration.ContextAwareTestCaseDataone]
20151117-07:51:56: [INFO]: client setup as Subject: CN=urn:node:cnDevUNM2,DC=dataone,DC=org [org.dataone.integration.ContextAwareTestCaseDataone]
20151117-07:51:56: [WARN]: Unable to find a valid authoritative MN to use for the object: org.dataone.service.types.v1.Identifier@b4c2fc3d [org.dataone.integration.ContextAwareTestCaseDataone]
20151117-07:51:56: [INFO]: creating a test object.  pid = P1_2015320235156194 on https://mn-dev-ucsb-2.test.dataone.org/metacat/d1/mn/v2 [org.dataone.integration.ContextAwareTestCaseDataone]
20151117-07:51:56: [INFO]: SystemMetadata for pid: P1_2015320235156194
<?xml version="1.0" encoding="UTF-8"?><d1_v2.0:systemMetadata xmlns:d1_v2.0="http://ns.dataone.org/service/types/v2.0" xmlns:d1="http://ns.dataone.org/service/types/v1"><serialVersion>1</serialVersion><identifier>P1_2015320235156194</identifier><formatId>eml://ecoinformatics.org/eml-2.0.1</formatId><size>17181</size><checksum algorithm="MD5">03ce09c6b4c3efc1681f3023402998a2</checksum><submitter>CN=urn:node:cnDevUNM2,DC=dataone,DC=org</submitter><rightsHolder>CN=testRightsHolder,DC=dataone,DC=org</rightsHolder><accessPolicy><allow><subject>public</subject><permission>read</permission></allow></accessPolicy><dateUploaded>2015-11-17T07:51:56.211+00:00</dateUploaded><dateSysMetadataModified>2015-11-17T07:51:56.211+00:00</dateSysMetadataModified><originMemberNode>bogusAuthoritativeNode</originMemberNode><authoritativeMemberNode>bogusAuthoritativeNode</authoritativeMemberNode><seriesId>S1_2015320235156196</seriesId></d1_v2.0:systemMetadata> [org.dataone.integration.ContextAwareTestCaseDataone]
20151117-07:52:20: [INFO]: rest call info: POST https://mn-dev-ucsb-2.test.dataone.org/metacat/d1/mn/v2/object; MMP message has: ParamPart:pid = P1_2015320235156194; FilePart:object = /tmp/mmp.output.6765214437958145979.tmp (17181 bytes); FilePart:sysmeta = /tmp/mmp.output.6274507577978352972.tmp (948 bytes);  [org.dataone.client.rest.RestClient]
20151117-07:52:20: [INFO]: object created.  pid = P1_2015320235156194 [org.dataone.integration.ContextAwareTestCaseDataone]
20151117-07:52:30: [INFO]: Created SID (S1_2015320235156196) and head PID (P1_2015320235156194) pair. [org.dataone.integration.ContextAwareTestCaseDataone]
20151117-07:52:44: [INFO]: rest call info: GET https://mn-dev-ucsb-2.test.dataone.org/metacat/d1/mn/v2/isAuthorized/S1_2015320235156196?action=read [org.dataone.client.rest.RestClient]
20151117-07:53:01: [INFO]: rest call info: GET https://mn-dev-ucsb-2.test.dataone.org/metacat/d1/mn/v2/isAuthorized/P1_2015320235156194?action=read [org.dataone.client.rest.RestClient]
20151117-07:53:18: [INFO]: rest call info: GET https://mn-dev-ucsb-2.test.dataone.org/metacat/d1/mn/v2/isAuthorized/S1_2015320235156196?action=write [org.dataone.client.rest.RestClient]
20151117-07:53:48: [INFO]: rest call info: GET https://mn-dev-ucsb-2.test.dataone.org/metacat/d1/mn/v2/isAuthorized/P1_2015320235156194?action=write [org.dataone.client.rest.RestClient]
20151117-07:53:48: [INFO]: **************************************************** [org.dataone.integration.ContextAwareTestCaseDataone]
20151117-07:53:48: [INFO]: ***  context label:   DEV2 [org.dataone.integration.ContextAwareTestCaseDataone]
20151117-07:53:48: [INFO]: **************************************************** [org.dataone.integration.ContextAwareTestCaseDataone]
20151117-07:53:48: [INFO]: **************************************************** [org.dataone.integration.ContextAwareTestCaseDataone]
20151117-07:53:48: [INFO]: Testing view() method ...  [org.dataone.integration.ContextAwareTestCaseDataone]
20151117-07:53:48: [INFO]: Testing view(), Case1 [org.dataone.integration.ContextAwareTestCaseDataone]
20151117-07:53:49: [INFO]: rest call info: GET https://mn-dev-ucsb-1.test.dataone.org/metacat/d1/mn/v2/monitor/ping [org.dataone.client.rest.RestClient]
20151117-07:53:49: [INFO]: MN excluded from test: https://mn-dev-ucsb-1.test.dataone.org/metacat/d1/mn [org.dataone.integration.ContextAwareTestCaseDataone]
20151117-07:53:49: [INFO]: rest call info: GET https://mn-dev-ucsb-2.test.dataone.org/metacat/d1/mn/v2/monitor/ping [org.dataone.client.rest.RestClient]
20151117-07:53:49: [INFO]: MN included in test: https://mn-dev-ucsb-2.test.dataone.org/metacat/d1/mn [org.dataone.integration.ContextAwareTestCaseDataone]
20151117-07:53:49: [INFO]: rest call info: GET https://mn-dev-unm-1.test.dataone.org/metacat/d1/mn/v2/monitor/ping [org.dataone.client.rest.RestClient]
20151117-07:53:49: [INFO]: MN excluded from test: https://mn-dev-unm-1.test.dataone.org/metacat/d1/mn [org.dataone.integration.ContextAwareTestCaseDataone]
20151117-07:53:49: [INFO]: rest call info: GET https://mn-dev-unm-2.test.dataone.org/metacat/d1/mn/v2/monitor/ping [org.dataone.client.rest.RestClient]
20151117-07:53:49: [INFO]: MN included in test: https://mn-dev-unm-2.test.dataone.org/metacat/d1/mn [org.dataone.integration.ContextAwareTestCaseDataone]
20151117-07:53:50: [INFO]: CREATING test object... pid: P1_20153202353501 with a sid: S1_20153202353504 obsoletes: null obsoletedBy: null [org.dataone.integration.ContextAwareTestCaseDataone]
20151117-07:53:50: [INFO]: certificate directory: /etc/dataone/client/testClientCerts/ [org.dataone.integration.ContextAwareTestCaseDataone]
20151117-07:53:50: [INFO]: certificate filename: cnDevUNM2 [org.dataone.integration.ContextAwareTestCaseDataone]
20151117-07:53:50: [INFO]: client setup as Subject: CN=urn:node:cnDevUNM2,DC=dataone,DC=org [org.dataone.integration.ContextAwareTestCaseDataone]
20151117-07:53:50: [WARN]: Unable to find a valid authoritative MN to use for the object: org.dataone.service.types.v1.Identifier@a5e2bda6 [org.dataone.integration.ContextAwareTestCaseDataone]
20151117-07:53:50: [INFO]: creating a test object.  pid = P1_20153202353501 on https://mn-dev-ucsb-2.test.dataone.org/metacat/d1/mn/v2 [org.dataone.integration.ContextAwareTestCaseDataone]
20151117-07:53:50: [INFO]: SystemMetadata for pid: P1_20153202353501
<?xml version="1.0" encoding="UTF-8"?><d1_v2.0:systemMetadata xmlns:d1_v2.0="http://ns.dataone.org/service/types/v2.0" xmlns:d1="http://ns.dataone.org/service/types/v1"><serialVersion>1</serialVersion><identifier>P1_20153202353501</identifier><formatId>eml://ecoinformatics.org/eml-2.0.1</formatId><size>17181</size><checksum algorithm="MD5">03ce09c6b4c3efc1681f3023402998a2</checksum><submitter>CN=urn:node:cnDevUNM2,DC=dataone,DC=org</submitter><rightsHolder>CN=testRightsHolder,DC=dataone,DC=org</rightsHolder><accessPolicy><allow><subject>public</subject><permission>read</permission></allow></accessPolicy><dateUploaded>2015-11-17T07:53:50.018+00:00</dateUploaded><dateSysMetadataModified>2015-11-17T07:53:50.018+00:00</dateSysMetadataModified><originMemberNode>bogusAuthoritativeNode</originMemberNode><authoritativeMemberNode>bogusAuthoritativeNode</authoritativeMemberNode><seriesId>S1_20153202353504</seriesId></d1_v2.0:systemMetadata> [org.dataone.integration.ContextAwareTestCaseDataone]
20151117-07:54:09: [INFO]: rest call info: POST https://mn-dev-ucsb-2.test.dataone.org/metacat/d1/mn/v2/object; MMP message has: ParamPart:pid = P1_20153202353501; FilePart:object = /tmp/mmp.output.5300746902984433939.tmp (17181 bytes); FilePart:sysmeta = /tmp/mmp.output.4655500938815890392.tmp (944 bytes);  [org.dataone.client.rest.RestClient]
20151117-07:54:09: [INFO]: object created.  pid = P1_20153202353501 [org.dataone.integration.ContextAwareTestCaseDataone]
20151117-07:54:19: [INFO]: Created SID (S1_20153202353504) and head PID (P1_20153202353501) pair. [org.dataone.integration.ContextAwareTestCaseDataone]
20151117-07:54:19: [INFO]: rest call info: GET https://mn-dev-ucsb-2.test.dataone.org/metacat/d1/mn/v2/views/default/S1_20153202353504 [org.dataone.client.rest.RestClient]
20151117-07:54:20: [INFO]: rest call info: GET https://mn-dev-ucsb-2.test.dataone.org/metacat/d1/mn/v2/views/default/P1_20153202353501 [org.dataone.client.rest.RestClient]
20151117-07:54:20: [INFO]: CREATING test object... pid: P1_2015320235420468 with a sid: S1_2015320235420470 obsoletes: null obsoletedBy: null [org.dataone.integration.ContextAwareTestCaseDataone]
20151117-07:54:20: [INFO]: certificate directory: /etc/dataone/client/testClientCerts/ [org.dataone.integration.ContextAwareTestCaseDataone]
20151117-07:54:20: [INFO]: certificate filename: cnDevUNM2 [org.dataone.integration.ContextAwareTestCaseDataone]
20151117-07:54:20: [INFO]: client setup as Subject: CN=urn:node:cnDevUNM2,DC=dataone,DC=org [org.dataone.integration.ContextAwareTestCaseDataone]
20151117-07:54:20: [WARN]: Unable to find a valid authoritative MN to use for the object: org.dataone.service.types.v1.Identifier@b9b49047 [org.dataone.integration.ContextAwareTestCaseDataone]
20151117-07:54:20: [INFO]: creating a test object.  pid = P1_2015320235420468 on https://mn-dev-unm-2.test.dataone.org/metacat/d1/mn/v2 [org.dataone.integration.ContextAwareTestCaseDataone]
20151117-07:54:20: [INFO]: SystemMetadata for pid: P1_2015320235420468
<?xml version="1.0" encoding="UTF-8"?><d1_v2.0:systemMetadata xmlns:d1_v2.0="http://ns.dataone.org/service/types/v2.0" xmlns:d1="http://ns.dataone.org/service/types/v1"><serialVersion>1</serialVersion><identifier>P1_2015320235420468</identifier><formatId>eml://ecoinformatics.org/eml-2.0.1</formatId><size>17181</size><checksum algorithm="MD5">03ce09c6b4c3efc1681f3023402998a2</checksum><submitter>CN=urn:node:cnDevUNM2,DC=dataone,DC=org</submitter><rightsHolder>CN=testRightsHolder,DC=dataone,DC=org</rightsHolder><accessPolicy><allow><subject>public</subject><permission>read</permission></allow></accessPolicy><dateUploaded>2015-11-17T07:54:20.485+00:00</dateUploaded><dateSysMetadataModified>2015-11-17T07:54:20.485+00:00</dateSysMetadataModified><originMemberNode>bogusAuthoritativeNode</originMemberNode><authoritativeMemberNode>bogusAuthoritativeNode</authoritativeMemberNode><seriesId>S1_2015320235420470</seriesId></d1_v2.0:systemMetadata> [org.dataone.integration.ContextAwareTestCaseDataone]
20151117-07:54:22: [INFO]: rest call info: POST https://mn-dev-unm-2.test.dataone.org/metacat/d1/mn/v2/object; MMP message has: ParamPart:pid = P1_2015320235420468; FilePart:object = /tmp/mmp.output.8043101367616031417.tmp (17181 bytes); FilePart:sysmeta = /tmp/mmp.output.314590103477720384.tmp (948 bytes);  [org.dataone.client.rest.RestClient]
20151117-07:54:22: [INFO]: object created.  pid = P1_2015320235420468 [org.dataone.integration.ContextAwareTestCaseDataone]
20151117-07:54:32: [INFO]: Created SID (S1_2015320235420470) and head PID (P1_2015320235420468) pair. [org.dataone.integration.ContextAwareTestCaseDataone]
20151117-07:54:32: [INFO]: rest call info: GET https://mn-dev-unm-2.test.dataone.org/metacat/d1/mn/v2/views/default/S1_2015320235420470 [org.dataone.client.rest.RestClient]
20151117-07:54:33: [INFO]: rest call info: GET https://mn-dev-unm-2.test.dataone.org/metacat/d1/mn/v2/views/default/P1_2015320235420468 [org.dataone.client.rest.RestClient]
Tests run: 13, Failures: 7, Errors: 0, Skipped: 1, Time elapsed: 954.401 sec <<< FAILURE!

Results :

Failed tests: 
  testSidReuse(org.dataone.integration.it.testImplementations.SidMNTestImplementations): testSidReuseDiffChain() : expected an InvalidSystemMetadata exception but got : ServiceFailure : class org.dataone.client.exception.ClientSideException: /Read timed out
  testSidReuseDiffChain(org.dataone.integration.it.testImplementations.SidMNTestImplementations): testSidReuseDiffChain() : unable to set up test! : ServiceFailure : class org.dataone.client.exception.ClientSideException: /Read timed out
  testGetPackage(org.dataone.integration.it.testImplementations.SidMNTestImplementations): https://mn-dev-ucsb-2.test.dataone.org/metacat/d1/mn/v2 Case: 1 : ServiceFailure : 0 Client_Error : class org.dataone.client.exception.ClientSideException: /Read timed out : class org.dataone.client.exception.ClientSideException: /Read timed out
  testGet(org.dataone.integration.it.testImplementations.SidMNTestImplementations): Case: 0 : class org.dataone.client.exception.ClientSideException: /Read timed out  [for host https://mn-dev-ucsb-2.test.dataone.org/metacat/d1/mn/v2 ]
  testDescribe(org.dataone.integration.it.testImplementations.SidMNTestImplementations): Case: 0 : nullUnable to create test object!/class org.dataone.client.exception.ClientSideException: /Read timed out  [for host https://mn-dev-ucsb-2.test.dataone.org/metacat/d1/mn/v2 ]
  testCreate(org.dataone.integration.it.testImplementations.SidMNTestImplementations): class org.dataone.client.exception.ClientSideException: /Read timed out  [for host https://mn-dev-ucsb-2.test.dataone.org/metacat/d1/mn/v2 ]
  testIsAuthorized(org.dataone.integration.it.testImplementations.SidMNTestImplementations): isAuthorized() Case 1, write permissions should match expected:<true> but was:<false>

Tests run: 13, Failures: 7, Errors: 0, Skipped: 1

[WARNING] File encoding has not been set, using platform encoding UTF-8, i.e. build is platform dependent!
[JENKINS] Recording test results
[INFO] 
[INFO] --- maven-failsafe-plugin:2.8.1:verify (verify) @ d1_integration ---
[INFO] Failsafe report directory: /var/lib/jenkins/jobs/d1_integration_DEV2_MN_sid_functional/workspace/target/failsafe-reports
[WARNING] File encoding has not been set, using platform encoding UTF-8, i.e. build is platform dependent!
[ERROR] There are test failures.

Please refer to /var/lib/jenkins/jobs/d1_integration_DEV2_MN_sid_functional/workspace/target/failsafe-reports for the individual test results.
[JENKINS] Recording test results
Notifying upstream projects of job completion
Join notifier requires a CauseAction
[INFO] ------------------------------------------------------------------------
[INFO] BUILD SUCCESS
[INFO] ------------------------------------------------------------------------
[INFO] Total time: 16:20.268s
[INFO] Finished at: Tue Nov 17 07:54:35 UTC 2015
[INFO] Final Memory: 51M/742M
[INFO] ------------------------------------------------------------------------
Waiting for Jenkins to finish collecting data
[JENKINS] Archiving /var/lib/jenkins/jobs/d1_integration_DEV2_MN_sid_functional/workspace/pom.xml to org.dataone/d1_integration/2.0-SNAPSHOT/d1_integration-2.0-SNAPSHOT.pom
channel stopped
[WARNING] Couldn't clean up oid=3 from null
hudson.remoting.ChannelClosedException: channel is already closed
	at hudson.remoting.Channel.send(Channel.java:575)
	at hudson.remoting.RemoteInvocationHandler$PhantomReferenceImpl.cleanup(RemoteInvocationHandler.java:360)
	at hudson.remoting.RemoteInvocationHandler$PhantomReferenceImpl.access$700(RemoteInvocationHandler.java:319)
	at hudson.remoting.RemoteInvocationHandler$Unexporter.run(RemoteInvocationHandler.java:420)
	at java.util.concurrent.Executors$RunnableAdapter.call(Executors.java:471)
	at java.util.concurrent.FutureTask.run(FutureTask.java:262)
	at hudson.remoting.AtmostOneThreadExecutor$Worker.run(AtmostOneThreadExecutor.java:110)
	at java.lang.Thread.run(Thread.java:745)
Caused by: java.io.IOException
	at hudson.remoting.Channel.close(Channel.java:1160)
	at hudson.remoting.Channel.close(Channel.java:1135)
	at hudson.remoting.Channel$CloseCommand.execute(Channel.java:1076)
	at hudson.remoting.Channel$1.handle(Channel.java:498)
	at hudson.remoting.SynchronousCommandTransport$ReaderThread.run(SynchronousCommandTransport.java:60)
Notifying upstream projects of job completion
Warning: you have no plugins providing access control for builds, so falling back to legacy behavior of permitting any downstream builds to be triggered
Finished: UNSTABLE