UnstableConsole Output

Skipping 183 KB.. Full Log
r.SurefireStarter.runSuitesInProcessWhenForked(SurefireStarter.java:107)
	at org.apache.maven.surefire.booter.ForkedBooter.main(ForkedBooter.java:68)
Caused by: org.apache.commons.configuration.ConfigurationException: Can only set one of properties: context.label, context.mn.baseurl, context.cn.baseurl, or context.nodelist.uri.  Number received: 2
	at org.dataone.configuration.TestSettings.determineContext(TestSettings.java:160)
	at org.dataone.configuration.TestSettings.getConfiguration(TestSettings.java:91)
	... 38 more
20151110-08:14:00: [ERROR]: Problem loading testing configuration at: 'null':: Cannot locate configuration source null [org.dataone.configuration.TestSettings]
20151110-08:14:00: [ERROR]: General Problem loading TestSettings. InvocationTargetException: null [org.dataone.configuration.Settings]
java.lang.reflect.InvocationTargetException
	at sun.reflect.NativeMethodAccessorImpl.invoke0(Native Method)
	at sun.reflect.NativeMethodAccessorImpl.invoke(NativeMethodAccessorImpl.java:57)
	at sun.reflect.DelegatingMethodAccessorImpl.invoke(DelegatingMethodAccessorImpl.java:43)
	at java.lang.reflect.Method.invoke(Method.java:606)
	at org.dataone.configuration.Settings.loadTestConfigurations(Settings.java:151)
	at org.dataone.configuration.Settings.getConfiguration(Settings.java:87)
	at org.dataone.configuration.Settings.getResetConfiguration(Settings.java:123)
	at org.dataone.configuration.TestSettingsTest.testBadFilenameExceptionHandling(TestSettingsTest.java:196)
	at sun.reflect.NativeMethodAccessorImpl.invoke0(Native Method)
	at sun.reflect.NativeMethodAccessorImpl.invoke(NativeMethodAccessorImpl.java:57)
	at sun.reflect.DelegatingMethodAccessorImpl.invoke(DelegatingMethodAccessorImpl.java:43)
	at java.lang.reflect.Method.invoke(Method.java:606)
	at org.junit.runners.model.FrameworkMethod$1.runReflectiveCall(FrameworkMethod.java:44)
	at org.junit.internal.runners.model.ReflectiveCallable.run(ReflectiveCallable.java:15)
	at org.junit.runners.model.FrameworkMethod.invokeExplosively(FrameworkMethod.java:41)
	at org.junit.internal.runners.statements.InvokeMethod.evaluate(InvokeMethod.java:20)
	at org.junit.internal.runners.statements.RunBefores.evaluate(RunBefores.java:28)
	at org.junit.internal.runners.statements.RunAfters.evaluate(RunAfters.java:31)
	at org.junit.runners.BlockJUnit4ClassRunner.runChild(BlockJUnit4ClassRunner.java:76)
	at org.junit.runners.BlockJUnit4ClassRunner.runChild(BlockJUnit4ClassRunner.java:50)
	at org.junit.runners.ParentRunner$3.run(ParentRunner.java:193)
	at org.junit.runners.ParentRunner$1.schedule(ParentRunner.java:52)
	at org.junit.runners.ParentRunner.runChildren(ParentRunner.java:191)
	at org.junit.runners.ParentRunner.access$000(ParentRunner.java:42)
	at org.junit.runners.ParentRunner$2.evaluate(ParentRunner.java:184)
	at org.junit.runners.ParentRunner.run(ParentRunner.java:236)
	at org.apache.maven.surefire.junit4.JUnit4TestSet.execute(JUnit4TestSet.java:53)
	at org.apache.maven.surefire.junit4.JUnit4Provider.executeTestSet(JUnit4Provider.java:123)
	at org.apache.maven.surefire.junit4.JUnit4Provider.invoke(JUnit4Provider.java:104)
	at sun.reflect.NativeMethodAccessorImpl.invoke0(Native Method)
	at sun.reflect.NativeMethodAccessorImpl.invoke(NativeMethodAccessorImpl.java:57)
	at sun.reflect.DelegatingMethodAccessorImpl.invoke(DelegatingMethodAccessorImpl.java:43)
	at java.lang.reflect.Method.invoke(Method.java:606)
	at org.apache.maven.surefire.util.ReflectionUtils.invokeMethodWithArray(ReflectionUtils.java:164)
	at org.apache.maven.surefire.booter.ProviderFactory$ProviderProxy.invoke(ProviderFactory.java:110)
	at org.apache.maven.surefire.booter.SurefireStarter.invokeProvider(SurefireStarter.java:175)
	at org.apache.maven.surefire.booter.SurefireStarter.runSuitesInProcessWhenForked(SurefireStarter.java:107)
	at org.apache.maven.surefire.booter.ForkedBooter.main(ForkedBooter.java:68)
Caused by: org.apache.commons.configuration.ConfigurationException: Cannot locate configuration source null
	at org.apache.commons.configuration.AbstractFileConfiguration.load(AbstractFileConfiguration.java:217)
	at org.apache.commons.configuration.AbstractFileConfiguration.load(AbstractFileConfiguration.java:197)
	at org.apache.commons.configuration.AbstractFileConfiguration.<init>(AbstractFileConfiguration.java:181)
	at org.apache.commons.configuration.PropertiesConfiguration.<init>(PropertiesConfiguration.java:269)
	at org.dataone.configuration.TestSettings.loadConfigurationFile(TestSettings.java:199)
	at org.dataone.configuration.TestSettings.getConfiguration(TestSettings.java:69)
	... 38 more
20151110-08:14:00: [ERROR]: Problem loading testing configuration at: 'null':: Cannot locate configuration source null [org.dataone.configuration.TestSettings]
20151110-08:14:00: [ERROR]: General Problem loading TestSettings. InvocationTargetException: null [org.dataone.configuration.Settings]
java.lang.reflect.InvocationTargetException
	at sun.reflect.NativeMethodAccessorImpl.invoke0(Native Method)
	at sun.reflect.NativeMethodAccessorImpl.invoke(NativeMethodAccessorImpl.java:57)
	at sun.reflect.DelegatingMethodAccessorImpl.invoke(DelegatingMethodAccessorImpl.java:43)
	at java.lang.reflect.Method.invoke(Method.java:606)
	at org.dataone.configuration.Settings.loadTestConfigurations(Settings.java:151)
	at org.dataone.configuration.Settings.getConfiguration(Settings.java:87)
	at org.dataone.configuration.Settings.getResetConfiguration(Settings.java:123)
	at org.dataone.configuration.TestSettingsTest.testContextSafetyOnError(TestSettingsTest.java:209)
	at sun.reflect.NativeMethodAccessorImpl.invoke0(Native Method)
	at sun.reflect.NativeMethodAccessorImpl.invoke(NativeMethodAccessorImpl.java:57)
	at sun.reflect.DelegatingMethodAccessorImpl.invoke(DelegatingMethodAccessorImpl.java:43)
	at java.lang.reflect.Method.invoke(Method.java:606)
	at org.junit.runners.model.FrameworkMethod$1.runReflectiveCall(FrameworkMethod.java:44)
	at org.junit.internal.runners.model.ReflectiveCallable.run(ReflectiveCallable.java:15)
	at org.junit.runners.model.FrameworkMethod.invokeExplosively(FrameworkMethod.java:41)
	at org.junit.internal.runners.statements.InvokeMethod.evaluate(InvokeMethod.java:20)
	at org.junit.internal.runners.statements.RunBefores.evaluate(RunBefores.java:28)
	at org.junit.internal.runners.statements.RunAfters.evaluate(RunAfters.java:31)
	at org.junit.runners.BlockJUnit4ClassRunner.runChild(BlockJUnit4ClassRunner.java:76)
	at org.junit.runners.BlockJUnit4ClassRunner.runChild(BlockJUnit4ClassRunner.java:50)
	at org.junit.runners.ParentRunner$3.run(ParentRunner.java:193)
	at org.junit.runners.ParentRunner$1.schedule(ParentRunner.java:52)
	at org.junit.runners.ParentRunner.runChildren(ParentRunner.java:191)
	at org.junit.runners.ParentRunner.access$000(ParentRunner.java:42)
	at org.junit.runners.ParentRunner$2.evaluate(ParentRunner.java:184)
	at org.junit.runners.ParentRunner.run(ParentRunner.java:236)
	at org.apache.maven.surefire.junit4.JUnit4TestSet.execute(JUnit4TestSet.java:53)
	at org.apache.maven.surefire.junit4.JUnit4Provider.executeTestSet(JUnit4Provider.java:123)
	at org.apache.maven.surefire.junit4.JUnit4Provider.invoke(JUnit4Provider.java:104)
	at sun.reflect.NativeMethodAccessorImpl.invoke0(Native Method)
	at sun.reflect.NativeMethodAccessorImpl.invoke(NativeMethodAccessorImpl.java:57)
	at sun.reflect.DelegatingMethodAccessorImpl.invoke(DelegatingMethodAccessorImpl.java:43)
	at java.lang.reflect.Method.invoke(Method.java:606)
	at org.apache.maven.surefire.util.ReflectionUtils.invokeMethodWithArray(ReflectionUtils.java:164)
	at org.apache.maven.surefire.booter.ProviderFactory$ProviderProxy.invoke(ProviderFactory.java:110)
	at org.apache.maven.surefire.booter.SurefireStarter.invokeProvider(SurefireStarter.java:175)
	at org.apache.maven.surefire.booter.SurefireStarter.runSuitesInProcessWhenForked(SurefireStarter.java:107)
	at org.apache.maven.surefire.booter.ForkedBooter.main(ForkedBooter.java:68)
Caused by: org.apache.commons.configuration.ConfigurationException: Cannot locate configuration source null
	at org.apache.commons.configuration.AbstractFileConfiguration.load(AbstractFileConfiguration.java:217)
	at org.apache.commons.configuration.AbstractFileConfiguration.load(AbstractFileConfiguration.java:197)
	at org.apache.commons.configuration.AbstractFileConfiguration.<init>(AbstractFileConfiguration.java:181)
	at org.apache.commons.configuration.PropertiesConfiguration.<init>(PropertiesConfiguration.java:269)
	at org.dataone.configuration.TestSettings.loadConfigurationFile(TestSettings.java:199)
	at org.dataone.configuration.TestSettings.getConfiguration(TestSettings.java:69)
	... 38 more
20151110-08:14:00: [ERROR]: Problem loading testing configuration at: 'null':: Cannot locate configuration source null [org.dataone.configuration.TestSettings]
20151110-08:14:00: [ERROR]: General Problem loading TestSettings. InvocationTargetException: null [org.dataone.configuration.Settings]
java.lang.reflect.InvocationTargetException
	at sun.reflect.NativeMethodAccessorImpl.invoke0(Native Method)
	at sun.reflect.NativeMethodAccessorImpl.invoke(NativeMethodAccessorImpl.java:57)
	at sun.reflect.DelegatingMethodAccessorImpl.invoke(DelegatingMethodAccessorImpl.java:43)
	at java.lang.reflect.Method.invoke(Method.java:606)
	at org.dataone.configuration.Settings.loadTestConfigurations(Settings.java:151)
	at org.dataone.configuration.Settings.getConfiguration(Settings.java:87)
	at org.dataone.configuration.Settings.getResetConfiguration(Settings.java:123)
	at org.dataone.configuration.TestSettingsTest.testContextSafetyOnError(TestSettingsTest.java:211)
	at sun.reflect.NativeMethodAccessorImpl.invoke0(Native Method)
	at sun.reflect.NativeMethodAccessorImpl.invoke(NativeMethodAccessorImpl.java:57)
	at sun.reflect.DelegatingMethodAccessorImpl.invoke(DelegatingMethodAccessorImpl.java:43)
	at java.lang.reflect.Method.invoke(Method.java:606)
	at org.junit.runners.model.FrameworkMethod$1.runReflectiveCall(FrameworkMethod.java:44)
	at org.junit.internal.runners.model.ReflectiveCallable.run(ReflectiveCallable.java:15)
	at org.junit.runners.model.FrameworkMethod.invokeExplosively(FrameworkMethod.java:41)
	at org.junit.internal.runners.statements.InvokeMethod.evaluate(InvokeMethod.java:20)
	at org.junit.internal.runners.statements.RunBefores.evaluate(RunBefores.java:28)
	at org.junit.internal.runners.statements.RunAfters.evaluate(RunAfters.java:31)
	at org.junit.runners.BlockJUnit4ClassRunner.runChild(BlockJUnit4ClassRunner.java:76)
	at org.junit.runners.BlockJUnit4ClassRunner.runChild(BlockJUnit4ClassRunner.java:50)
	at org.junit.runners.ParentRunner$3.run(ParentRunner.java:193)
	at org.junit.runners.ParentRunner$1.schedule(ParentRunner.java:52)
	at org.junit.runners.ParentRunner.runChildren(ParentRunner.java:191)
	at org.junit.runners.ParentRunner.access$000(ParentRunner.java:42)
	at org.junit.runners.ParentRunner$2.evaluate(ParentRunner.java:184)
	at org.junit.runners.ParentRunner.run(ParentRunner.java:236)
	at org.apache.maven.surefire.junit4.JUnit4TestSet.execute(JUnit4TestSet.java:53)
	at org.apache.maven.surefire.junit4.JUnit4Provider.executeTestSet(JUnit4Provider.java:123)
	at org.apache.maven.surefire.junit4.JUnit4Provider.invoke(JUnit4Provider.java:104)
	at sun.reflect.NativeMethodAccessorImpl.invoke0(Native Method)
	at sun.reflect.NativeMethodAccessorImpl.invoke(NativeMethodAccessorImpl.java:57)
	at sun.reflect.DelegatingMethodAccessorImpl.invoke(DelegatingMethodAccessorImpl.java:43)
	at java.lang.reflect.Method.invoke(Method.java:606)
	at org.apache.maven.surefire.util.ReflectionUtils.invokeMethodWithArray(ReflectionUtils.java:164)
	at org.apache.maven.surefire.booter.ProviderFactory$ProviderProxy.invoke(ProviderFactory.java:110)
	at org.apache.maven.surefire.booter.SurefireStarter.invokeProvider(SurefireStarter.java:175)
	at org.apache.maven.surefire.booter.SurefireStarter.runSuitesInProcessWhenForked(SurefireStarter.java:107)
	at org.apache.maven.surefire.booter.ForkedBooter.main(ForkedBooter.java:68)
Caused by: org.apache.commons.configuration.ConfigurationException: Cannot locate configuration source null
	at org.apache.commons.configuration.AbstractFileConfiguration.load(AbstractFileConfiguration.java:217)
	at org.apache.commons.configuration.AbstractFileConfiguration.load(AbstractFileConfiguration.java:197)
	at org.apache.commons.configuration.AbstractFileConfiguration.<init>(AbstractFileConfiguration.java:181)
	at org.apache.commons.configuration.PropertiesConfiguration.<init>(PropertiesConfiguration.java:269)
	at org.dataone.configuration.TestSettings.loadConfigurationFile(TestSettings.java:199)
	at org.dataone.configuration.TestSettings.getConfiguration(TestSettings.java:69)
	... 38 more
Tests run: 11, Failures: 0, Errors: 0, Skipped: 1, Time elapsed: 0.11 sec
Running org.dataone.client.PoolingHttpClientConnectionManagerTest
Tests run: 2, Failures: 0, Errors: 0, Skipped: 1, Time elapsed: 0 sec
Running org.dataone.client.CNRestURLTest
Tests run: 9, Failures: 0, Errors: 0, Skipped: 8, Time elapsed: 0.014 sec

Results :

Tests run: 35, Failures: 0, Errors: 0, Skipped: 12

[JENKINS] Recording test results
[INFO] 
[INFO] --- maven-antrun-plugin:1.3:run (execution1) @ d1_integration ---
[INFO] Executing tasks
     [copy] Copying 236 files to /var/lib/jenkins/jobs/d1_integration_DEV2_MN_sid_functional/workspace/target/classes
     [copy] Copying 3 files to /var/lib/jenkins/jobs/d1_integration_DEV2_MN_sid_functional/workspace/target/d1_integration-2.0-SNAPSHOT/org/dataone/integration/webTest
[INFO] Executed tasks
[INFO] 
[INFO] --- maven-dependency-plugin:2.3:unpack-dependencies (jetty-classpath) @ d1_integration ---
[INFO] Unpacking /var/lib/jenkins/.m2/repository/org/eclipse/jetty/orbit/org.apache.jasper.glassfish/2.2.2.v201112011158/org.apache.jasper.glassfish-2.2.2.v201112011158.jar to /var/lib/jenkins/jobs/d1_integration_DEV2_MN_sid_functional/workspace/target/d1_integration-2.0-SNAPSHOT with includes "" and excludes ""
[INFO] Unpacking /var/lib/jenkins/.m2/repository/org/slf4j/slf4j-simple/1.6.4/slf4j-simple-1.6.4.jar to /var/lib/jenkins/jobs/d1_integration_DEV2_MN_sid_functional/workspace/target/d1_integration-2.0-SNAPSHOT with includes "" and excludes ""
[INFO] Unpacking /var/lib/jenkins/.m2/repository/org/eclipse/jetty/jetty-websocket/8.1.15.v20140411/jetty-websocket-8.1.15.v20140411.jar to /var/lib/jenkins/jobs/d1_integration_DEV2_MN_sid_functional/workspace/target/d1_integration-2.0-SNAPSHOT with includes "" and excludes ""
[INFO] Unpacking /var/lib/jenkins/.m2/repository/org/eclipse/jetty/orbit/javax.security.auth.message/1.0.0.v201108011116/javax.security.auth.message-1.0.0.v201108011116.jar to /var/lib/jenkins/jobs/d1_integration_DEV2_MN_sid_functional/workspace/target/d1_integration-2.0-SNAPSHOT with includes "" and excludes ""
[INFO] Unpacking /var/lib/jenkins/.m2/repository/org/eclipse/jetty/orbit/javax.servlet.jsp.jstl/1.2.0.v201105211821/javax.servlet.jsp.jstl-1.2.0.v201105211821.jar to /var/lib/jenkins/jobs/d1_integration_DEV2_MN_sid_functional/workspace/target/d1_integration-2.0-SNAPSHOT with includes "" and excludes ""
[INFO] Unpacking /var/lib/jenkins/.m2/repository/org/eclipse/jetty/orbit/com.sun.el/2.2.0.v201108011116/com.sun.el-2.2.0.v201108011116.jar to /var/lib/jenkins/jobs/d1_integration_DEV2_MN_sid_functional/workspace/target/d1_integration-2.0-SNAPSHOT with includes "" and excludes ""
[INFO] Unpacking /var/lib/jenkins/.m2/repository/org/eclipse/jetty/orbit/javax.mail.glassfish/1.4.1.v201005082020/javax.mail.glassfish-1.4.1.v201005082020.jar to /var/lib/jenkins/jobs/d1_integration_DEV2_MN_sid_functional/workspace/target/d1_integration-2.0-SNAPSHOT with includes "" and excludes ""
[INFO] Unpacking /var/lib/jenkins/.m2/repository/org/slf4j/slf4j-api/1.6.4/slf4j-api-1.6.4.jar to /var/lib/jenkins/jobs/d1_integration_DEV2_MN_sid_functional/workspace/target/d1_integration-2.0-SNAPSHOT with includes "" and excludes ""
[INFO] Unpacking /var/lib/jenkins/.m2/repository/org/eclipse/jetty/jetty-io/8.1.15.v20140411/jetty-io-8.1.15.v20140411.jar to /var/lib/jenkins/jobs/d1_integration_DEV2_MN_sid_functional/workspace/target/d1_integration-2.0-SNAPSHOT with includes "" and excludes ""
[INFO] Unpacking /var/lib/jenkins/.m2/repository/org/eclipse/jetty/orbit/javax.servlet.jsp/2.2.0.v201112011158/javax.servlet.jsp-2.2.0.v201112011158.jar to /var/lib/jenkins/jobs/d1_integration_DEV2_MN_sid_functional/workspace/target/d1_integration-2.0-SNAPSHOT with includes "" and excludes ""
[INFO] Unpacking /var/lib/jenkins/.m2/repository/org/eclipse/jetty/aggregate/jetty-all-server/8.1.15.v20140411/jetty-all-server-8.1.15.v20140411.jar to /var/lib/jenkins/jobs/d1_integration_DEV2_MN_sid_functional/workspace/target/d1_integration-2.0-SNAPSHOT with includes "" and excludes ""
[INFO] Unpacking /var/lib/jenkins/.m2/repository/org/eclipse/jetty/jetty-jsp/8.1.15.v20140411/jetty-jsp-8.1.15.v20140411.jar to /var/lib/jenkins/jobs/d1_integration_DEV2_MN_sid_functional/workspace/target/d1_integration-2.0-SNAPSHOT with includes "" and excludes ""
[INFO] Unpacking /var/lib/jenkins/.m2/repository/org/eclipse/jetty/orbit/org.apache.taglibs.standard.glassfish/1.2.0.v201112081803/org.apache.taglibs.standard.glassfish-1.2.0.v201112081803.jar to /var/lib/jenkins/jobs/d1_integration_DEV2_MN_sid_functional/workspace/target/d1_integration-2.0-SNAPSHOT with includes "" and excludes ""
[INFO] Unpacking /var/lib/jenkins/.m2/repository/javax/servlet/servlet-api/2.5/servlet-api-2.5.jar to /var/lib/jenkins/jobs/d1_integration_DEV2_MN_sid_functional/workspace/target/d1_integration-2.0-SNAPSHOT with includes "" and excludes ""
[INFO] Unpacking /var/lib/jenkins/.m2/repository/org/eclipse/jetty/orbit/javax.activation/1.1.0.v201105071233/javax.activation-1.1.0.v201105071233.jar to /var/lib/jenkins/jobs/d1_integration_DEV2_MN_sid_functional/workspace/target/d1_integration-2.0-SNAPSHOT with includes "" and excludes ""
[INFO] Unpacking /var/lib/jenkins/.m2/repository/org/eclipse/jetty/orbit/javax.annotation/1.1.0.v201108011116/javax.annotation-1.1.0.v201108011116.jar to /var/lib/jenkins/jobs/d1_integration_DEV2_MN_sid_functional/workspace/target/d1_integration-2.0-SNAPSHOT with includes "" and excludes ""
[INFO] Unpacking /var/lib/jenkins/.m2/repository/org/eclipse/jetty/jetty-http/8.1.15.v20140411/jetty-http-8.1.15.v20140411.jar to /var/lib/jenkins/jobs/d1_integration_DEV2_MN_sid_functional/workspace/target/d1_integration-2.0-SNAPSHOT with includes "" and excludes ""
[INFO] Unpacking /var/lib/jenkins/.m2/repository/org/eclipse/jetty/jetty-util/8.1.15.v20140411/jetty-util-8.1.15.v20140411.jar to /var/lib/jenkins/jobs/d1_integration_DEV2_MN_sid_functional/workspace/target/d1_integration-2.0-SNAPSHOT with includes "" and excludes ""
[INFO] Unpacking /var/lib/jenkins/.m2/repository/org/eclipse/jetty/orbit/org.eclipse.jdt.core/3.7.1/org.eclipse.jdt.core-3.7.1.jar to /var/lib/jenkins/jobs/d1_integration_DEV2_MN_sid_functional/workspace/target/d1_integration-2.0-SNAPSHOT with includes "" and excludes ""
[INFO] Unpacking /var/lib/jenkins/.m2/repository/org/eclipse/jetty/orbit/javax.servlet/3.0.0.v201112011016/javax.servlet-3.0.0.v201112011016.jar to /var/lib/jenkins/jobs/d1_integration_DEV2_MN_sid_functional/workspace/target/d1_integration-2.0-SNAPSHOT with includes "" and excludes ""
[INFO] Unpacking /var/lib/jenkins/.m2/repository/org/eclipse/jetty/orbit/javax.el/2.2.0.v201108011116/javax.el-2.2.0.v201108011116.jar to /var/lib/jenkins/jobs/d1_integration_DEV2_MN_sid_functional/workspace/target/d1_integration-2.0-SNAPSHOT with includes "" and excludes ""
[INFO] 
[INFO] --- maven-war-plugin:2.1.1:war (default-war) @ d1_integration ---
[INFO] Packaging webapp
[INFO] Assembling webapp [d1_integration] in [/var/lib/jenkins/jobs/d1_integration_DEV2_MN_sid_functional/workspace/target/d1_integration-2.0-SNAPSHOT]
[INFO] Processing war project
[INFO] Copying webapp resources [/var/lib/jenkins/jobs/d1_integration_DEV2_MN_sid_functional/workspace/src/main/webapp]
[INFO] Webapp assembled in [453 msecs]
[INFO] Building war: /var/lib/jenkins/jobs/d1_integration_DEV2_MN_sid_functional/workspace/target/d1_integration-2.0-SNAPSHOT.war
[INFO] WEB-INF/web.xml already added, skipping
[INFO] 
[INFO] --- maven-antrun-plugin:1.3:run (execution2) @ d1_integration ---
[INFO] Executing tasks
     [move] Moving 1 file to /var/lib/jenkins/jobs/d1_integration_DEV2_MN_sid_functional/workspace/target
[INFO] Executed tasks
[INFO] 
[INFO] --- maven-failsafe-plugin:2.8.1:integration-test (integration-test) @ d1_integration ---
[INFO] Failsafe report directory: /var/lib/jenkins/jobs/d1_integration_DEV2_MN_sid_functional/workspace/target/failsafe-reports

-------------------------------------------------------
 T E S T S
-------------------------------------------------------
Running org.dataone.integration.it.testImplementations.SidMNTestImplementations
20151110-08:14:14: [INFO]: **************************************************** [org.dataone.integration.ContextAwareTestCaseDataone]
20151110-08:14:14: [INFO]: ***  context label:   DEV2 [org.dataone.integration.ContextAwareTestCaseDataone]
20151110-08:14:14: [INFO]: **************************************************** [org.dataone.integration.ContextAwareTestCaseDataone]
~~~ Context is from d1client.properties: https://cn-dev-2.test.dataone.org/cn
20151110-08:14:15: [INFO]: rest call info: GET https://cn-dev-2.test.dataone.org/cn/v1/node [org.dataone.client.rest.RestClient]
20151110-08:14:15: [INFO]: isNodeAlive for Node: https://cn-dev-2.test.dataone.org/cn ... [org.dataone.integration.ContextAwareTestCaseDataone]
20151110-08:14:15: [INFO]: ... calling node ... [org.dataone.integration.ContextAwareTestCaseDataone]
20151110-08:14:15: [INFO]: rest call info: GET https://cn-dev-2.test.dataone.org/cn [org.dataone.client.rest.RestClient]
20151110-08:14:15: [INFO]: ... called node [org.dataone.integration.ContextAwareTestCaseDataone]
20151110-08:14:15: [INFO]: *** Adding CN to list: cn-dev-2 [ https://cn-dev-2.test.dataone.org/cn ] [org.dataone.integration.ContextAwareTestCaseDataone]
20151110-08:14:15: [INFO]: isNodeAlive for Node: https://cn-dev-ucsb-2.test.dataone.org/cn ... [org.dataone.integration.ContextAwareTestCaseDataone]
20151110-08:14:15: [INFO]: ... calling node ... [org.dataone.integration.ContextAwareTestCaseDataone]
20151110-08:14:23: [INFO]: rest call info: GET https://cn-dev-ucsb-2.test.dataone.org/cn [org.dataone.client.rest.RestClient]
20151110-08:14:23: [INFO]: ... called node [org.dataone.integration.ContextAwareTestCaseDataone]
20151110-08:14:23: [INFO]: *** Adding CN to list: cn-dev-ucsb-2 [ https://cn-dev-ucsb-2.test.dataone.org/cn ] [org.dataone.integration.ContextAwareTestCaseDataone]
20151110-08:14:23: [INFO]: isNodeAlive for Node: https://cn-dev-unm-2.test.dataone.org/cn ... [org.dataone.integration.ContextAwareTestCaseDataone]
20151110-08:14:23: [INFO]: ... calling node ... [org.dataone.integration.ContextAwareTestCaseDataone]
20151110-08:14:23: [INFO]: rest call info: GET https://cn-dev-unm-2.test.dataone.org/cn [org.dataone.client.rest.RestClient]
20151110-08:14:23: [INFO]: ... called node [org.dataone.integration.ContextAwareTestCaseDataone]
20151110-08:14:23: [INFO]: *** Adding CN to list: cn-dev-unm-2 [ https://cn-dev-unm-2.test.dataone.org/cn ] [org.dataone.integration.ContextAwareTestCaseDataone]
20151110-08:14:23: [INFO]: isNodeAlive for Node: https://mn-dev-ucsb-1.test.dataone.org/metacat/d1/mn ... [org.dataone.integration.ContextAwareTestCaseDataone]
20151110-08:14:23: [INFO]: ... calling node ... [org.dataone.integration.ContextAwareTestCaseDataone]
20151110-08:14:31: [INFO]: rest call info: GET https://mn-dev-ucsb-1.test.dataone.org/metacat/d1/mn [org.dataone.client.rest.RestClient]
20151110-08:14:31: [INFO]: ... called node [org.dataone.integration.ContextAwareTestCaseDataone]
20151110-08:14:31: [INFO]: *** Adding MN to list: mn-dev-ucsb-1 [ https://mn-dev-ucsb-1.test.dataone.org/metacat/d1/mn ] [org.dataone.integration.ContextAwareTestCaseDataone]
20151110-08:14:31: [INFO]: isNodeAlive for Node: https://mn-dev-ucsb-2.test.dataone.org/metacat/d1/mn ... [org.dataone.integration.ContextAwareTestCaseDataone]
20151110-08:14:31: [INFO]: ... calling node ... [org.dataone.integration.ContextAwareTestCaseDataone]
20151110-08:14:39: [INFO]: rest call info: GET https://mn-dev-ucsb-2.test.dataone.org/metacat/d1/mn [org.dataone.client.rest.RestClient]
20151110-08:14:39: [INFO]: ... called node [org.dataone.integration.ContextAwareTestCaseDataone]
20151110-08:14:39: [INFO]: *** Adding MN to list: mn-dev-ucsb-2 [ https://mn-dev-ucsb-2.test.dataone.org/metacat/d1/mn ] [org.dataone.integration.ContextAwareTestCaseDataone]
20151110-08:14:39: [INFO]: isNodeAlive for Node: https://mn-dev-unm-1.test.dataone.org/metacat/d1/mn ... [org.dataone.integration.ContextAwareTestCaseDataone]
20151110-08:14:39: [INFO]: ... calling node ... [org.dataone.integration.ContextAwareTestCaseDataone]
20151110-08:14:39: [INFO]: rest call info: GET https://mn-dev-unm-1.test.dataone.org/metacat/d1/mn [org.dataone.client.rest.RestClient]
20151110-08:14:39: [INFO]: ... called node [org.dataone.integration.ContextAwareTestCaseDataone]
20151110-08:14:39: [INFO]: *** Adding MN to list: mn-dev-unm-1 [ https://mn-dev-unm-1.test.dataone.org/metacat/d1/mn ] [org.dataone.integration.ContextAwareTestCaseDataone]
20151110-08:14:39: [INFO]: isNodeAlive for Node: https://mn-dev-unm-2.test.dataone.org/metacat/d1/mn ... [org.dataone.integration.ContextAwareTestCaseDataone]
20151110-08:14:39: [INFO]: ... calling node ... [org.dataone.integration.ContextAwareTestCaseDataone]
20151110-08:14:39: [INFO]: rest call info: GET https://mn-dev-unm-2.test.dataone.org/metacat/d1/mn [org.dataone.client.rest.RestClient]
20151110-08:14:39: [INFO]: ... called node [org.dataone.integration.ContextAwareTestCaseDataone]
20151110-08:14:39: [INFO]: *** Adding MN to list: mn-dev-unm-2 [ https://mn-dev-unm-2.test.dataone.org/metacat/d1/mn ] [org.dataone.integration.ContextAwareTestCaseDataone]
20151110-08:14:39: [INFO]: trying to filter CN list for the round robin CN... original size: 3, includes nodes: [org.dataone.integration.ContextAwareTestCaseDataone]
20151110-08:14:39: [INFO]:     CN: https://cn-dev-2.test.dataone.org/cn "Development 2 Round Robin Router Node" [org.dataone.integration.ContextAwareTestCaseDataone]
20151110-08:14:39: [INFO]:     CN: https://cn-dev-ucsb-2.test.dataone.org/cn "UCSB Development 2 Protocol Coordinating Node" [org.dataone.integration.ContextAwareTestCaseDataone]
20151110-08:14:39: [INFO]:     CN: https://cn-dev-unm-2.test.dataone.org/cn "UNM Development 2 Protocol Coordinating Node" [org.dataone.integration.ContextAwareTestCaseDataone]
20151110-08:14:39: [INFO]: excluding round robin CN: https://cn-dev-2.test.dataone.org/cn "Development 2 Round Robin Router Node" [org.dataone.integration.ContextAwareTestCaseDataone]
20151110-08:14:39: [INFO]: including CN: https://cn-dev-ucsb-2.test.dataone.org/cn "UCSB Development 2 Protocol Coordinating Node" [org.dataone.integration.ContextAwareTestCaseDataone]
20151110-08:14:39: [INFO]: including CN: https://cn-dev-unm-2.test.dataone.org/cn "UNM Development 2 Protocol Coordinating Node" [org.dataone.integration.ContextAwareTestCaseDataone]
20151110-08:14:39: [INFO]: filtered CN list without round robin CN. size: 2, including nodes: [org.dataone.integration.ContextAwareTestCaseDataone]
20151110-08:14:39: [INFO]:     CN: https://cn-dev-ucsb-2.test.dataone.org/cn "UCSB Development 2 Protocol Coordinating Node" [org.dataone.integration.ContextAwareTestCaseDataone]
20151110-08:14:39: [INFO]:     CN: https://cn-dev-unm-2.test.dataone.org/cn "UNM Development 2 Protocol Coordinating Node" [org.dataone.integration.ContextAwareTestCaseDataone]
20151110-08:14:39: [INFO]: **************************************************** [org.dataone.integration.ContextAwareTestCaseDataone]
20151110-08:14:39: [INFO]: Testing getPackage() method ...  [org.dataone.integration.ContextAwareTestCaseDataone]
20151110-08:14:39: [INFO]: Testing getPackage(), Case1 [org.dataone.integration.ContextAwareTestCaseDataone]
20151110-08:14:39: [INFO]: certificate directory: /etc/dataone/client/testClientCerts/ [org.dataone.integration.ContextAwareTestCaseDataone]
20151110-08:14:39: [INFO]: certificate filename: cnDevUNM2 [org.dataone.integration.ContextAwareTestCaseDataone]
20151110-08:14:39: [INFO]: client setup as Subject: CN=urn:node:cnDevUNM2,DC=dataone,DC=org [org.dataone.integration.ContextAwareTestCaseDataone]
20151110-08:14:47: [INFO]: rest call info: GET https://mn-dev-ucsb-1.test.dataone.org/metacat/d1/mn/v2/monitor/ping [org.dataone.client.rest.RestClient]
20151110-08:14:47: [INFO]: MN excluded from test: https://mn-dev-ucsb-1.test.dataone.org/metacat/d1/mn [org.dataone.integration.ContextAwareTestCaseDataone]
20151110-08:14:55: [INFO]: rest call info: GET https://mn-dev-ucsb-2.test.dataone.org/metacat/d1/mn/v2/monitor/ping [org.dataone.client.rest.RestClient]
20151110-08:14:55: [INFO]: MN included in test: https://mn-dev-ucsb-2.test.dataone.org/metacat/d1/mn [org.dataone.integration.ContextAwareTestCaseDataone]
20151110-08:14:55: [INFO]: rest call info: GET https://mn-dev-unm-1.test.dataone.org/metacat/d1/mn/v2/monitor/ping [org.dataone.client.rest.RestClient]
20151110-08:14:55: [INFO]: MN excluded from test: https://mn-dev-unm-1.test.dataone.org/metacat/d1/mn [org.dataone.integration.ContextAwareTestCaseDataone]
20151110-08:14:56: [INFO]: rest call info: GET https://mn-dev-unm-2.test.dataone.org/metacat/d1/mn/v2/monitor/ping [org.dataone.client.rest.RestClient]
20151110-08:14:56: [INFO]: MN included in test: https://mn-dev-unm-2.test.dataone.org/metacat/d1/mn [org.dataone.integration.ContextAwareTestCaseDataone]
20151110-08:14:56: [INFO]: certificate directory: /etc/dataone/client/testClientCerts/ [org.dataone.integration.ContextAwareTestCaseDataone]
20151110-08:14:56: [INFO]: certificate filename: testRightsHolder [org.dataone.integration.ContextAwareTestCaseDataone]
20151110-08:14:56: [INFO]: client setup as Subject: CN=testRightsHolder,DC=dataone,DC=org [org.dataone.integration.ContextAwareTestCaseDataone]
20151110-08:14:56: [INFO]: certificate directory: /etc/dataone/client/testClientCerts/ [org.dataone.integration.ContextAwareTestCaseDataone]
20151110-08:14:56: [INFO]: certificate filename: cnDevUNM2 [org.dataone.integration.ContextAwareTestCaseDataone]
20151110-08:14:56: [INFO]: client setup as Subject: CN=urn:node:cnDevUNM2,DC=dataone,DC=org [org.dataone.integration.ContextAwareTestCaseDataone]
20151110-08:14:56: [INFO]: refreshing objectFormatCache from cn: null [org.dataone.client.v2.formats.ObjectFormatCache]
20151110-08:14:56: [INFO]: rest call info: GET https://cn-dev-2.test.dataone.org/cn/v2/formats [org.dataone.client.rest.RestClient]
20151110-08:14:56: [INFO]: successful cache refresh from cn.listFormats() [org.dataone.client.v2.formats.ObjectFormatCache]
20151110-08:14:56: [INFO]: creating a test object.  pid = testPackage_scimeta_201531401456148 on https://mn-dev-ucsb-2.test.dataone.org/metacat/d1/mn/v2 [org.dataone.integration.ContextAwareTestCaseDataone]
20151110-08:14:56: [INFO]: SystemMetadata for pid: testPackage_scimeta_201531401456148
<?xml version="1.0" encoding="UTF-8"?><d1_v2.0:systemMetadata xmlns:d1_v2.0="http://ns.dataone.org/service/types/v2.0" xmlns:d1="http://ns.dataone.org/service/types/v1"><serialVersion>1</serialVersion><identifier>testPackage_scimeta_201531401456148</identifier><formatId>eml://ecoinformatics.org/eml-2.0.1</formatId><size>17181</size><checksum algorithm="MD5">03ce09c6b4c3efc1681f3023402998a2</checksum><submitter>CN=urn:node:cnDevUNM2,DC=dataone,DC=org</submitter><rightsHolder>CN=testRightsHolder,DC=dataone,DC=org</rightsHolder><accessPolicy><allow><subject>CN=testRightsHolder,DC=dataone,DC=org</subject><permission>read</permission></allow></accessPolicy><dateUploaded>2015-11-10T08:14:56.499+00:00</dateUploaded><dateSysMetadataModified>2015-11-10T08:14:56.499+00:00</dateSysMetadataModified><originMemberNode>urn:node:mnDevUCSB2</originMemberNode><authoritativeMemberNode>urn:node:mnDevUCSB2</authoritativeMemberNode></d1_v2.0:systemMetadata> [org.dataone.integration.ContextAwareTestCaseDataone]
20151110-08:15:16: [INFO]: rest call info: POST https://mn-dev-ucsb-2.test.dataone.org/metacat/d1/mn/v2/object; MMP message has: ParamPart:pid = testPackage_scimeta_201531401456148; FilePart:object = /tmp/mmp.output.1521202063945002670.tmp (17181 bytes); FilePart:sysmeta = /tmp/mmp.output.4462156641373953910.tmp (949 bytes);  [org.dataone.client.rest.RestClient]
20151110-08:15:16: [INFO]: object created.  pid = testPackage_scimeta_201531401456148 [org.dataone.integration.ContextAwareTestCaseDataone]
20151110-08:15:16: [INFO]: certificate directory: /etc/dataone/client/testClientCerts/ [org.dataone.integration.ContextAwareTestCaseDataone]
20151110-08:15:16: [INFO]: certificate filename: cnDevUNM2 [org.dataone.integration.ContextAwareTestCaseDataone]
20151110-08:15:16: [INFO]: client setup as Subject: CN=urn:node:cnDevUNM2,DC=dataone,DC=org [org.dataone.integration.ContextAwareTestCaseDataone]
20151110-08:15:16: [INFO]: creating a test object.  pid = MNCallAdapterTierTests.mn-dev-ucsb-2.201531401516242.testPackage_dataObj_ on https://mn-dev-ucsb-2.test.dataone.org/metacat/d1/mn/v2 [org.dataone.integration.ContextAwareTestCaseDataone]
20151110-08:15:16: [INFO]: SystemMetadata for pid: MNCallAdapterTierTests.mn-dev-ucsb-2.201531401516242.testPackage_dataObj_
<?xml version="1.0" encoding="UTF-8"?><d1_v2.0:systemMetadata xmlns:d1_v2.0="http://ns.dataone.org/service/types/v2.0" xmlns:d1="http://ns.dataone.org/service/types/v1"><serialVersion>1</serialVersion><identifier>MNCallAdapterTierTests.mn-dev-ucsb-2.201531401516242.testPackage_dataObj_</identifier><formatId>eml://ecoinformatics.org/eml-2.0.1</formatId><size>17181</size><checksum algorithm="MD5">03ce09c6b4c3efc1681f3023402998a2</checksum><submitter>CN=urn:node:cnDevUNM2,DC=dataone,DC=org</submitter><rightsHolder>CN=testRightsHolder,DC=dataone,DC=org</rightsHolder><accessPolicy><allow><subject>CN=testRightsHolder,DC=dataone,DC=org</subject><permission>read</permission></allow></accessPolicy><dateUploaded>2015-11-10T08:15:16.263+00:00</dateUploaded><dateSysMetadataModified>2015-11-10T08:15:16.263+00:00</dateSysMetadataModified><originMemberNode>urn:node:mnDevUCSB2</originMemberNode><authoritativeMemberNode>urn:node:mnDevUCSB2</authoritativeMemberNode></d1_v2.0:systemMetadata> [org.dataone.integration.ContextAwareTestCaseDataone]
20151110-08:15:44: [INFO]: rest call info: POST https://mn-dev-ucsb-2.test.dataone.org/metacat/d1/mn/v2/object; MMP message has: ParamPart:pid = MNCallAdapterTierTests.mn-dev-ucsb-2.201531401516242.testPackage_dataObj_; FilePart:object = /tmp/mmp.output.2981982843414861073.tmp (17181 bytes); FilePart:sysmeta = /tmp/mmp.output.8348610502042307522.tmp (987 bytes);  [org.dataone.client.rest.RestClient]
20151110-08:15:44: [INFO]: object created.  pid = MNCallAdapterTierTests.mn-dev-ucsb-2.201531401516242.testPackage_dataObj_ [org.dataone.integration.ContextAwareTestCaseDataone]
20151110-08:16:23: [INFO]: rest call info: POST https://mn-dev-ucsb-2.test.dataone.org/metacat/d1/mn/v2/object; MMP message has: ParamPart:pid = P1_201531401456125; FilePart:object = /tmp/mmp.output.4880669821383795066.tmp (2985 bytes); FilePart:sysmeta = /tmp/mmp.output.4210545281889873046.tmp (788 bytes);  [org.dataone.client.rest.RestClient]
20151110-08:16:23: [INFO]: Created SID (S1_201531401456128) and head PID (P1_201531401456125) pair. [org.dataone.integration.ContextAwareTestCaseDataone]
20151110-08:18:31: [INFO]: rest call info: GET https://mn-dev-ucsb-2.test.dataone.org/metacat/d1/mn/v2/packages/application%2Fbagit-097/S1_201531401456128 [org.dataone.client.rest.RestClient]
org.dataone.service.exceptions.ServiceFailure: class org.dataone.client.exception.ClientSideException: /Read timed out
	at org.dataone.client.rest.HttpMultipartRestClient.doGetRequest(HttpMultipartRestClient.java:339)
	at org.dataone.client.rest.HttpMultipartRestClient.doGetRequest(HttpMultipartRestClient.java:318)
	at org.dataone.client.v2.impl.MultipartMNode.getPackage(MultipartMNode.java:739)
	at org.dataone.integration.adapters.MNCallAdapter.getPackage(MNCallAdapter.java:206)
	at org.dataone.integration.it.testImplementations.SidMNTestImplementations.testGetPackage(SidMNTestImplementations.java:646)
	at sun.reflect.NativeMethodAccessorImpl.invoke0(Native Method)
	at sun.reflect.NativeMethodAccessorImpl.invoke(NativeMethodAccessorImpl.java:57)
	at sun.reflect.DelegatingMethodAccessorImpl.invoke(DelegatingMethodAccessorImpl.java:43)
	at java.lang.reflect.Method.invoke(Method.java:606)
	at org.junit.runners.model.FrameworkMethod$1.runReflectiveCall(FrameworkMethod.java:44)
	at org.junit.internal.runners.model.ReflectiveCallable.run(ReflectiveCallable.java:15)
	at org.junit.runners.model.FrameworkMethod.invokeExplosively(FrameworkMethod.java:41)
	at org.junit.internal.runners.statements.InvokeMethod.evaluate(InvokeMethod.java:20)
	at org.junit.rules.Verifier$1.evaluate(Verifier.java:34)
	at org.junit.internal.runners.statements.RunBefores.evaluate(RunBefores.java:28)
	at org.junit.runners.BlockJUnit4ClassRunner.runChild(BlockJUnit4ClassRunner.java:76)
	at org.junit.runners.BlockJUnit4ClassRunner.runChild(BlockJUnit4ClassRunner.java:50)
	at org.junit.runners.ParentRunner$3.run(ParentRunner.java:193)
	at org.junit.runners.ParentRunner$1.schedule(ParentRunner.java:52)
	at org.junit.runners.ParentRunner.runChildren(ParentRunner.java:191)
	at org.junit.runners.ParentRunner.access$000(ParentRunner.java:42)
	at org.junit.runners.ParentRunner$2.evaluate(ParentRunner.java:184)
	at org.junit.runners.ParentRunner.run(ParentRunner.java:236)
	at org.apache.maven.surefire.junit4.JUnit4TestSet.execute(JUnit4TestSet.java:53)
	at org.apache.maven.surefire.junit4.JUnit4Provider.executeTestSet(JUnit4Provider.java:119)
	at org.apache.maven.surefire.junit4.JUnit4Provider.invoke(JUnit4Provider.java:101)
	at sun.reflect.NativeMethodAccessorImpl.invoke0(Native Method)
	at sun.reflect.NativeMethodAccessorImpl.invoke(NativeMethodAccessorImpl.java:57)
	at sun.reflect.DelegatingMethodAccessorImpl.invoke(DelegatingMethodAccessorImpl.java:43)
	at java.lang.reflect.Method.invoke(Method.java:606)
	at org.apache.maven.surefire.booter.ProviderFactory$ClassLoaderProxy.invoke(ProviderFactory.java:103)
	at com.sun.proxy.$Proxy0.invoke(Unknown Source)
	at org.apache.maven.surefire.booter.SurefireStarter.invokeProvider(SurefireStarter.java:150)
	at org.apache.maven.surefire.booter.SurefireStarter.runSuitesInProcess(SurefireStarter.java:91)
	at org.apache.maven.surefire.booter.ForkedBooter.main(ForkedBooter.java:69)
Caused by: org.dataone.client.exception.ClientSideException: /Read timed out
	... 35 more
Caused by: java.net.SocketTimeoutException: Read timed out
	at java.net.SocketInputStream.socketRead0(Native Method)
	at java.net.SocketInputStream.read(SocketInputStream.java:152)
	at java.net.SocketInputStream.read(SocketInputStream.java:122)
	at sun.security.ssl.InputRecord.readFully(InputRecord.java:442)
	at sun.security.ssl.InputRecord.read(InputRecord.java:480)
	at sun.security.ssl.SSLSocketImpl.readRecord(SSLSocketImpl.java:946)
	at sun.security.ssl.SSLSocketImpl.readDataRecord(SSLSocketImpl.java:903)
	at sun.security.ssl.AppInputStream.read(AppInputStream.java:102)
	at org.apache.http.impl.io.SessionInputBufferImpl.streamRead(SessionInputBufferImpl.java:136)
	at org.apache.http.impl.io.SessionInputBufferImpl.fillBuffer(SessionInputBufferImpl.java:152)
	at org.apache.http.impl.io.SessionInputBufferImpl.readLine(SessionInputBufferImpl.java:270)
	at org.apache.http.impl.conn.DefaultHttpResponseParser.parseHead(DefaultHttpResponseParser.java:140)
	at org.apache.http.impl.conn.DefaultHttpResponseParser.parseHead(DefaultHttpResponseParser.java:57)
	at org.apache.http.impl.io.AbstractMessageParser.parse(AbstractMessageParser.java:260)
	at org.apache.http.impl.DefaultBHttpClientConnection.receiveResponseHeader(DefaultBHttpClientConnection.java:161)
	at sun.reflect.GeneratedMethodAccessor9.invoke(Unknown Source)
	at sun.reflect.DelegatingMethodAccessorImpl.invoke(DelegatingMethodAccessorImpl.java:43)
	at java.lang.reflect.Method.invoke(Method.java:606)
	at org.apache.http.impl.conn.CPoolProxy.invoke(CPoolProxy.java:138)
	at com.sun.proxy.$Proxy9.receiveResponseHeader(Unknown Source)
	at org.apache.http.protocol.HttpRequestExecutor.doReceiveResponse(HttpRequestExecutor.java:271)
	at org.apache.http.protocol.HttpRequestExecutor.execute(HttpRequestExecutor.java:123)
	at org.apache.http.impl.execchain.MainClientExec.execute(MainClientExec.java:254)
	at org.apache.http.impl.execchain.ProtocolExec.execute(ProtocolExec.java:195)
	at org.apache.http.impl.execchain.RetryExec.execute(RetryExec.java:86)
	at org.apache.http.impl.execchain.RedirectExec.execute(RedirectExec.java:108)
	at org.apache.http.impl.client.InternalHttpClient.doExecute(InternalHttpClient.java:186)
	at org.apache.http.impl.client.CloseableHttpClient.execute(CloseableHttpClient.java:82)
	at org.apache.http.impl.client.CloseableHttpClient.execute(CloseableHttpClient.java:106)
	at org.apache.http.impl.client.CloseableHttpClient.execute(CloseableHttpClient.java:57)
	at org.dataone.client.rest.RestClient.doRequest(RestClient.java:294)
	at org.dataone.client.rest.RestClient.doRequestNoBody(RestClient.java:230)
	at org.dataone.client.rest.RestClient.doGetRequest(RestClient.java:148)
	at org.dataone.client.rest.HttpMultipartRestClient.doGetRequest(HttpMultipartRestClient.java:329)
	... 34 more
20151110-08:18:31: [INFO]: **************************************************** [org.dataone.integration.ContextAwareTestCaseDataone]
20151110-08:18:31: [INFO]: ***  context label:   DEV2 [org.dataone.integration.ContextAwareTestCaseDataone]
20151110-08:18:31: [INFO]: **************************************************** [org.dataone.integration.ContextAwareTestCaseDataone]
20151110-08:18:31: [INFO]: **************************************************** [org.dataone.integration.ContextAwareTestCaseDataone]
20151110-08:18:31: [INFO]: Testing update() method ...  [org.dataone.integration.ContextAwareTestCaseDataone]
20151110-08:18:31: [INFO]: Testing update(), Case1 [org.dataone.integration.ContextAwareTestCaseDataone]
20151110-08:18:39: [INFO]: rest call info: GET https://mn-dev-ucsb-1.test.dataone.org/metacat/d1/mn/v2/monitor/ping [org.dataone.client.rest.RestClient]
20151110-08:18:39: [INFO]: MN excluded from test: https://mn-dev-ucsb-1.test.dataone.org/metacat/d1/mn [org.dataone.integration.ContextAwareTestCaseDataone]
20151110-08:18:47: [INFO]: rest call info: GET https://mn-dev-ucsb-2.test.dataone.org/metacat/d1/mn/v2/monitor/ping [org.dataone.client.rest.RestClient]
20151110-08:18:47: [INFO]: MN included in test: https://mn-dev-ucsb-2.test.dataone.org/metacat/d1/mn [org.dataone.integration.ContextAwareTestCaseDataone]
20151110-08:18:47: [INFO]: rest call info: GET https://mn-dev-unm-1.test.dataone.org/metacat/d1/mn/v2/monitor/ping [org.dataone.client.rest.RestClient]
20151110-08:18:47: [INFO]: MN excluded from test: https://mn-dev-unm-1.test.dataone.org/metacat/d1/mn [org.dataone.integration.ContextAwareTestCaseDataone]
20151110-08:18:47: [INFO]: rest call info: GET https://mn-dev-unm-2.test.dataone.org/metacat/d1/mn/v2/monitor/ping [org.dataone.client.rest.RestClient]
20151110-08:18:47: [INFO]: MN included in test: https://mn-dev-unm-2.test.dataone.org/metacat/d1/mn [org.dataone.integration.ContextAwareTestCaseDataone]
20151110-08:18:55: [INFO]: rest call info: GET https://mn-dev-ucsb-2.test.dataone.org/metacat/d1/mn/v2/node [org.dataone.client.rest.RestClient]
20151110-08:18:55: [INFO]: CREATING test object... pid: P1_201531401855430 with a sid: S1_201531401855433 obsoletes: null obsoletedBy: null [org.dataone.integration.ContextAwareTestCaseDataone]
20151110-08:18:55: [INFO]: certificate directory: /etc/dataone/client/testClientCerts/ [org.dataone.integration.ContextAwareTestCaseDataone]
20151110-08:18:55: [INFO]: certificate filename: cnDevUNM2 [org.dataone.integration.ContextAwareTestCaseDataone]
20151110-08:18:55: [INFO]: client setup as Subject: CN=urn:node:cnDevUNM2,DC=dataone,DC=org [org.dataone.integration.ContextAwareTestCaseDataone]
20151110-08:18:55: [INFO]: creating a test object.  pid = P1_201531401855430 on https://mn-dev-ucsb-2.test.dataone.org/metacat/d1/mn/v2 [org.dataone.integration.ContextAwareTestCaseDataone]
20151110-08:18:55: [INFO]: SystemMetadata for pid: P1_201531401855430
<?xml version="1.0" encoding="UTF-8"?><d1_v2.0:systemMetadata xmlns:d1_v2.0="http://ns.dataone.org/service/types/v2.0" xmlns:d1="http://ns.dataone.org/service/types/v1"><serialVersion>1</serialVersion><identifier>P1_201531401855430</identifier><formatId>eml://ecoinformatics.org/eml-2.0.1</formatId><size>17181</size><checksum algorithm="MD5">03ce09c6b4c3efc1681f3023402998a2</checksum><submitter>CN=urn:node:cnDevUNM2,DC=dataone,DC=org</submitter><rightsHolder>CN=testRightsHolder,DC=dataone,DC=org</rightsHolder><accessPolicy><allow><subject>public</subject><permission>read</permission></allow></accessPolicy><dateUploaded>2015-11-10T08:18:55.451+00:00</dateUploaded><dateSysMetadataModified>2015-11-10T08:18:55.451+00:00</dateSysMetadataModified><originMemberNode>urn:node:mnDevUCSB2</originMemberNode><authoritativeMemberNode>urn:node:mnDevUCSB2</authoritativeMemberNode><seriesId>S1_201531401855433</seriesId></d1_v2.0:systemMetadata> [org.dataone.integration.ContextAwareTestCaseDataone]
20151110-08:19:26: [INFO]: rest call info: POST https://mn-dev-ucsb-2.test.dataone.org/metacat/d1/mn/v2/object; MMP message has: ParamPart:pid = P1_201531401855430; FilePart:object = /tmp/mmp.output.819545358325572020.tmp (17181 bytes); FilePart:sysmeta = /tmp/mmp.output.323573524255082980.tmp (940 bytes);  [org.dataone.client.rest.RestClient]
20151110-08:19:26: [INFO]: object created.  pid = P1_201531401855430 [org.dataone.integration.ContextAwareTestCaseDataone]
20151110-08:19:36: [INFO]: Created SID (S1_201531401855433) and head PID (P1_201531401855430) pair. [org.dataone.integration.ContextAwareTestCaseDataone]
20151110-08:20:24: [INFO]: rest call info: PUT https://mn-dev-ucsb-2.test.dataone.org/metacat/d1/mn/v2/archive/P1_201531401855430; MMP entity is null [org.dataone.client.rest.RestClient]
20151110-08:20:24: [INFO]: **************************************************** [org.dataone.integration.ContextAwareTestCaseDataone]
20151110-08:20:24: [INFO]: ***  context label:   DEV2 [org.dataone.integration.ContextAwareTestCaseDataone]
20151110-08:20:24: [INFO]: **************************************************** [org.dataone.integration.ContextAwareTestCaseDataone]
20151110-08:20:24: [INFO]: **************************************************** [org.dataone.integration.ContextAwareTestCaseDataone]
20151110-08:20:24: [INFO]: testSidReuse() method ...  [org.dataone.integration.ContextAwareTestCaseDataone]
20151110-08:20:31: [INFO]: rest call info: GET https://mn-dev-ucsb-1.test.dataone.org/metacat/d1/mn/v2/monitor/ping [org.dataone.client.rest.RestClient]
20151110-08:20:31: [INFO]: MN excluded from test: https://mn-dev-ucsb-1.test.dataone.org/metacat/d1/mn [org.dataone.integration.ContextAwareTestCaseDataone]
20151110-08:20:39: [INFO]: rest call info: GET https://mn-dev-ucsb-2.test.dataone.org/metacat/d1/mn/v2/monitor/ping [org.dataone.client.rest.RestClient]
20151110-08:20:39: [INFO]: MN included in test: https://mn-dev-ucsb-2.test.dataone.org/metacat/d1/mn [org.dataone.integration.ContextAwareTestCaseDataone]
20151110-08:20:39: [INFO]: rest call info: GET https://mn-dev-unm-1.test.dataone.org/metacat/d1/mn/v2/monitor/ping [org.dataone.client.rest.RestClient]
20151110-08:20:39: [INFO]: MN excluded from test: https://mn-dev-unm-1.test.dataone.org/metacat/d1/mn [org.dataone.integration.ContextAwareTestCaseDataone]
20151110-08:20:39: [INFO]: rest call info: GET https://mn-dev-unm-2.test.dataone.org/metacat/d1/mn/v2/monitor/ping [org.dataone.client.rest.RestClient]
20151110-08:20:39: [INFO]: MN included in test: https://mn-dev-unm-2.test.dataone.org/metacat/d1/mn [org.dataone.integration.ContextAwareTestCaseDataone]
20151110-08:20:40: [INFO]: CREATING test object... pid: P1_201531402039995 with a sid: S1_2015314020402 obsoletes: null obsoletedBy: P2_201531402039998 [org.dataone.integration.ContextAwareTestCaseDataone]
20151110-08:20:40: [INFO]: certificate directory: /etc/dataone/client/testClientCerts/ [org.dataone.integration.ContextAwareTestCaseDataone]
20151110-08:20:40: [INFO]: certificate filename: cnDevUNM2 [org.dataone.integration.ContextAwareTestCaseDataone]
20151110-08:20:40: [INFO]: client setup as Subject: CN=urn:node:cnDevUNM2,DC=dataone,DC=org [org.dataone.integration.ContextAwareTestCaseDataone]
20151110-08:20:40: [WARN]: Unable to find a valid authoritative MN to use for the object: org.dataone.service.types.v1.Identifier@660e6657 [org.dataone.integration.ContextAwareTestCaseDataone]
20151110-08:20:40: [INFO]: creating a test object.  pid = P1_201531402039995 on https://mn-dev-ucsb-2.test.dataone.org/metacat/d1/mn/v2 [org.dataone.integration.ContextAwareTestCaseDataone]
20151110-08:20:40: [INFO]: SystemMetadata for pid: P1_201531402039995
<?xml version="1.0" encoding="UTF-8"?><d1_v2.0:systemMetadata xmlns:d1_v2.0="http://ns.dataone.org/service/types/v2.0" xmlns:d1="http://ns.dataone.org/service/types/v1"><serialVersion>1</serialVersion><identifier>P1_201531402039995</identifier><formatId>eml://ecoinformatics.org/eml-2.0.1</formatId><size>17181</size><checksum algorithm="MD5">03ce09c6b4c3efc1681f3023402998a2</checksum><submitter>CN=urn:node:cnDevUNM2,DC=dataone,DC=org</submitter><rightsHolder>CN=testRightsHolder,DC=dataone,DC=org</rightsHolder><accessPolicy><allow><subject>public</subject><permission>read</permission></allow></accessPolicy><dateUploaded>2015-11-10T08:20:40.025+00:00</dateUploaded><dateSysMetadataModified>2015-11-10T08:20:40.025+00:00</dateSysMetadataModified><originMemberNode>bogusAuthoritativeNode</originMemberNode><authoritativeMemberNode>bogusAuthoritativeNode</authoritativeMemberNode><seriesId>S1_2015314020402</seriesId></d1_v2.0:systemMetadata> [org.dataone.integration.ContextAwareTestCaseDataone]
20151110-08:21:15: [INFO]: rest call info: POST https://mn-dev-ucsb-2.test.dataone.org/metacat/d1/mn/v2/object; MMP message has: ParamPart:pid = P1_201531402039995; FilePart:object = /tmp/mmp.output.9178982226604965643.tmp (17181 bytes); FilePart:sysmeta = /tmp/mmp.output.881722622612324982.tmp (944 bytes);  [org.dataone.client.rest.RestClient]
20151110-08:21:15: [INFO]: object created.  pid = P1_201531402039995 [org.dataone.integration.ContextAwareTestCaseDataone]
20151110-08:21:26: [INFO]: UPDATING test object... pid: P1_201531402039995 with pid: P2_201531402039998 with a sid: S2_2015314020405 [org.dataone.integration.ContextAwareTestCaseDataone]
20151110-08:22:03: [INFO]: rest call info: PUT https://mn-dev-ucsb-2.test.dataone.org/metacat/d1/mn/v2/object/P1_201531402039995; MMP message has: ParamPart:newPid = P2_201531402039998; FilePart:object = /tmp/mmp.output.378780899448826220.tmp (17181 bytes); FilePart:sysmeta = /tmp/mmp.output.1511722512629736151.tmp (794 bytes);  [org.dataone.client.rest.RestClient]
20151110-08:22:03: [INFO]: **************************************************** [org.dataone.integration.ContextAwareTestCaseDataone]
20151110-08:22:03: [INFO]: ***  context label:   DEV2 [org.dataone.integration.ContextAwareTestCaseDataone]
20151110-08:22:03: [INFO]: **************************************************** [org.dataone.integration.ContextAwareTestCaseDataone]
20151110-08:22:03: [INFO]: **************************************************** [org.dataone.integration.ContextAwareTestCaseDataone]
20151110-08:22:03: [INFO]: testSidReuseDiffChain() method ...  [org.dataone.integration.ContextAwareTestCaseDataone]
20151110-08:22:11: [INFO]: rest call info: GET https://mn-dev-ucsb-1.test.dataone.org/metacat/d1/mn/v2/monitor/ping [org.dataone.client.rest.RestClient]
20151110-08:22:11: [INFO]: MN excluded from test: https://mn-dev-ucsb-1.test.dataone.org/metacat/d1/mn [org.dataone.integration.ContextAwareTestCaseDataone]
20151110-08:22:19: [INFO]: rest call info: GET https://mn-dev-ucsb-2.test.dataone.org/metacat/d1/mn/v2/monitor/ping [org.dataone.client.rest.RestClient]
20151110-08:22:19: [INFO]: MN included in test: https://mn-dev-ucsb-2.test.dataone.org/metacat/d1/mn [org.dataone.integration.ContextAwareTestCaseDataone]
20151110-08:22:19: [INFO]: rest call info: GET https://mn-dev-unm-1.test.dataone.org/metacat/d1/mn/v2/monitor/ping [org.dataone.client.rest.RestClient]
20151110-08:22:19: [INFO]: MN excluded from test: https://mn-dev-unm-1.test.dataone.org/metacat/d1/mn [org.dataone.integration.ContextAwareTestCaseDataone]
20151110-08:22:19: [INFO]: rest call info: GET https://mn-dev-unm-2.test.dataone.org/metacat/d1/mn/v2/monitor/ping [org.dataone.client.rest.RestClient]
20151110-08:22:19: [INFO]: MN included in test: https://mn-dev-unm-2.test.dataone.org/metacat/d1/mn [org.dataone.integration.ContextAwareTestCaseDataone]
20151110-08:22:19: [INFO]: CREATING test object... pid: P1_201531402219359 with a sid: S1_201531402219368 obsoletes: null obsoletedBy: P2_201531402219361 [org.dataone.integration.ContextAwareTestCaseDataone]
20151110-08:22:19: [INFO]: certificate directory: /etc/dataone/client/testClientCerts/ [org.dataone.integration.ContextAwareTestCaseDataone]
20151110-08:22:19: [INFO]: certificate filename: cnDevUNM2 [org.dataone.integration.ContextAwareTestCaseDataone]
20151110-08:22:19: [INFO]: client setup as Subject: CN=urn:node:cnDevUNM2,DC=dataone,DC=org [org.dataone.integration.ContextAwareTestCaseDataone]
20151110-08:22:19: [WARN]: Unable to find a valid authoritative MN to use for the object: org.dataone.service.types.v1.Identifier@695bd195 [org.dataone.integration.ContextAwareTestCaseDataone]
20151110-08:22:19: [INFO]: creating a test object.  pid = P1_201531402219359 on https://mn-dev-ucsb-2.test.dataone.org/metacat/d1/mn/v2 [org.dataone.integration.ContextAwareTestCaseDataone]
20151110-08:22:19: [INFO]: SystemMetadata for pid: P1_201531402219359
<?xml version="1.0" encoding="UTF-8"?><d1_v2.0:systemMetadata xmlns:d1_v2.0="http://ns.dataone.org/service/types/v2.0" xmlns:d1="http://ns.dataone.org/service/types/v1"><serialVersion>1</serialVersion><identifier>P1_201531402219359</identifier><formatId>eml://ecoinformatics.org/eml-2.0.1</formatId><size>17181</size><checksum algorithm="MD5">03ce09c6b4c3efc1681f3023402998a2</checksum><submitter>CN=urn:node:cnDevUNM2,DC=dataone,DC=org</submitter><rightsHolder>CN=testRightsHolder,DC=dataone,DC=org</rightsHolder><accessPolicy><allow><subject>public</subject><permission>read</permission></allow></accessPolicy><dateUploaded>2015-11-10T08:22:19.391+00:00</dateUploaded><dateSysMetadataModified>2015-11-10T08:22:19.391+00:00</dateSysMetadataModified><originMemberNode>bogusAuthoritativeNode</originMemberNode><authoritativeMemberNode>bogusAuthoritativeNode</authoritativeMemberNode><seriesId>S1_201531402219368</seriesId></d1_v2.0:systemMetadata> [org.dataone.integration.ContextAwareTestCaseDataone]
20151110-08:22:49: [INFO]: rest call info: POST https://mn-dev-ucsb-2.test.dataone.org/metacat/d1/mn/v2/object; MMP message has: ParamPart:pid = P1_201531402219359; FilePart:object = /tmp/mmp.output.6250697795054230266.tmp (17181 bytes); FilePart:sysmeta = /tmp/mmp.output.6565720378374207837.tmp (946 bytes);  [org.dataone.client.rest.RestClient]
20151110-08:22:49: [INFO]: **************************************************** [org.dataone.integration.ContextAwareTestCaseDataone]
20151110-08:22:49: [INFO]: ***  context label:   DEV2 [org.dataone.integration.ContextAwareTestCaseDataone]
20151110-08:22:49: [INFO]: **************************************************** [org.dataone.integration.ContextAwareTestCaseDataone]
20151110-08:22:49: [INFO]: **************************************************** [org.dataone.integration.ContextAwareTestCaseDataone]
20151110-08:22:49: [INFO]: Testing getSystemMetadata() method ...  [org.dataone.integration.ContextAwareTestCaseDataone]
20151110-08:22:49: [INFO]: Testing getSystemMetadata(), Case1 [org.dataone.integration.ContextAwareTestCaseDataone]
20151110-08:22:57: [INFO]: rest call info: GET https://mn-dev-ucsb-1.test.dataone.org/metacat/d1/mn/v2/monitor/ping [org.dataone.client.rest.RestClient]
20151110-08:22:57: [INFO]: MN excluded from test: https://mn-dev-ucsb-1.test.dataone.org/metacat/d1/mn [org.dataone.integration.ContextAwareTestCaseDataone]
20151110-08:23:05: [INFO]: rest call info: GET https://mn-dev-ucsb-2.test.dataone.org/metacat/d1/mn/v2/monitor/ping [org.dataone.client.rest.RestClient]
20151110-08:23:05: [INFO]: MN included in test: https://mn-dev-ucsb-2.test.dataone.org/metacat/d1/mn [org.dataone.integration.ContextAwareTestCaseDataone]
20151110-08:23:05: [INFO]: rest call info: GET https://mn-dev-unm-1.test.dataone.org/metacat/d1/mn/v2/monitor/ping [org.dataone.client.rest.RestClient]
20151110-08:23:05: [INFO]: MN excluded from test: https://mn-dev-unm-1.test.dataone.org/metacat/d1/mn [org.dataone.integration.ContextAwareTestCaseDataone]
20151110-08:23:05: [INFO]: rest call info: GET https://mn-dev-unm-2.test.dataone.org/metacat/d1/mn/v2/monitor/ping [org.dataone.client.rest.RestClient]
20151110-08:23:05: [INFO]: MN included in test: https://mn-dev-unm-2.test.dataone.org/metacat/d1/mn [org.dataone.integration.ContextAwareTestCaseDataone]
20151110-08:23:05: [INFO]: CREATING test object... pid: P1_2015314023583 with a sid: S1_2015314023585 obsoletes: null obsoletedBy: null [org.dataone.integration.ContextAwareTestCaseDataone]
20151110-08:23:05: [INFO]: certificate directory: /etc/dataone/client/testClientCerts/ [org.dataone.integration.ContextAwareTestCaseDataone]
20151110-08:23:05: [INFO]: certificate filename: cnDevUNM2 [org.dataone.integration.ContextAwareTestCaseDataone]
20151110-08:23:05: [INFO]: client setup as Subject: CN=urn:node:cnDevUNM2,DC=dataone,DC=org [org.dataone.integration.ContextAwareTestCaseDataone]
20151110-08:23:05: [WARN]: Unable to find a valid authoritative MN to use for the object: org.dataone.service.types.v1.Identifier@1b045675 [org.dataone.integration.ContextAwareTestCaseDataone]
20151110-08:23:05: [INFO]: creating a test object.  pid = P1_2015314023583 on https://mn-dev-ucsb-2.test.dataone.org/metacat/d1/mn/v2 [org.dataone.integration.ContextAwareTestCaseDataone]
20151110-08:23:05: [INFO]: SystemMetadata for pid: P1_2015314023583
<?xml version="1.0" encoding="UTF-8"?><d1_v2.0:systemMetadata xmlns:d1_v2.0="http://ns.dataone.org/service/types/v2.0" xmlns:d1="http://ns.dataone.org/service/types/v1"><serialVersion>1</serialVersion><identifier>P1_2015314023583</identifier><formatId>eml://ecoinformatics.org/eml-2.0.1</formatId><size>17181</size><checksum algorithm="MD5">03ce09c6b4c3efc1681f3023402998a2</checksum><submitter>CN=urn:node:cnDevUNM2,DC=dataone,DC=org</submitter><rightsHolder>CN=testRightsHolder,DC=dataone,DC=org</rightsHolder><accessPolicy><allow><subject>public</subject><permission>read</permission></allow></accessPolicy><dateUploaded>2015-11-10T08:23:05.103+00:00</dateUploaded><dateSysMetadataModified>2015-11-10T08:23:05.103+00:00</dateSysMetadataModified><originMemberNode>bogusAuthoritativeNode</originMemberNode><authoritativeMemberNode>bogusAuthoritativeNode</authoritativeMemberNode><seriesId>S1_2015314023585</seriesId></d1_v2.0:systemMetadata> [org.dataone.integration.ContextAwareTestCaseDataone]
20151110-08:23:42: [INFO]: rest call info: POST https://mn-dev-ucsb-2.test.dataone.org/metacat/d1/mn/v2/object; MMP message has: ParamPart:pid = P1_2015314023583; FilePart:object = /tmp/mmp.output.2022343489876491128.tmp (17181 bytes); FilePart:sysmeta = /tmp/mmp.output.4321048081626150388.tmp (942 bytes);  [org.dataone.client.rest.RestClient]
java.lang.reflect.InvocationTargetException
	at sun.reflect.NativeMethodAccessorImpl.invoke0(Native Method)
	at sun.reflect.NativeMethodAccessorImpl.invoke(NativeMethodAccessorImpl.java:57)
	at sun.reflect.DelegatingMethodAccessorImpl.invoke(DelegatingMethodAccessorImpl.java:43)
	at java.lang.reflect.Method.invoke(Method.java:606)
	at org.dataone.integration.it.testImplementations.SidCommonTestImplementations.testGetSystemMetadata(SidCommonTestImplementations.java:320)
	at sun.reflect.NativeMethodAccessorImpl.invoke0(Native Method)
	at sun.reflect.NativeMethodAccessorImpl.invoke(NativeMethodAccessorImpl.java:57)
	at sun.reflect.DelegatingMethodAccessorImpl.invoke(DelegatingMethodAccessorImpl.java:43)
	at java.lang.reflect.Method.invoke(Method.java:606)
	at org.junit.runners.model.FrameworkMethod$1.runReflectiveCall(FrameworkMethod.java:44)
	at org.junit.internal.runners.model.ReflectiveCallable.run(ReflectiveCallable.java:15)
	at org.junit.runners.model.FrameworkMethod.invokeExplosively(FrameworkMethod.java:41)
	at org.junit.internal.runners.statements.InvokeMethod.evaluate(InvokeMethod.java:20)
	at org.junit.rules.Verifier$1.evaluate(Verifier.java:34)
	at org.junit.internal.runners.statements.RunBefores.evaluate(RunBefores.java:28)
	at org.junit.runners.BlockJUnit4ClassRunner.runChild(BlockJUnit4ClassRunner.java:76)
	at org.junit.runners.BlockJUnit4ClassRunner.runChild(BlockJUnit4ClassRunner.java:50)
	at org.junit.runners.ParentRunner$3.run(ParentRunner.java:193)
	at org.junit.runners.ParentRunner$1.schedule(ParentRunner.java:52)
	at org.junit.runners.ParentRunner.runChildren(ParentRunner.java:191)
	at org.junit.runners.ParentRunner.access$000(ParentRunner.java:42)
	at org.junit.runners.ParentRunner$2.evaluate(ParentRunner.java:184)
	at org.junit.runners.ParentRunner.run(ParentRunner.java:236)
	at org.apache.maven.surefire.junit4.JUnit4TestSet.execute(JUnit4TestSet.java:53)
	at org.apache.maven.surefire.junit4.JUnit4Provider.executeTestSet(JUnit4Provider.java:119)
	at org.apache.maven.surefire.junit4.JUnit4Provider.invoke(JUnit4Provider.java:101)
	at sun.reflect.NativeMethodAccessorImpl.invoke0(Native Method)
	at sun.reflect.NativeMethodAccessorImpl.invoke(NativeMethodAccessorImpl.java:57)
	at sun.reflect.DelegatingMethodAccessorImpl.invoke(DelegatingMethodAccessorImpl.java:43)
	at java.lang.reflect.Method.invoke(Method.java:606)
	at org.apache.maven.surefire.booter.ProviderFactory$ClassLoaderProxy.invoke(ProviderFactory.java:103)
	at com.sun.proxy.$Proxy0.invoke(Unknown Source)
	at org.apache.maven.surefire.booter.SurefireStarter.invokeProvider(SurefireStarter.java:150)
	at org.apache.maven.surefire.booter.SurefireStarter.runSuitesInProcess(SurefireStarter.java:91)
	at org.apache.maven.surefire.booter.ForkedBooter.main(ForkedBooter.java:69)
Caused by: org.dataone.client.exception.ClientSideException: Unable to create test object!/class org.dataone.client.exception.ClientSideException: /Read timed out
	at org.dataone.integration.ContextAwareTestCaseDataone.createTestObject(ContextAwareTestCaseDataone.java:1472)
	at org.dataone.integration.ContextAwareTestCaseDataone.createTestObject(ContextAwareTestCaseDataone.java:1304)
	at org.dataone.integration.it.testImplementations.SidCommonTestImplementations.createTestObject(SidCommonTestImplementations.java:216)
	at org.dataone.integration.it.testImplementations.SidMNTestImplementations.setupMNCase1(SidMNTestImplementations.java:88)
	... 35 more
Caused by: org.dataone.service.exceptions.ServiceFailure: class org.dataone.client.exception.ClientSideException: /Read timed out
	at org.dataone.client.rest.HttpMultipartRestClient.doPostRequest(HttpMultipartRestClient.java:460)
	at org.dataone.client.v2.impl.MultipartMNode.create(MultipartMNode.java:495)
	at org.dataone.integration.adapters.CommonCallAdapter.create(CommonCallAdapter.java:505)
	at org.dataone.integration.ContextAwareTestCaseDataone.createTestObject(ContextAwareTestCaseDataone.java:1463)
	... 38 more
Caused by: org.dataone.client.exception.ClientSideException: /Read timed out
	... 42 more
Caused by: java.net.SocketTimeoutException: Read timed out
	at java.net.SocketInputStream.socketRead0(Native Method)
	at java.net.SocketInputStream.read(SocketInputStream.java:152)
	at java.net.SocketInputStream.read(SocketInputStream.java:122)
	at sun.security.ssl.InputRecord.readFully(InputRecord.java:442)
	at sun.security.ssl.InputRecord.read(InputRecord.java:480)
	at sun.security.ssl.SSLSocketImpl.readRecord(SSLSocketImpl.java:946)
	at sun.security.ssl.SSLSocketImpl.readDataRecord(SSLSocketImpl.java:903)
	at sun.security.ssl.AppInputStream.read(AppInputStream.java:102)
	at org.apache.http.impl.io.SessionInputBufferImpl.streamRead(SessionInputBufferImpl.java:136)
	at org.apache.http.impl.io.SessionInputBufferImpl.fillBuffer(SessionInputBufferImpl.java:152)
	at org.apache.http.impl.io.SessionInputBufferImpl.readLine(SessionInputBufferImpl.java:270)
	at org.apache.http.impl.conn.DefaultHttpResponseParser.parseHead(DefaultHttpResponseParser.java:140)
	at org.apache.http.impl.conn.DefaultHttpResponseParser.parseHead(DefaultHttpResponseParser.java:57)
	at org.apache.http.impl.io.AbstractMessageParser.parse(AbstractMessageParser.java:260)
	at org.apache.http.impl.DefaultBHttpClientConnection.receiveResponseHeader(DefaultBHttpClientConnection.java:161)
	at sun.reflect.GeneratedMethodAccessor9.invoke(Unknown Source)
	at sun.reflect.DelegatingMethodAccessorImpl.invoke(DelegatingMethodAccessorImpl.java:43)
	at java.lang.reflect.Method.invoke(Method.java:606)
	at org.apache.http.impl.conn.CPoolProxy.invoke(CPoolProxy.java:138)
	at com.sun.proxy.$Proxy9.receiveResponseHeader(Unknown Source)
	at org.apache.http.protocol.HttpRequestExecutor.doReceiveResponse(HttpRequestExecutor.java:271)
	at org.apache.http.protocol.HttpRequestExecutor.execute(HttpRequestExecutor.java:123)
	at org.apache.http.impl.execchain.MainClientExec.execute(MainClientExec.java:254)
	at org.apache.http.impl.execchain.ProtocolExec.execute(ProtocolExec.java:195)
	at org.apache.http.impl.execchain.RetryExec.execute(RetryExec.java:86)
	at org.apache.http.impl.execchain.RedirectExec.execute(RedirectExec.java:108)
	at org.apache.http.impl.client.InternalHttpClient.doExecute(InternalHttpClient.java:186)
	at org.apache.http.impl.client.CloseableHttpClient.execute(CloseableHttpClient.java:82)
	at org.apache.http.impl.client.CloseableHttpClient.execute(CloseableHttpClient.java:106)
	at org.apache.http.impl.client.CloseableHttpClient.execute(CloseableHttpClient.java:57)
	at org.dataone.client.rest.RestClient.doRequest(RestClient.java:294)
	at org.dataone.client.rest.RestClient.doRequestMMBody(RestClient.java:272)
	at org.dataone.client.rest.RestClient.doPostRequest(RestClient.java:192)
	at org.dataone.client.rest.HttpMultipartRestClient.doPostRequest(HttpMultipartRestClient.java:453)
	... 41 more
20151110-08:23:42: [INFO]: CREATING test object... pid: P1_201531402342961 with a sid: S1_201531402342963 obsoletes: null obsoletedBy: null [org.dataone.integration.ContextAwareTestCaseDataone]
20151110-08:23:42: [INFO]: certificate directory: /etc/dataone/client/testClientCerts/ [org.dataone.integration.ContextAwareTestCaseDataone]
20151110-08:23:42: [INFO]: certificate filename: cnDevUNM2 [org.dataone.integration.ContextAwareTestCaseDataone]
20151110-08:23:42: [INFO]: client setup as Subject: CN=urn:node:cnDevUNM2,DC=dataone,DC=org [org.dataone.integration.ContextAwareTestCaseDataone]
20151110-08:23:42: [WARN]: Unable to find a valid authoritative MN to use for the object: org.dataone.service.types.v1.Identifier@6b37d8bb [org.dataone.integration.ContextAwareTestCaseDataone]
20151110-08:23:42: [INFO]: creating a test object.  pid = P1_201531402342961 on https://mn-dev-unm-2.test.dataone.org/metacat/d1/mn/v2 [org.dataone.integration.ContextAwareTestCaseDataone]
20151110-08:23:42: [INFO]: SystemMetadata for pid: P1_201531402342961
<?xml version="1.0" encoding="UTF-8"?><d1_v2.0:systemMetadata xmlns:d1_v2.0="http://ns.dataone.org/service/types/v2.0" xmlns:d1="http://ns.dataone.org/service/types/v1"><serialVersion>1</serialVersion><identifier>P1_201531402342961</identifier><formatId>eml://ecoinformatics.org/eml-2.0.1</formatId><size>17181</size><checksum algorithm="MD5">03ce09c6b4c3efc1681f3023402998a2</checksum><submitter>CN=urn:node:cnDevUNM2,DC=dataone,DC=org</submitter><rightsHolder>CN=testRightsHolder,DC=dataone,DC=org</rightsHolder><accessPolicy><allow><subject>public</subject><permission>read</permission></allow></accessPolicy><dateUploaded>2015-11-10T08:23:42.981+00:00</dateUploaded><dateSysMetadataModified>2015-11-10T08:23:42.981+00:00</dateSysMetadataModified><originMemberNode>bogusAuthoritativeNode</originMemberNode><authoritativeMemberNode>bogusAuthoritativeNode</authoritativeMemberNode><seriesId>S1_201531402342963</seriesId></d1_v2.0:systemMetadata> [org.dataone.integration.ContextAwareTestCaseDataone]
20151110-08:23:43: [INFO]: rest call info: POST https://mn-dev-unm-2.test.dataone.org/metacat/d1/mn/v2/object; MMP message has: ParamPart:pid = P1_201531402342961; FilePart:object = /tmp/mmp.output.6639237832384987934.tmp (17181 bytes); FilePart:sysmeta = /tmp/mmp.output.3185689648829537162.tmp (946 bytes);  [org.dataone.client.rest.RestClient]
20151110-08:23:43: [INFO]: object created.  pid = P1_201531402342961 [org.dataone.integration.ContextAwareTestCaseDataone]
20151110-08:23:53: [INFO]: Created SID (S1_201531402342963) and head PID (P1_201531402342961) pair. [org.dataone.integration.ContextAwareTestCaseDataone]
20151110-08:24:04: [INFO]: rest call info: GET https://mn-dev-unm-2.test.dataone.org/metacat/d1/mn/v2/meta/S1_201531402342963 [org.dataone.client.rest.RestClient]
20151110-08:24:04: [INFO]: **************************************************** [org.dataone.integration.ContextAwareTestCaseDataone]
20151110-08:24:04: [INFO]: ***  context label:   DEV2 [org.dataone.integration.ContextAwareTestCaseDataone]
20151110-08:24:04: [INFO]: **************************************************** [org.dataone.integration.ContextAwareTestCaseDataone]
20151110-08:24:04: [INFO]: **************************************************** [org.dataone.integration.ContextAwareTestCaseDataone]
20151110-08:24:04: [INFO]: Testing get() method ...  [org.dataone.integration.ContextAwareTestCaseDataone]
20151110-08:24:04: [INFO]: Testing get(), Case1 [org.dataone.integration.ContextAwareTestCaseDataone]
20151110-08:24:11: [INFO]: rest call info: GET https://mn-dev-ucsb-1.test.dataone.org/metacat/d1/mn/v2/monitor/ping [org.dataone.client.rest.RestClient]
20151110-08:24:11: [INFO]: MN excluded from test: https://mn-dev-ucsb-1.test.dataone.org/metacat/d1/mn [org.dataone.integration.ContextAwareTestCaseDataone]
20151110-08:24:19: [INFO]: rest call info: GET https://mn-dev-ucsb-2.test.dataone.org/metacat/d1/mn/v2/monitor/ping [org.dataone.client.rest.RestClient]
20151110-08:24:19: [INFO]: MN included in test: https://mn-dev-ucsb-2.test.dataone.org/metacat/d1/mn [org.dataone.integration.ContextAwareTestCaseDataone]
20151110-08:24:19: [INFO]: rest call info: GET https://mn-dev-unm-1.test.dataone.org/metacat/d1/mn/v2/monitor/ping [org.dataone.client.rest.RestClient]
20151110-08:24:19: [INFO]: MN excluded from test: https://mn-dev-unm-1.test.dataone.org/metacat/d1/mn [org.dataone.integration.ContextAwareTestCaseDataone]
20151110-08:24:19: [INFO]: rest call info: GET https://mn-dev-unm-2.test.dataone.org/metacat/d1/mn/v2/monitor/ping [org.dataone.client.rest.RestClient]
20151110-08:24:19: [INFO]: MN included in test: https://mn-dev-unm-2.test.dataone.org/metacat/d1/mn [org.dataone.integration.ContextAwareTestCaseDataone]
20151110-08:24:19: [INFO]: CREATING test object... pid: P1_201531402419733 with a sid: S1_201531402419736 obsoletes: null obsoletedBy: null [org.dataone.integration.ContextAwareTestCaseDataone]
20151110-08:24:19: [INFO]: certificate directory: /etc/dataone/client/testClientCerts/ [org.dataone.integration.ContextAwareTestCaseDataone]
20151110-08:24:19: [INFO]: certificate filename: cnDevUNM2 [org.dataone.integration.ContextAwareTestCaseDataone]
20151110-08:24:19: [INFO]: client setup as Subject: CN=urn:node:cnDevUNM2,DC=dataone,DC=org [org.dataone.integration.ContextAwareTestCaseDataone]
20151110-08:24:19: [WARN]: Unable to find a valid authoritative MN to use for the object: org.dataone.service.types.v1.Identifier@6cc59193 [org.dataone.integration.ContextAwareTestCaseDataone]
20151110-08:24:19: [INFO]: creating a test object.  pid = P1_201531402419733 on https://mn-dev-ucsb-2.test.dataone.org/metacat/d1/mn/v2 [org.dataone.integration.ContextAwareTestCaseDataone]
20151110-08:24:19: [INFO]: SystemMetadata for pid: P1_201531402419733
<?xml version="1.0" encoding="UTF-8"?><d1_v2.0:systemMetadata xmlns:d1_v2.0="http://ns.dataone.org/service/types/v2.0" xmlns:d1="http://ns.dataone.org/service/types/v1"><serialVersion>1</serialVersion><identifier>P1_201531402419733</identifier><formatId>eml://ecoinformatics.org/eml-2.0.1</formatId><size>17181</size><checksum algorithm="MD5">03ce09c6b4c3efc1681f3023402998a2</checksum><submitter>CN=urn:node:cnDevUNM2,DC=dataone,DC=org</submitter><rightsHolder>CN=testRightsHolder,DC=dataone,DC=org</rightsHolder><accessPolicy><allow><subject>public</subject><permission>read</permission></allow></accessPolicy><dateUploaded>2015-11-10T08:24:19.753+00:00</dateUploaded><dateSysMetadataModified>2015-11-10T08:24:19.753+00:00</dateSysMetadataModified><originMemberNode>bogusAuthoritativeNode</originMemberNode><authoritativeMemberNode>bogusAuthoritativeNode</authoritativeMemberNode><seriesId>S1_201531402419736</seriesId></d1_v2.0:systemMetadata> [org.dataone.integration.ContextAwareTestCaseDataone]
20151110-08:24:57: [INFO]: rest call info: POST https://mn-dev-ucsb-2.test.dataone.org/metacat/d1/mn/v2/object; MMP message has: ParamPart:pid = P1_201531402419733; FilePart:object = /tmp/mmp.output.2475285803029210417.tmp (17181 bytes); FilePart:sysmeta = /tmp/mmp.output.1064969376056699603.tmp (946 bytes);  [org.dataone.client.rest.RestClient]
java.lang.reflect.InvocationTargetException
	at sun.reflect.NativeMethodAccessorImpl.invoke0(Native Method)
	at sun.reflect.NativeMethodAccessorImpl.invoke(NativeMethodAccessorImpl.java:57)
	at sun.reflect.DelegatingMethodAccessorImpl.invoke(DelegatingMethodAccessorImpl.java:43)
	at java.lang.reflect.Method.invoke(Method.java:606)
	at org.dataone.integration.it.testImplementations.SidCommonTestImplementations.testGet(SidCommonTestImplementations.java:369)
	at sun.reflect.NativeMethodAccessorImpl.invoke0(Native Method)
	at sun.reflect.NativeMethodAccessorImpl.invoke(NativeMethodAccessorImpl.java:57)
	at sun.reflect.DelegatingMethodAccessorImpl.invoke(DelegatingMethodAccessorImpl.java:43)
	at java.lang.reflect.Method.invoke(Method.java:606)
	at org.junit.runners.model.FrameworkMethod$1.runReflectiveCall(FrameworkMethod.java:44)
	at org.junit.internal.runners.model.ReflectiveCallable.run(ReflectiveCallable.java:15)
	at org.junit.runners.model.FrameworkMethod.invokeExplosively(FrameworkMethod.java:41)
	at org.junit.internal.runners.statements.InvokeMethod.evaluate(InvokeMethod.java:20)
	at org.junit.rules.Verifier$1.evaluate(Verifier.java:34)
	at org.junit.internal.runners.statements.RunBefores.evaluate(RunBefores.java:28)
	at org.junit.runners.BlockJUnit4ClassRunner.runChild(BlockJUnit4ClassRunner.java:76)
	at org.junit.runners.BlockJUnit4ClassRunner.runChild(BlockJUnit4ClassRunner.java:50)
	at org.junit.runners.ParentRunner$3.run(ParentRunner.java:193)
	at org.junit.runners.ParentRunner$1.schedule(ParentRunner.java:52)
	at org.junit.runners.ParentRunner.runChildren(ParentRunner.java:191)
	at org.junit.runners.ParentRunner.access$000(ParentRunner.java:42)
	at org.junit.runners.ParentRunner$2.evaluate(ParentRunner.java:184)
	at org.junit.runners.ParentRunner.run(ParentRunner.java:236)
	at org.apache.maven.surefire.junit4.JUnit4TestSet.execute(JUnit4TestSet.java:53)
	at org.apache.maven.surefire.junit4.JUnit4Provider.executeTestSet(JUnit4Provider.java:119)
	at org.apache.maven.surefire.junit4.JUnit4Provider.invoke(JUnit4Provider.java:101)
	at sun.reflect.NativeMethodAccessorImpl.invoke0(Native Method)
	at sun.reflect.NativeMethodAccessorImpl.invoke(NativeMethodAccessorImpl.java:57)
	at sun.reflect.DelegatingMethodAccessorImpl.invoke(DelegatingMethodAccessorImpl.java:43)
	at java.lang.reflect.Method.invoke(Method.java:606)
	at org.apache.maven.surefire.booter.ProviderFactory$ClassLoaderProxy.invoke(ProviderFactory.java:103)
	at com.sun.proxy.$Proxy0.invoke(Unknown Source)
	at org.apache.maven.surefire.booter.SurefireStarter.invokeProvider(SurefireStarter.java:150)
	at org.apache.maven.surefire.booter.SurefireStarter.runSuitesInProcess(SurefireStarter.java:91)
	at org.apache.maven.surefire.booter.ForkedBooter.main(ForkedBooter.java:69)
Caused by: org.dataone.client.exception.ClientSideException: Unable to create test object!/class org.dataone.client.exception.ClientSideException: /Read timed out
	at org.dataone.integration.ContextAwareTestCaseDataone.createTestObject(ContextAwareTestCaseDataone.java:1472)
	at org.dataone.integration.ContextAwareTestCaseDataone.createTestObject(ContextAwareTestCaseDataone.java:1304)
	at org.dataone.integration.it.testImplementations.SidCommonTestImplementations.createTestObject(SidCommonTestImplementations.java:216)
	at org.dataone.integration.it.testImplementations.SidMNTestImplementations.setupMNCase1(SidMNTestImplementations.java:88)
	... 35 more
Caused by: org.dataone.service.exceptions.ServiceFailure: class org.dataone.client.exception.ClientSideException: /Read timed out
	at org.dataone.client.rest.HttpMultipartRestClient.doPostRequest(HttpMultipartRestClient.java:460)
	at org.dataone.client.v2.impl.MultipartMNode.create(MultipartMNode.java:495)
	at org.dataone.integration.adapters.CommonCallAdapter.create(CommonCallAdapter.java:505)
	at org.dataone.integration.ContextAwareTestCaseDataone.createTestObject(ContextAwareTestCaseDataone.java:1463)
	... 38 more
Caused by: org.dataone.client.exception.ClientSideException: /Read timed out
	... 42 more
Caused by: java.net.SocketTimeoutException: Read timed out
	at java.net.SocketInputStream.socketRead0(Native Method)
	at java.net.SocketInputStream.read(SocketInputStream.java:152)
	at java.net.SocketInputStream.read(SocketInputStream.java:122)
	at sun.security.ssl.InputRecord.readFully(InputRecord.java:442)
	at sun.security.ssl.InputRecord.read(InputRecord.java:480)
	at sun.security.ssl.SSLSocketImpl.readRecord(SSLSocketImpl.java:946)
	at sun.security.ssl.SSLSocketImpl.readDataRecord(SSLSocketImpl.java:903)
	at sun.security.ssl.AppInputStream.read(AppInputStream.java:102)
	at org.apache.http.impl.io.SessionInputBufferImpl.streamRead(SessionInputBufferImpl.java:136)
	at org.apache.http.impl.io.SessionInputBufferImpl.fillBuffer(SessionInputBufferImpl.java:152)
	at org.apache.http.impl.io.SessionInputBufferImpl.readLine(SessionInputBufferImpl.java:270)
	at org.apache.http.impl.conn.DefaultHttpResponseParser.parseHead(DefaultHttpResponseParser.java:140)
	at org.apache.http.impl.conn.DefaultHttpResponseParser.parseHead(DefaultHttpResponseParser.java:57)
	at org.apache.http.impl.io.AbstractMessageParser.parse(AbstractMessageParser.java:260)
	at org.apache.http.impl.DefaultBHttpClientConnection.receiveResponseHeader(DefaultBHttpClientConnection.java:161)
	at sun.reflect.GeneratedMethodAccessor9.invoke(Unknown Source)
	at sun.reflect.DelegatingMethodAccessorImpl.invoke(DelegatingMethodAccessorImpl.java:43)
	at java.lang.reflect.Method.invoke(Method.java:606)
	at org.apache.http.impl.conn.CPoolProxy.invoke(CPoolProxy.java:138)
	at com.sun.proxy.$Proxy9.receiveResponseHeader(Unknown Source)
	at org.apache.http.protocol.HttpRequestExecutor.doReceiveResponse(HttpRequestExecutor.java:271)
	at org.apache.http.protocol.HttpRequestExecutor.execute(HttpRequestExecutor.java:123)
	at org.apache.http.impl.execchain.MainClientExec.execute(MainClientExec.java:254)
	at org.apache.http.impl.execchain.ProtocolExec.execute(ProtocolExec.java:195)
	at org.apache.http.impl.execchain.RetryExec.execute(RetryExec.java:86)
	at org.apache.http.impl.execchain.RedirectExec.execute(RedirectExec.java:108)
	at org.apache.http.impl.client.InternalHttpClient.doExecute(InternalHttpClient.java:186)
	at org.apache.http.impl.client.CloseableHttpClient.execute(CloseableHttpClient.java:82)
	at org.apache.http.impl.client.CloseableHttpClient.execute(CloseableHttpClient.java:106)
	at org.apache.http.impl.client.CloseableHttpClient.execute(CloseableHttpClient.java:57)
	at org.dataone.client.rest.RestClient.doRequest(RestClient.java:294)
	at org.dataone.client.rest.RestClient.doRequestMMBody(RestClient.java:272)
	at org.dataone.client.rest.RestClient.doPostRequest(RestClient.java:192)
	at org.dataone.client.rest.HttpMultipartRestClient.doPostRequest(HttpMultipartRestClient.java:453)
	... 41 more
20151110-08:24:57: [INFO]: CREATING test object... pid: P1_201531402457579 with a sid: S1_201531402457581 obsoletes: null obsoletedBy: null [org.dataone.integration.ContextAwareTestCaseDataone]
20151110-08:24:57: [INFO]: certificate directory: /etc/dataone/client/testClientCerts/ [org.dataone.integration.ContextAwareTestCaseDataone]
20151110-08:24:57: [INFO]: certificate filename: cnDevUNM2 [org.dataone.integration.ContextAwareTestCaseDataone]
20151110-08:24:57: [INFO]: client setup as Subject: CN=urn:node:cnDevUNM2,DC=dataone,DC=org [org.dataone.integration.ContextAwareTestCaseDataone]
20151110-08:24:57: [WARN]: Unable to find a valid authoritative MN to use for the object: org.dataone.service.types.v1.Identifier@6cfcffd9 [org.dataone.integration.ContextAwareTestCaseDataone]
20151110-08:24:57: [INFO]: creating a test object.  pid = P1_201531402457579 on https://mn-dev-unm-2.test.dataone.org/metacat/d1/mn/v2 [org.dataone.integration.ContextAwareTestCaseDataone]
20151110-08:24:57: [INFO]: SystemMetadata for pid: P1_201531402457579
<?xml version="1.0" encoding="UTF-8"?><d1_v2.0:systemMetadata xmlns:d1_v2.0="http://ns.dataone.org/service/types/v2.0" xmlns:d1="http://ns.dataone.org/service/types/v1"><serialVersion>1</serialVersion><identifier>P1_201531402457579</identifier><formatId>eml://ecoinformatics.org/eml-2.0.1</formatId><size>17181</size><checksum algorithm="MD5">03ce09c6b4c3efc1681f3023402998a2</checksum><submitter>CN=urn:node:cnDevUNM2,DC=dataone,DC=org</submitter><rightsHolder>CN=testRightsHolder,DC=dataone,DC=org</rightsHolder><accessPolicy><allow><subject>public</subject><permission>read</permission></allow></accessPolicy><dateUploaded>2015-11-10T08:24:57.598+00:00</dateUploaded><dateSysMetadataModified>2015-11-10T08:24:57.598+00:00</dateSysMetadataModified><originMemberNode>bogusAuthoritativeNode</originMemberNode><authoritativeMemberNode>bogusAuthoritativeNode</authoritativeMemberNode><seriesId>S1_201531402457581</seriesId></d1_v2.0:systemMetadata> [org.dataone.integration.ContextAwareTestCaseDataone]
20151110-08:24:58: [INFO]: rest call info: POST https://mn-dev-unm-2.test.dataone.org/metacat/d1/mn/v2/object; MMP message has: ParamPart:pid = P1_201531402457579; FilePart:object = /tmp/mmp.output.8948968048519536585.tmp (17181 bytes); FilePart:sysmeta = /tmp/mmp.output.7296620319936904196.tmp (946 bytes);  [org.dataone.client.rest.RestClient]
20151110-08:24:58: [INFO]: object created.  pid = P1_201531402457579 [org.dataone.integration.ContextAwareTestCaseDataone]
20151110-08:25:08: [INFO]: Created SID (S1_201531402457581) and head PID (P1_201531402457579) pair. [org.dataone.integration.ContextAwareTestCaseDataone]
20151110-08:25:08: [INFO]: rest call info: GET https://mn-dev-unm-2.test.dataone.org/metacat/d1/mn/v2/object/S1_201531402457581 [org.dataone.client.rest.RestClient]
20151110-08:25:09: [INFO]: rest call info: GET https://mn-dev-unm-2.test.dataone.org/metacat/d1/mn/v2/object/P1_201531402457579 [org.dataone.client.rest.RestClient]
20151110-08:25:09: [INFO]: **************************************************** [org.dataone.integration.ContextAwareTestCaseDataone]
20151110-08:25:09: [INFO]: ***  context label:   DEV2 [org.dataone.integration.ContextAwareTestCaseDataone]
20151110-08:25:09: [INFO]: **************************************************** [org.dataone.integration.ContextAwareTestCaseDataone]
20151110-08:25:09: [INFO]: **************************************************** [org.dataone.integration.ContextAwareTestCaseDataone]
20151110-08:25:09: [INFO]: Testing describe() method ...  [org.dataone.integration.ContextAwareTestCaseDataone]
20151110-08:25:09: [INFO]: Testing describe(), Case1 [org.dataone.integration.ContextAwareTestCaseDataone]
20151110-08:25:16: [INFO]: rest call info: GET https://mn-dev-ucsb-1.test.dataone.org/metacat/d1/mn/v2/monitor/ping [org.dataone.client.rest.RestClient]
20151110-08:25:16: [INFO]: MN excluded from test: https://mn-dev-ucsb-1.test.dataone.org/metacat/d1/mn [org.dataone.integration.ContextAwareTestCaseDataone]
20151110-08:25:24: [INFO]: rest call info: GET https://mn-dev-ucsb-2.test.dataone.org/metacat/d1/mn/v2/monitor/ping [org.dataone.client.rest.RestClient]
20151110-08:25:24: [INFO]: MN included in test: https://mn-dev-ucsb-2.test.dataone.org/metacat/d1/mn [org.dataone.integration.ContextAwareTestCaseDataone]
20151110-08:25:24: [INFO]: rest call info: GET https://mn-dev-unm-1.test.dataone.org/metacat/d1/mn/v2/monitor/ping [org.dataone.client.rest.RestClient]
20151110-08:25:24: [INFO]: MN excluded from test: https://mn-dev-unm-1.test.dataone.org/metacat/d1/mn [org.dataone.integration.ContextAwareTestCaseDataone]
20151110-08:25:24: [INFO]: rest call info: GET https://mn-dev-unm-2.test.dataone.org/metacat/d1/mn/v2/monitor/ping [org.dataone.client.rest.RestClient]
20151110-08:25:24: [INFO]: MN included in test: https://mn-dev-unm-2.test.dataone.org/metacat/d1/mn [org.dataone.integration.ContextAwareTestCaseDataone]
20151110-08:25:24: [INFO]: CREATING test object... pid: P1_201531402524619 with a sid: S1_201531402524621 obsoletes: null obsoletedBy: null [org.dataone.integration.ContextAwareTestCaseDataone]
20151110-08:25:24: [INFO]: certificate directory: /etc/dataone/client/testClientCerts/ [org.dataone.integration.ContextAwareTestCaseDataone]
20151110-08:25:24: [INFO]: certificate filename: cnDevUNM2 [org.dataone.integration.ContextAwareTestCaseDataone]
20151110-08:25:24: [INFO]: client setup as Subject: CN=urn:node:cnDevUNM2,DC=dataone,DC=org [org.dataone.integration.ContextAwareTestCaseDataone]
20151110-08:25:24: [WARN]: Unable to find a valid authoritative MN to use for the object: org.dataone.service.types.v1.Identifier@6e8637df [org.dataone.integration.ContextAwareTestCaseDataone]
20151110-08:25:24: [INFO]: creating a test object.  pid = P1_201531402524619 on https://mn-dev-ucsb-2.test.dataone.org/metacat/d1/mn/v2 [org.dataone.integration.ContextAwareTestCaseDataone]
20151110-08:25:24: [INFO]: SystemMetadata for pid: P1_201531402524619
<?xml version="1.0" encoding="UTF-8"?><d1_v2.0:systemMetadata xmlns:d1_v2.0="http://ns.dataone.org/service/types/v2.0" xmlns:d1="http://ns.dataone.org/service/types/v1"><serialVersion>1</serialVersion><identifier>P1_201531402524619</identifier><formatId>eml://ecoinformatics.org/eml-2.0.1</formatId><size>17181</size><checksum algorithm="MD5">03ce09c6b4c3efc1681f3023402998a2</checksum><submitter>CN=urn:node:cnDevUNM2,DC=dataone,DC=org</submitter><rightsHolder>CN=testRightsHolder,DC=dataone,DC=org</rightsHolder><accessPolicy><allow><subject>public</subject><permission>read</permission></allow></accessPolicy><dateUploaded>2015-11-10T08:25:24.637+00:00</dateUploaded><dateSysMetadataModified>2015-11-10T08:25:24.637+00:00</dateSysMetadataModified><originMemberNode>bogusAuthoritativeNode</originMemberNode><authoritativeMemberNode>bogusAuthoritativeNode</authoritativeMemberNode><seriesId>S1_201531402524621</seriesId></d1_v2.0:systemMetadata> [org.dataone.integration.ContextAwareTestCaseDataone]
20151110-08:26:02: [INFO]: rest call info: POST https://mn-dev-ucsb-2.test.dataone.org/metacat/d1/mn/v2/object; MMP message has: ParamPart:pid = P1_201531402524619; FilePart:object = /tmp/mmp.output.1020358950585330974.tmp (17181 bytes); FilePart:sysmeta = /tmp/mmp.output.4144709511421203695.tmp (946 bytes);  [org.dataone.client.rest.RestClient]
java.lang.reflect.InvocationTargetException
	at sun.reflect.NativeMethodAccessorImpl.invoke0(Native Method)
	at sun.reflect.NativeMethodAccessorImpl.invoke(NativeMethodAccessorImpl.java:57)
	at sun.reflect.DelegatingMethodAccessorImpl.invoke(DelegatingMethodAccessorImpl.java:43)
	at java.lang.reflect.Method.invoke(Method.java:606)
	at org.dataone.integration.it.testImplementations.SidCommonTestImplementations.testDescribe(SidCommonTestImplementations.java:416)
	at sun.reflect.NativeMethodAccessorImpl.invoke0(Native Method)
	at sun.reflect.NativeMethodAccessorImpl.invoke(NativeMethodAccessorImpl.java:57)
	at sun.reflect.DelegatingMethodAccessorImpl.invoke(DelegatingMethodAccessorImpl.java:43)
	at java.lang.reflect.Method.invoke(Method.java:606)
	at org.junit.runners.model.FrameworkMethod$1.runReflectiveCall(FrameworkMethod.java:44)
	at org.junit.internal.runners.model.ReflectiveCallable.run(ReflectiveCallable.java:15)
	at org.junit.runners.model.FrameworkMethod.invokeExplosively(FrameworkMethod.java:41)
	at org.junit.internal.runners.statements.InvokeMethod.evaluate(InvokeMethod.java:20)
	at org.junit.rules.Verifier$1.evaluate(Verifier.java:34)
	at org.junit.internal.runners.statements.RunBefores.evaluate(RunBefores.java:28)
	at org.junit.runners.BlockJUnit4ClassRunner.runChild(BlockJUnit4ClassRunner.java:76)
	at org.junit.runners.BlockJUnit4ClassRunner.runChild(BlockJUnit4ClassRunner.java:50)
	at org.junit.runners.ParentRunner$3.run(ParentRunner.java:193)
	at org.junit.runners.ParentRunner$1.schedule(ParentRunner.java:52)
	at org.junit.runners.ParentRunner.runChildren(ParentRunner.java:191)
	at org.junit.runners.ParentRunner.access$000(ParentRunner.java:42)
	at org.junit.runners.ParentRunner$2.evaluate(ParentRunner.java:184)
	at org.junit.runners.ParentRunner.run(ParentRunner.java:236)
	at org.apache.maven.surefire.junit4.JUnit4TestSet.execute(JUnit4TestSet.java:53)
	at org.apache.maven.surefire.junit4.JUnit4Provider.executeTestSet(JUnit4Provider.java:119)
	at org.apache.maven.surefire.junit4.JUnit4Provider.invoke(JUnit4Provider.java:101)
	at sun.reflect.NativeMethodAccessorImpl.invoke0(Native Method)
	at sun.reflect.NativeMethodAccessorImpl.invoke(NativeMethodAccessorImpl.java:57)
	at sun.reflect.DelegatingMethodAccessorImpl.invoke(DelegatingMethodAccessorImpl.java:43)
	at java.lang.reflect.Method.invoke(Method.java:606)
	at org.apache.maven.surefire.booter.ProviderFactory$ClassLoaderProxy.invoke(ProviderFactory.java:103)
	at com.sun.proxy.$Proxy0.invoke(Unknown Source)
	at org.apache.maven.surefire.booter.SurefireStarter.invokeProvider(SurefireStarter.java:150)
	at org.apache.maven.surefire.booter.SurefireStarter.runSuitesInProcess(SurefireStarter.java:91)
	at org.apache.maven.surefire.booter.ForkedBooter.main(ForkedBooter.java:69)
Caused by: org.dataone.client.exception.ClientSideException: Unable to create test object!/class org.dataone.client.exception.ClientSideException: /Read timed out
	at org.dataone.integration.ContextAwareTestCaseDataone.createTestObject(ContextAwareTestCaseDataone.java:1472)
	at org.dataone.integration.ContextAwareTestCaseDataone.createTestObject(ContextAwareTestCaseDataone.java:1304)
	at org.dataone.integration.it.testImplementations.SidCommonTestImplementations.createTestObject(SidCommonTestImplementations.java:216)
	at org.dataone.integration.it.testImplementations.SidMNTestImplementations.setupMNCase1(SidMNTestImplementations.java:88)
	... 35 more
Caused by: org.dataone.service.exceptions.ServiceFailure: class org.dataone.client.exception.ClientSideException: /Read timed out
	at org.dataone.client.rest.HttpMultipartRestClient.doPostRequest(HttpMultipartRestClient.java:460)
	at org.dataone.client.v2.impl.MultipartMNode.create(MultipartMNode.java:495)
	at org.dataone.integration.adapters.CommonCallAdapter.create(CommonCallAdapter.java:505)
	at org.dataone.integration.ContextAwareTestCaseDataone.createTestObject(ContextAwareTestCaseDataone.java:1463)
	... 38 more
Caused by: org.dataone.client.exception.ClientSideException: /Read timed out
	... 42 more
Caused by: java.net.SocketTimeoutException: Read timed out
	at java.net.SocketInputStream.socketRead0(Native Method)
	at java.net.SocketInputStream.read(SocketInputStream.java:152)
	at java.net.SocketInputStream.read(SocketInputStream.java:122)
	at sun.security.ssl.InputRecord.readFully(InputRecord.java:442)
	at sun.security.ssl.InputRecord.read(InputRecord.java:480)
	at sun.security.ssl.SSLSocketImpl.readRecord(SSLSocketImpl.java:946)
	at sun.security.ssl.SSLSocketImpl.readDataRecord(SSLSocketImpl.java:903)
	at sun.security.ssl.AppInputStream.read(AppInputStream.java:102)
	at org.apache.http.impl.io.SessionInputBufferImpl.streamRead(SessionInputBufferImpl.java:136)
	at org.apache.http.impl.io.SessionInputBufferImpl.fillBuffer(SessionInputBufferImpl.java:152)
	at org.apache.http.impl.io.SessionInputBufferImpl.readLine(SessionInputBufferImpl.java:270)
	at org.apache.http.impl.conn.DefaultHttpResponseParser.parseHead(DefaultHttpResponseParser.java:140)
	at org.apache.http.impl.conn.DefaultHttpResponseParser.parseHead(DefaultHttpResponseParser.java:57)
	at org.apache.http.impl.io.AbstractMessageParser.parse(AbstractMessageParser.java:260)
	at org.apache.http.impl.DefaultBHttpClientConnection.receiveResponseHeader(DefaultBHttpClientConnection.java:161)
	at sun.reflect.GeneratedMethodAccessor9.invoke(Unknown Source)
	at sun.reflect.DelegatingMethodAccessorImpl.invoke(DelegatingMethodAccessorImpl.java:43)
	at java.lang.reflect.Method.invoke(Method.java:606)
	at org.apache.http.impl.conn.CPoolProxy.invoke(CPoolProxy.java:138)
	at com.sun.proxy.$Proxy9.receiveResponseHeader(Unknown Source)
	at org.apache.http.protocol.HttpRequestExecutor.doReceiveResponse(HttpRequestExecutor.java:271)
	at org.apache.http.protocol.HttpRequestExecutor.execute(HttpRequestExecutor.java:123)
	at org.apache.http.impl.execchain.MainClientExec.execute(MainClientExec.java:254)
	at org.apache.http.impl.execchain.ProtocolExec.execute(ProtocolExec.java:195)
	at org.apache.http.impl.execchain.RetryExec.execute(RetryExec.java:86)
	at org.apache.http.impl.execchain.RedirectExec.execute(RedirectExec.java:108)
	at org.apache.http.impl.client.InternalHttpClient.doExecute(InternalHttpClient.java:186)
	at org.apache.http.impl.client.CloseableHttpClient.execute(CloseableHttpClient.java:82)
	at org.apache.http.impl.client.CloseableHttpClient.execute(CloseableHttpClient.java:106)
	at org.apache.http.impl.client.CloseableHttpClient.execute(CloseableHttpClient.java:57)
	at org.dataone.client.rest.RestClient.doRequest(RestClient.java:294)
	at org.dataone.client.rest.RestClient.doRequestMMBody(RestClient.java:272)
	at org.dataone.client.rest.RestClient.doPostRequest(RestClient.java:192)
	at org.dataone.client.rest.HttpMultipartRestClient.doPostRequest(HttpMultipartRestClient.java:453)
	... 41 more
20151110-08:26:02: [INFO]: CREATING test object... pid: P1_20153140262453 with a sid: S1_20153140262455 obsoletes: null obsoletedBy: null [org.dataone.integration.ContextAwareTestCaseDataone]
20151110-08:26:02: [INFO]: certificate directory: /etc/dataone/client/testClientCerts/ [org.dataone.integration.ContextAwareTestCaseDataone]
20151110-08:26:02: [INFO]: certificate filename: cnDevUNM2 [org.dataone.integration.ContextAwareTestCaseDataone]
20151110-08:26:02: [INFO]: client setup as Subject: CN=urn:node:cnDevUNM2,DC=dataone,DC=org [org.dataone.integration.ContextAwareTestCaseDataone]
20151110-08:26:02: [WARN]: Unable to find a valid authoritative MN to use for the object: org.dataone.service.types.v1.Identifier@45af52fe [org.dataone.integration.ContextAwareTestCaseDataone]
20151110-08:26:02: [INFO]: creating a test object.  pid = P1_20153140262453 on https://mn-dev-unm-2.test.dataone.org/metacat/d1/mn/v2 [org.dataone.integration.ContextAwareTestCaseDataone]
20151110-08:26:02: [INFO]: SystemMetadata for pid: P1_20153140262453
<?xml version="1.0" encoding="UTF-8"?><d1_v2.0:systemMetadata xmlns:d1_v2.0="http://ns.dataone.org/service/types/v2.0" xmlns:d1="http://ns.dataone.org/service/types/v1"><serialVersion>1</serialVersion><identifier>P1_20153140262453</identifier><formatId>eml://ecoinformatics.org/eml-2.0.1</formatId><size>17181</size><checksum algorithm="MD5">03ce09c6b4c3efc1681f3023402998a2</checksum><submitter>CN=urn:node:cnDevUNM2,DC=dataone,DC=org</submitter><rightsHolder>CN=testRightsHolder,DC=dataone,DC=org</rightsHolder><accessPolicy><allow><subject>public</subject><permission>read</permission></allow></accessPolicy><dateUploaded>2015-11-10T08:26:02.471+00:00</dateUploaded><dateSysMetadataModified>2015-11-10T08:26:02.471+00:00</dateSysMetadataModified><originMemberNode>bogusAuthoritativeNode</originMemberNode><authoritativeMemberNode>bogusAuthoritativeNode</authoritativeMemberNode><seriesId>S1_20153140262455</seriesId></d1_v2.0:systemMetadata> [org.dataone.integration.ContextAwareTestCaseDataone]
20151110-08:26:03: [INFO]: rest call info: POST https://mn-dev-unm-2.test.dataone.org/metacat/d1/mn/v2/object; MMP message has: ParamPart:pid = P1_20153140262453; FilePart:object = /tmp/mmp.output.6184590144118298818.tmp (17181 bytes); FilePart:sysmeta = /tmp/mmp.output.8223961115175269823.tmp (944 bytes);  [org.dataone.client.rest.RestClient]
20151110-08:26:03: [INFO]: object created.  pid = P1_20153140262453 [org.dataone.integration.ContextAwareTestCaseDataone]
20151110-08:26:13: [INFO]: Created SID (S1_20153140262455) and head PID (P1_20153140262453) pair. [org.dataone.integration.ContextAwareTestCaseDataone]
20151110-08:26:13: [INFO]: rest call info: HEAD https://mn-dev-unm-2.test.dataone.org/metacat/d1/mn/v2/object/S1_20153140262455 [org.dataone.client.rest.RestClient]
20151110-08:26:13: [INFO]: rest call info: HEAD https://mn-dev-unm-2.test.dataone.org/metacat/d1/mn/v2/object/P1_20153140262453 [org.dataone.client.rest.RestClient]
20151110-08:26:13: [INFO]: **************************************************** [org.dataone.integration.ContextAwareTestCaseDataone]
20151110-08:26:13: [INFO]: ***  context label:   DEV2 [org.dataone.integration.ContextAwareTestCaseDataone]
20151110-08:26:13: [INFO]: **************************************************** [org.dataone.integration.ContextAwareTestCaseDataone]
20151110-08:26:13: [INFO]: **************************************************** [org.dataone.integration.ContextAwareTestCaseDataone]
20151110-08:26:13: [INFO]: Testing create() method ...  [org.dataone.integration.ContextAwareTestCaseDataone]
20151110-08:26:21: [INFO]: rest call info: GET https://mn-dev-ucsb-1.test.dataone.org/metacat/d1/mn/v2/monitor/ping [org.dataone.client.rest.RestClient]
20151110-08:26:21: [INFO]: MN excluded from test: https://mn-dev-ucsb-1.test.dataone.org/metacat/d1/mn [org.dataone.integration.ContextAwareTestCaseDataone]
20151110-08:26:29: [INFO]: rest call info: GET https://mn-dev-ucsb-2.test.dataone.org/metacat/d1/mn/v2/monitor/ping [org.dataone.client.rest.RestClient]
20151110-08:26:29: [INFO]: MN included in test: https://mn-dev-ucsb-2.test.dataone.org/metacat/d1/mn [org.dataone.integration.ContextAwareTestCaseDataone]
20151110-08:26:29: [INFO]: rest call info: GET https://mn-dev-unm-1.test.dataone.org/metacat/d1/mn/v2/monitor/ping [org.dataone.client.rest.RestClient]
20151110-08:26:29: [INFO]: MN excluded from test: https://mn-dev-unm-1.test.dataone.org/metacat/d1/mn [org.dataone.integration.ContextAwareTestCaseDataone]
20151110-08:26:29: [INFO]: rest call info: GET https://mn-dev-unm-2.test.dataone.org/metacat/d1/mn/v2/monitor/ping [org.dataone.client.rest.RestClient]
20151110-08:26:29: [INFO]: MN included in test: https://mn-dev-unm-2.test.dataone.org/metacat/d1/mn [org.dataone.integration.ContextAwareTestCaseDataone]
20151110-08:26:50: [INFO]: rest call info: POST https://mn-dev-ucsb-2.test.dataone.org/metacat/d1/mn/v2/object; MMP message has: ParamPart:pid = P1201531402629443; FilePart:object = /tmp/mmp.output.7010232916606279544.tmp (17181 bytes); FilePart:sysmeta = /tmp/mmp.output.7832405379518054362.tmp (756 bytes);  [org.dataone.client.rest.RestClient]
20151110-08:26:50: [INFO]: Testing create(), created new object: org.dataone.service.types.v1.Identifier@3f02a98b [org.dataone.integration.ContextAwareTestCaseDataone]
20151110-08:27:28: [INFO]: rest call info: GET https://mn-dev-ucsb-2.test.dataone.org/metacat/d1/mn/v2/meta/S1201531402629445 [org.dataone.client.rest.RestClient]
org.dataone.service.exceptions.ServiceFailure: class org.dataone.client.exception.ClientSideException: /Read timed out
	at org.dataone.client.rest.HttpMultipartRestClient.doGetRequest(HttpMultipartRestClient.java:339)
	at org.dataone.client.rest.HttpMultipartRestClient.doGetRequest(HttpMultipartRestClient.java:318)
	at org.dataone.client.v2.impl.MultipartD1Node.getSystemMetadata(MultipartD1Node.java:94)
	at org.dataone.client.v2.impl.MultipartMNode.getSystemMetadata(MultipartMNode.java:337)
	at org.dataone.integration.adapters.CommonCallAdapter.getSystemMetadata(CommonCallAdapter.java:246)
	at org.dataone.integration.it.testImplementations.SidCommonTestImplementations.testCreate(SidCommonTestImplementations.java:478)
	at sun.reflect.NativeMethodAccessorImpl.invoke0(Native Method)
	at sun.reflect.NativeMethodAccessorImpl.invoke(NativeMethodAccessorImpl.java:57)
	at sun.reflect.DelegatingMethodAccessorImpl.invoke(DelegatingMethodAccessorImpl.java:43)
	at java.lang.reflect.Method.invoke(Method.java:606)
	at org.junit.runners.model.FrameworkMethod$1.runReflectiveCall(FrameworkMethod.java:44)
	at org.junit.internal.runners.model.ReflectiveCallable.run(ReflectiveCallable.java:15)
	at org.junit.runners.model.FrameworkMethod.invokeExplosively(FrameworkMethod.java:41)
	at org.junit.internal.runners.statements.InvokeMethod.evaluate(InvokeMethod.java:20)
	at org.junit.rules.Verifier$1.evaluate(Verifier.java:34)
	at org.junit.internal.runners.statements.RunBefores.evaluate(RunBefores.java:28)
	at org.junit.runners.BlockJUnit4ClassRunner.runChild(BlockJUnit4ClassRunner.java:76)
	at org.junit.runners.BlockJUnit4ClassRunner.runChild(BlockJUnit4ClassRunner.java:50)
	at org.junit.runners.ParentRunner$3.run(ParentRunner.java:193)
	at org.junit.runners.ParentRunner$1.schedule(ParentRunner.java:52)
	at org.junit.runners.ParentRunner.runChildren(ParentRunner.java:191)
	at org.junit.runners.ParentRunner.access$000(ParentRunner.java:42)
	at org.junit.runners.ParentRunner$2.evaluate(ParentRunner.java:184)
	at org.junit.runners.ParentRunner.run(ParentRunner.java:236)
	at org.apache.maven.surefire.junit4.JUnit4TestSet.execute(JUnit4TestSet.java:53)
	at org.apache.maven.surefire.junit4.JUnit4Provider.executeTestSet(JUnit4Provider.java:119)
	at org.apache.maven.surefire.junit4.JUnit4Provider.invoke(JUnit4Provider.java:101)
	at sun.reflect.NativeMethodAccessorImpl.invoke0(Native Method)
	at sun.reflect.NativeMethodAccessorImpl.invoke(NativeMethodAccessorImpl.java:57)
	at sun.reflect.DelegatingMethodAccessorImpl.invoke(DelegatingMethodAccessorImpl.java:43)
	at java.lang.reflect.Method.invoke(Method.java:606)
	at org.apache.maven.surefire.booter.ProviderFactory$ClassLoaderProxy.invoke(ProviderFactory.java:103)
	at com.sun.proxy.$Proxy0.invoke(Unknown Source)
	at org.apache.maven.surefire.booter.SurefireStarter.invokeProvider(SurefireStarter.java:150)
	at org.apache.maven.surefire.booter.SurefireStarter.runSuitesInProcess(SurefireStarter.java:91)
	at org.apache.maven.surefire.booter.ForkedBooter.main(ForkedBooter.java:69)
Caused by: org.dataone.client.exception.ClientSideException: /Read timed out
	... 36 more
Caused by: java.net.SocketTimeoutException: Read timed out
	at java.net.SocketInputStream.socketRead0(Native Method)
	at java.net.SocketInputStream.read(SocketInputStream.java:152)
	at java.net.SocketInputStream.read(SocketInputStream.java:122)
	at sun.security.ssl.InputRecord.readFully(InputRecord.java:442)
	at sun.security.ssl.InputRecord.read(InputRecord.java:480)
	at sun.security.ssl.SSLSocketImpl.readRecord(SSLSocketImpl.java:946)
	at sun.security.ssl.SSLSocketImpl.readDataRecord(SSLSocketImpl.java:903)
	at sun.security.ssl.AppInputStream.read(AppInputStream.java:102)
	at org.apache.http.impl.io.SessionInputBufferImpl.streamRead(SessionInputBufferImpl.java:136)
	at org.apache.http.impl.io.SessionInputBufferImpl.fillBuffer(SessionInputBufferImpl.java:152)
	at org.apache.http.impl.io.SessionInputBufferImpl.readLine(SessionInputBufferImpl.java:270)
	at org.apache.http.impl.conn.DefaultHttpResponseParser.parseHead(DefaultHttpResponseParser.java:140)
	at org.apache.http.impl.conn.DefaultHttpResponseParser.parseHead(DefaultHttpResponseParser.java:57)
	at org.apache.http.impl.io.AbstractMessageParser.parse(AbstractMessageParser.java:260)
	at org.apache.http.impl.DefaultBHttpClientConnection.receiveResponseHeader(DefaultBHttpClientConnection.java:161)
	at sun.reflect.GeneratedMethodAccessor9.invoke(Unknown Source)
	at sun.reflect.DelegatingMethodAccessorImpl.invoke(DelegatingMethodAccessorImpl.java:43)
	at java.lang.reflect.Method.invoke(Method.java:606)
	at org.apache.http.impl.conn.CPoolProxy.invoke(CPoolProxy.java:138)
	at com.sun.proxy.$Proxy9.receiveResponseHeader(Unknown Source)
	at org.apache.http.protocol.HttpRequestExecutor.doReceiveResponse(HttpRequestExecutor.java:271)
	at org.apache.http.protocol.HttpRequestExecutor.execute(HttpRequestExecutor.java:123)
	at org.apache.http.impl.execchain.MainClientExec.execute(MainClientExec.java:254)
	at org.apache.http.impl.execchain.ProtocolExec.execute(ProtocolExec.java:195)
	at org.apache.http.impl.execchain.RetryExec.execute(RetryExec.java:86)
	at org.apache.http.impl.execchain.RedirectExec.execute(RedirectExec.java:108)
	at org.apache.http.impl.client.InternalHttpClient.doExecute(InternalHttpClient.java:186)
	at org.apache.http.impl.client.CloseableHttpClient.execute(CloseableHttpClient.java:82)
	at org.apache.http.impl.client.CloseableHttpClient.execute(CloseableHttpClient.java:106)
	at org.apache.http.impl.client.CloseableHttpClient.execute(CloseableHttpClient.java:57)
	at org.dataone.client.rest.RestClient.doRequest(RestClient.java:294)
	at org.dataone.client.rest.RestClient.doRequestNoBody(RestClient.java:230)
	at org.dataone.client.rest.RestClient.doGetRequest(RestClient.java:148)
	at org.dataone.client.rest.HttpMultipartRestClient.doGetRequest(HttpMultipartRestClient.java:329)
	... 35 more
20151110-08:27:29: [INFO]: rest call info: POST https://mn-dev-unm-2.test.dataone.org/metacat/d1/mn/v2/object; MMP message has: ParamPart:pid = P1201531402728118; FilePart:object = /tmp/mmp.output.4544504793160903527.tmp (17181 bytes); FilePart:sysmeta = /tmp/mmp.output.8784771656713998384.tmp (756 bytes);  [org.dataone.client.rest.RestClient]
20151110-08:27:29: [INFO]: Testing create(), created new object: org.dataone.service.types.v1.Identifier@40b70230 [org.dataone.integration.ContextAwareTestCaseDataone]
20151110-08:27:29: [INFO]: rest call info: GET https://mn-dev-unm-2.test.dataone.org/metacat/d1/mn/v2/meta/S1201531402728121 [org.dataone.client.rest.RestClient]
20151110-08:27:29: [INFO]: **************************************************** [org.dataone.integration.ContextAwareTestCaseDataone]
20151110-08:27:29: [INFO]: ***  context label:   DEV2 [org.dataone.integration.ContextAwareTestCaseDataone]
20151110-08:27:29: [INFO]: **************************************************** [org.dataone.integration.ContextAwareTestCaseDataone]
20151110-08:27:29: [INFO]: **************************************************** [org.dataone.integration.ContextAwareTestCaseDataone]
20151110-08:27:29: [INFO]: Testing delete() method ...  [org.dataone.integration.ContextAwareTestCaseDataone]
20151110-08:27:29: [INFO]: Testing delete(), Case1 [org.dataone.integration.ContextAwareTestCaseDataone]
20151110-08:27:36: [INFO]: rest call info: GET https://mn-dev-ucsb-1.test.dataone.org/metacat/d1/mn/v2/monitor/ping [org.dataone.client.rest.RestClient]
20151110-08:27:36: [INFO]: MN excluded from test: https://mn-dev-ucsb-1.test.dataone.org/metacat/d1/mn [org.dataone.integration.ContextAwareTestCaseDataone]
20151110-08:27:44: [INFO]: rest call info: GET https://mn-dev-ucsb-2.test.dataone.org/metacat/d1/mn/v2/monitor/ping [org.dataone.client.rest.RestClient]
20151110-08:27:44: [INFO]: MN included in test: https://mn-dev-ucsb-2.test.dataone.org/metacat/d1/mn [org.dataone.integration.ContextAwareTestCaseDataone]
20151110-08:27:44: [INFO]: rest call info: GET https://mn-dev-unm-1.test.dataone.org/metacat/d1/mn/v2/monitor/ping [org.dataone.client.rest.RestClient]
20151110-08:27:44: [INFO]: MN excluded from test: https://mn-dev-unm-1.test.dataone.org/metacat/d1/mn [org.dataone.integration.ContextAwareTestCaseDataone]
20151110-08:27:44: [INFO]: rest call info: GET https://mn-dev-unm-2.test.dataone.org/metacat/d1/mn/v2/monitor/ping [org.dataone.client.rest.RestClient]
20151110-08:27:44: [INFO]: MN included in test: https://mn-dev-unm-2.test.dataone.org/metacat/d1/mn [org.dataone.integration.ContextAwareTestCaseDataone]
20151110-08:27:44: [INFO]: CREATING test object... pid: P1_201531402744613 with a sid: S1_201531402744615 obsoletes: null obsoletedBy: null [org.dataone.integration.ContextAwareTestCaseDataone]
20151110-08:27:44: [INFO]: certificate directory: /etc/dataone/client/testClientCerts/ [org.dataone.integration.ContextAwareTestCaseDataone]
20151110-08:27:44: [INFO]: certificate filename: cnDevUNM2 [org.dataone.integration.ContextAwareTestCaseDataone]
20151110-08:27:44: [INFO]: client setup as Subject: CN=urn:node:cnDevUNM2,DC=dataone,DC=org [org.dataone.integration.ContextAwareTestCaseDataone]
20151110-08:27:44: [WARN]: Unable to find a valid authoritative MN to use for the object: org.dataone.service.types.v1.Identifier@720c1819 [org.dataone.integration.ContextAwareTestCaseDataone]
20151110-08:27:44: [INFO]: creating a test object.  pid = P1_201531402744613 on https://mn-dev-ucsb-2.test.dataone.org/metacat/d1/mn/v2 [org.dataone.integration.ContextAwareTestCaseDataone]
20151110-08:27:44: [INFO]: SystemMetadata for pid: P1_201531402744613
<?xml version="1.0" encoding="UTF-8"?><d1_v2.0:systemMetadata xmlns:d1_v2.0="http://ns.dataone.org/service/types/v2.0" xmlns:d1="http://ns.dataone.org/service/types/v1"><serialVersion>1</serialVersion><identifier>P1_201531402744613</identifier><formatId>eml://ecoinformatics.org/eml-2.0.1</formatId><size>17181</size><checksum algorithm="MD5">03ce09c6b4c3efc1681f3023402998a2</checksum><submitter>CN=urn:node:cnDevUNM2,DC=dataone,DC=org</submitter><rightsHolder>CN=testRightsHolder,DC=dataone,DC=org</rightsHolder><accessPolicy><allow><subject>public</subject><permission>read</permission></allow></accessPolicy><dateUploaded>2015-11-10T08:27:44.632+00:00</dateUploaded><dateSysMetadataModified>2015-11-10T08:27:44.632+00:00</dateSysMetadataModified><originMemberNode>bogusAuthoritativeNode</originMemberNode><authoritativeMemberNode>bogusAuthoritativeNode</authoritativeMemberNode><seriesId>S1_201531402744615</seriesId></d1_v2.0:systemMetadata> [org.dataone.integration.ContextAwareTestCaseDataone]
20151110-08:28:22: [INFO]: rest call info: POST https://mn-dev-ucsb-2.test.dataone.org/metacat/d1/mn/v2/object; MMP message has: ParamPart:pid = P1_201531402744613; FilePart:object = /tmp/mmp.output.6912024245034318165.tmp (17181 bytes); FilePart:sysmeta = /tmp/mmp.output.4510662267704733798.tmp (946 bytes);  [org.dataone.client.rest.RestClient]
java.lang.reflect.InvocationTargetException
	at sun.reflect.NativeMethodAccessorImpl.invoke0(Native Method)
	at sun.reflect.NativeMethodAccessorImpl.invoke(NativeMethodAccessorImpl.java:57)
	at sun.reflect.DelegatingMethodAccessorImpl.invoke(DelegatingMethodAccessorImpl.java:43)
	at java.lang.reflect.Method.invoke(Method.java:606)
	at org.dataone.integration.it.testImplementations.SidCommonTestImplementations.testDelete(SidCommonTestImplementations.java:517)
	at sun.reflect.NativeMethodAccessorImpl.invoke0(Native Method)
	at sun.reflect.NativeMethodAccessorImpl.invoke(NativeMethodAccessorImpl.java:57)
	at sun.reflect.DelegatingMethodAccessorImpl.invoke(DelegatingMethodAccessorImpl.java:43)
	at java.lang.reflect.Method.invoke(Method.java:606)
	at org.junit.runners.model.FrameworkMethod$1.runReflectiveCall(FrameworkMethod.java:44)
	at org.junit.internal.runners.model.ReflectiveCallable.run(ReflectiveCallable.java:15)
	at org.junit.runners.model.FrameworkMethod.invokeExplosively(FrameworkMethod.java:41)
	at org.junit.internal.runners.statements.InvokeMethod.evaluate(InvokeMethod.java:20)
	at org.junit.rules.Verifier$1.evaluate(Verifier.java:34)
	at org.junit.internal.runners.statements.RunBefores.evaluate(RunBefores.java:28)
	at org.junit.runners.BlockJUnit4ClassRunner.runChild(BlockJUnit4ClassRunner.java:76)
	at org.junit.runners.BlockJUnit4ClassRunner.runChild(BlockJUnit4ClassRunner.java:50)
	at org.junit.runners.ParentRunner$3.run(ParentRunner.java:193)
	at org.junit.runners.ParentRunner$1.schedule(ParentRunner.java:52)
	at org.junit.runners.ParentRunner.runChildren(ParentRunner.java:191)
	at org.junit.runners.ParentRunner.access$000(ParentRunner.java:42)
	at org.junit.runners.ParentRunner$2.evaluate(ParentRunner.java:184)
	at org.junit.runners.ParentRunner.run(ParentRunner.java:236)
	at org.apache.maven.surefire.junit4.JUnit4TestSet.execute(JUnit4TestSet.java:53)
	at org.apache.maven.surefire.junit4.JUnit4Provider.executeTestSet(JUnit4Provider.java:119)
	at org.apache.maven.surefire.junit4.JUnit4Provider.invoke(JUnit4Provider.java:101)
	at sun.reflect.NativeMethodAccessorImpl.invoke0(Native Method)
	at sun.reflect.NativeMethodAccessorImpl.invoke(NativeMethodAccessorImpl.java:57)
	at sun.reflect.DelegatingMethodAccessorImpl.invoke(DelegatingMethodAccessorImpl.java:43)
	at java.lang.reflect.Method.invoke(Method.java:606)
	at org.apache.maven.surefire.booter.ProviderFactory$ClassLoaderProxy.invoke(ProviderFactory.java:103)
	at com.sun.proxy.$Proxy0.invoke(Unknown Source)
	at org.apache.maven.surefire.booter.SurefireStarter.invokeProvider(SurefireStarter.java:150)
	at org.apache.maven.surefire.booter.SurefireStarter.runSuitesInProcess(SurefireStarter.java:91)
	at org.apache.maven.surefire.booter.ForkedBooter.main(ForkedBooter.java:69)
Caused by: org.dataone.client.exception.ClientSideException: Unable to create test object!/class org.dataone.client.exception.ClientSideException: /Read timed out
	at org.dataone.integration.ContextAwareTestCaseDataone.createTestObject(ContextAwareTestCaseDataone.java:1472)
	at org.dataone.integration.ContextAwareTestCaseDataone.createTestObject(ContextAwareTestCaseDataone.java:1304)
	at org.dataone.integration.it.testImplementations.SidCommonTestImplementations.createTestObject(SidCommonTestImplementations.java:216)
	at org.dataone.integration.it.testImplementations.SidMNTestImplementations.setupMNCase1(SidMNTestImplementations.java:88)
	... 35 more
Caused by: org.dataone.service.exceptions.ServiceFailure: class org.dataone.client.exception.ClientSideException: /Read timed out
	at org.dataone.client.rest.HttpMultipartRestClient.doPostRequest(HttpMultipartRestClient.java:460)
	at org.dataone.client.v2.impl.MultipartMNode.create(MultipartMNode.java:495)
	at org.dataone.integration.adapters.CommonCallAdapter.create(CommonCallAdapter.java:505)
	at org.dataone.integration.ContextAwareTestCaseDataone.createTestObject(ContextAwareTestCaseDataone.java:1463)
	... 38 more
Caused by: org.dataone.client.exception.ClientSideException: /Read timed out
	... 42 more
Caused by: java.net.SocketTimeoutException: Read timed out
	at java.net.SocketInputStream.socketRead0(Native Method)
	at java.net.SocketInputStream.read(SocketInputStream.java:152)
	at java.net.SocketInputStream.read(SocketInputStream.java:122)
	at sun.security.ssl.InputRecord.readFully(InputRecord.java:442)
	at sun.security.ssl.InputRecord.read(InputRecord.java:480)
	at sun.security.ssl.SSLSocketImpl.readRecord(SSLSocketImpl.java:946)
	at sun.security.ssl.SSLSocketImpl.readDataRecord(SSLSocketImpl.java:903)
	at sun.security.ssl.AppInputStream.read(AppInputStream.java:102)
	at org.apache.http.impl.io.SessionInputBufferImpl.streamRead(SessionInputBufferImpl.java:136)
	at org.apache.http.impl.io.SessionInputBufferImpl.fillBuffer(SessionInputBufferImpl.java:152)
	at org.apache.http.impl.io.SessionInputBufferImpl.readLine(SessionInputBufferImpl.java:270)
	at org.apache.http.impl.conn.DefaultHttpResponseParser.parseHead(DefaultHttpResponseParser.java:140)
	at org.apache.http.impl.conn.DefaultHttpResponseParser.parseHead(DefaultHttpResponseParser.java:57)
	at org.apache.http.impl.io.AbstractMessageParser.parse(AbstractMessageParser.java:260)
	at org.apache.http.impl.DefaultBHttpClientConnection.receiveResponseHeader(DefaultBHttpClientConnection.java:161)
	at sun.reflect.GeneratedMethodAccessor9.invoke(Unknown Source)
	at sun.reflect.DelegatingMethodAccessorImpl.invoke(DelegatingMethodAccessorImpl.java:43)
	at java.lang.reflect.Method.invoke(Method.java:606)
	at org.apache.http.impl.conn.CPoolProxy.invoke(CPoolProxy.java:138)
	at com.sun.proxy.$Proxy9.receiveResponseHeader(Unknown Source)
	at org.apache.http.protocol.HttpRequestExecutor.doReceiveResponse(HttpRequestExecutor.java:271)
	at org.apache.http.protocol.HttpRequestExecutor.execute(HttpRequestExecutor.java:123)
	at org.apache.http.impl.execchain.MainClientExec.execute(MainClientExec.java:254)
	at org.apache.http.impl.execchain.ProtocolExec.execute(ProtocolExec.java:195)
	at org.apache.http.impl.execchain.RetryExec.execute(RetryExec.java:86)
	at org.apache.http.impl.execchain.RedirectExec.execute(RedirectExec.java:108)
	at org.apache.http.impl.client.InternalHttpClient.doExecute(InternalHttpClient.java:186)
	at org.apache.http.impl.client.CloseableHttpClient.execute(CloseableHttpClient.java:82)
	at org.apache.http.impl.client.CloseableHttpClient.execute(CloseableHttpClient.java:106)
	at org.apache.http.impl.client.CloseableHttpClient.execute(CloseableHttpClient.java:57)
	at org.dataone.client.rest.RestClient.doRequest(RestClient.java:294)
	at org.dataone.client.rest.RestClient.doRequestMMBody(RestClient.java:272)
	at org.dataone.client.rest.RestClient.doPostRequest(RestClient.java:192)
	at org.dataone.client.rest.HttpMultipartRestClient.doPostRequest(HttpMultipartRestClient.java:453)
	... 41 more
20151110-08:28:22: [INFO]: CREATING test object... pid: P1_201531402822450 with a sid: S1_201531402822453 obsoletes: null obsoletedBy: null [org.dataone.integration.ContextAwareTestCaseDataone]
20151110-08:28:22: [INFO]: certificate directory: /etc/dataone/client/testClientCerts/ [org.dataone.integration.ContextAwareTestCaseDataone]
20151110-08:28:22: [INFO]: certificate filename: cnDevUNM2 [org.dataone.integration.ContextAwareTestCaseDataone]
20151110-08:28:22: [INFO]: client setup as Subject: CN=urn:node:cnDevUNM2,DC=dataone,DC=org [org.dataone.integration.ContextAwareTestCaseDataone]
20151110-08:28:22: [WARN]: Unable to find a valid authoritative MN to use for the object: org.dataone.service.types.v1.Identifier@73a3d1ef [org.dataone.integration.ContextAwareTestCaseDataone]
20151110-08:28:22: [INFO]: creating a test object.  pid = P1_201531402822450 on https://mn-dev-unm-2.test.dataone.org/metacat/d1/mn/v2 [org.dataone.integration.ContextAwareTestCaseDataone]
20151110-08:28:22: [INFO]: SystemMetadata for pid: P1_201531402822450
<?xml version="1.0" encoding="UTF-8"?><d1_v2.0:systemMetadata xmlns:d1_v2.0="http://ns.dataone.org/service/types/v2.0" xmlns:d1="http://ns.dataone.org/service/types/v1"><serialVersion>1</serialVersion><identifier>P1_201531402822450</identifier><formatId>eml://ecoinformatics.org/eml-2.0.1</formatId><size>17181</size><checksum algorithm="MD5">03ce09c6b4c3efc1681f3023402998a2</checksum><submitter>CN=urn:node:cnDevUNM2,DC=dataone,DC=org</submitter><rightsHolder>CN=testRightsHolder,DC=dataone,DC=org</rightsHolder><accessPolicy><allow><subject>public</subject><permission>read</permission></allow></accessPolicy><dateUploaded>2015-11-10T08:28:22.467+00:00</dateUploaded><dateSysMetadataModified>2015-11-10T08:28:22.467+00:00</dateSysMetadataModified><originMemberNode>bogusAuthoritativeNode</originMemberNode><authoritativeMemberNode>bogusAuthoritativeNode</authoritativeMemberNode><seriesId>S1_201531402822453</seriesId></d1_v2.0:systemMetadata> [org.dataone.integration.ContextAwareTestCaseDataone]
20151110-08:28:23: [INFO]: rest call info: POST https://mn-dev-unm-2.test.dataone.org/metacat/d1/mn/v2/object; MMP message has: ParamPart:pid = P1_201531402822450; FilePart:object = /tmp/mmp.output.7832669625446935217.tmp (17181 bytes); FilePart:sysmeta = /tmp/mmp.output.6486258828534548155.tmp (946 bytes);  [org.dataone.client.rest.RestClient]
20151110-08:28:23: [INFO]: object created.  pid = P1_201531402822450 [org.dataone.integration.ContextAwareTestCaseDataone]
20151110-08:28:33: [INFO]: Created SID (S1_201531402822453) and head PID (P1_201531402822450) pair. [org.dataone.integration.ContextAwareTestCaseDataone]
20151110-08:28:43: [INFO]: rest call info: DELETE https://mn-dev-unm-2.test.dataone.org/metacat/d1/mn/v2/object/S1_201531402822453 [org.dataone.client.rest.RestClient]
20151110-08:28:43: [INFO]: rest call info: GET https://mn-dev-unm-2.test.dataone.org/metacat/d1/mn/v2/object/P1_201531402822450 [org.dataone.client.rest.RestClient]
20151110-08:28:43: [INFO]: **************************************************** [org.dataone.integration.ContextAwareTestCaseDataone]
20151110-08:28:43: [INFO]: ***  context label:   DEV2 [org.dataone.integration.ContextAwareTestCaseDataone]
20151110-08:28:43: [INFO]: **************************************************** [org.dataone.integration.ContextAwareTestCaseDataone]
20151110-08:28:43: [INFO]: **************************************************** [org.dataone.integration.ContextAwareTestCaseDataone]
20151110-08:28:43: [INFO]: Testing listObjects() method ...  [org.dataone.integration.ContextAwareTestCaseDataone]
20151110-08:28:43: [INFO]: Testing listObjects(), Case1 [org.dataone.integration.ContextAwareTestCaseDataone]
20151110-08:28:51: [INFO]: rest call info: GET https://mn-dev-ucsb-1.test.dataone.org/metacat/d1/mn/v2/monitor/ping [org.dataone.client.rest.RestClient]
20151110-08:28:51: [INFO]: MN excluded from test: https://mn-dev-ucsb-1.test.dataone.org/metacat/d1/mn [org.dataone.integration.ContextAwareTestCaseDataone]
20151110-08:28:59: [INFO]: rest call info: GET https://mn-dev-ucsb-2.test.dataone.org/metacat/d1/mn/v2/monitor/ping [org.dataone.client.rest.RestClient]
20151110-08:28:59: [INFO]: MN included in test: https://mn-dev-ucsb-2.test.dataone.org/metacat/d1/mn [org.dataone.integration.ContextAwareTestCaseDataone]
20151110-08:28:59: [INFO]: rest call info: GET https://mn-dev-unm-1.test.dataone.org/metacat/d1/mn/v2/monitor/ping [org.dataone.client.rest.RestClient]
20151110-08:28:59: [INFO]: MN excluded from test: https://mn-dev-unm-1.test.dataone.org/metacat/d1/mn [org.dataone.integration.ContextAwareTestCaseDataone]
20151110-08:28:59: [INFO]: rest call info: GET https://mn-dev-unm-2.test.dataone.org/metacat/d1/mn/v2/monitor/ping [org.dataone.client.rest.RestClient]
20151110-08:28:59: [INFO]: MN included in test: https://mn-dev-unm-2.test.dataone.org/metacat/d1/mn [org.dataone.integration.ContextAwareTestCaseDataone]
20151110-08:28:59: [INFO]: CREATING test object... pid: P1_201531402859339 with a sid: S1_201531402859342 obsoletes: null obsoletedBy: null [org.dataone.integration.ContextAwareTestCaseDataone]
20151110-08:28:59: [INFO]: certificate directory: /etc/dataone/client/testClientCerts/ [org.dataone.integration.ContextAwareTestCaseDataone]
20151110-08:28:59: [INFO]: certificate filename: cnDevUNM2 [org.dataone.integration.ContextAwareTestCaseDataone]
20151110-08:28:59: [INFO]: client setup as Subject: CN=urn:node:cnDevUNM2,DC=dataone,DC=org [org.dataone.integration.ContextAwareTestCaseDataone]
20151110-08:28:59: [WARN]: Unable to find a valid authoritative MN to use for the object: org.dataone.service.types.v1.Identifier@73d14315 [org.dataone.integration.ContextAwareTestCaseDataone]
20151110-08:28:59: [INFO]: creating a test object.  pid = P1_201531402859339 on https://mn-dev-ucsb-2.test.dataone.org/metacat/d1/mn/v2 [org.dataone.integration.ContextAwareTestCaseDataone]
20151110-08:28:59: [INFO]: SystemMetadata for pid: P1_201531402859339
<?xml version="1.0" encoding="UTF-8"?><d1_v2.0:systemMetadata xmlns:d1_v2.0="http://ns.dataone.org/service/types/v2.0" xmlns:d1="http://ns.dataone.org/service/types/v1"><serialVersion>1</serialVersion><identifier>P1_201531402859339</identifier><formatId>eml://ecoinformatics.org/eml-2.0.1</formatId><size>17181</size><checksum algorithm="MD5">03ce09c6b4c3efc1681f3023402998a2</checksum><submitter>CN=urn:node:cnDevUNM2,DC=dataone,DC=org</submitter><rightsHolder>CN=testRightsHolder,DC=dataone,DC=org</rightsHolder><accessPolicy><allow><subject>public</subject><permission>read</permission></allow></accessPolicy><dateUploaded>2015-11-10T08:28:59.357+00:00</dateUploaded><dateSysMetadataModified>2015-11-10T08:28:59.357+00:00</dateSysMetadataModified><originMemberNode>bogusAuthoritativeNode</originMemberNode><authoritativeMemberNode>bogusAuthoritativeNode</authoritativeMemberNode><seriesId>S1_201531402859342</seriesId></d1_v2.0:systemMetadata> [org.dataone.integration.ContextAwareTestCaseDataone]
20151110-08:29:15: [INFO]: rest call info: POST https://mn-dev-ucsb-2.test.dataone.org/metacat/d1/mn/v2/object; MMP message has: ParamPart:pid = P1_201531402859339; FilePart:object = /tmp/mmp.output.3982692306294215275.tmp (17181 bytes); FilePart:sysmeta = /tmp/mmp.output.6767871787401225190.tmp (946 bytes);  [org.dataone.client.rest.RestClient]
20151110-08:29:15: [INFO]: object created.  pid = P1_201531402859339 [org.dataone.integration.ContextAwareTestCaseDataone]
20151110-08:29:25: [INFO]: Created SID (S1_201531402859342) and head PID (P1_201531402859339) pair. [org.dataone.integration.ContextAwareTestCaseDataone]
20151110-08:30:05: [INFO]: rest call info: GET https://mn-dev-ucsb-2.test.dataone.org/metacat/d1/mn/v2/object?identifier=P1_201531402859339 [org.dataone.client.rest.RestClient]
org.dataone.service.exceptions.ServiceFailure: class org.dataone.client.exception.ClientSideException: /Connect to mn-dev-ucsb-2.test.dataone.org:443 [mn-dev-ucsb-2.test.dataone.org/128.111.54.109] failed: connect timed out
	at org.dataone.client.rest.HttpMultipartRestClient.doGetRequest(HttpMultipartRestClient.java:339)
	at org.dataone.client.rest.HttpMultipartRestClient.doGetRequest(HttpMultipartRestClient.java:318)
	at org.dataone.client.v2.impl.MultipartMNode.listObjects(MultipartMNode.java:214)
	at org.dataone.integration.adapters.CommonCallAdapter.listObjects(CommonCallAdapter.java:367)
	at org.dataone.integration.it.testImplementations.SidCommonTestImplementations.testListObjects(SidCommonTestImplementations.java:583)
	at sun.reflect.NativeMethodAccessorImpl.invoke0(Native Method)
	at sun.reflect.NativeMethodAccessorImpl.invoke(NativeMethodAccessorImpl.java:57)
	at sun.reflect.DelegatingMethodAccessorImpl.invoke(DelegatingMethodAccessorImpl.java:43)
	at java.lang.reflect.Method.invoke(Method.java:606)
	at org.junit.runners.model.FrameworkMethod$1.runReflectiveCall(FrameworkMethod.java:44)
	at org.junit.internal.runners.model.ReflectiveCallable.run(ReflectiveCallable.java:15)
	at org.junit.runners.model.FrameworkMethod.invokeExplosively(FrameworkMethod.java:41)
	at org.junit.internal.runners.statements.InvokeMethod.evaluate(InvokeMethod.java:20)
	at org.junit.rules.Verifier$1.evaluate(Verifier.java:34)
	at org.junit.internal.runners.statements.RunBefores.evaluate(RunBefores.java:28)
	at org.junit.runners.BlockJUnit4ClassRunner.runChild(BlockJUnit4ClassRunner.java:76)
	at org.junit.runners.BlockJUnit4ClassRunner.runChild(BlockJUnit4ClassRunner.java:50)
	at org.junit.runners.ParentRunner$3.run(ParentRunner.java:193)
	at org.junit.runners.ParentRunner$1.schedule(ParentRunner.java:52)
	at org.junit.runners.ParentRunner.runChildren(ParentRunner.java:191)
	at org.junit.runners.ParentRunner.access$000(ParentRunner.java:42)
	at org.junit.runners.ParentRunner$2.evaluate(ParentRunner.java:184)
	at org.junit.runners.ParentRunner.run(ParentRunner.java:236)
	at org.apache.maven.surefire.junit4.JUnit4TestSet.execute(JUnit4TestSet.java:53)
	at org.apache.maven.surefire.junit4.JUnit4Provider.executeTestSet(JUnit4Provider.java:119)
	at org.apache.maven.surefire.junit4.JUnit4Provider.invoke(JUnit4Provider.java:101)
	at sun.reflect.NativeMethodAccessorImpl.invoke0(Native Method)
	at sun.reflect.NativeMethodAccessorImpl.invoke(NativeMethodAccessorImpl.java:57)
	at sun.reflect.DelegatingMethodAccessorImpl.invoke(DelegatingMethodAccessorImpl.java:43)
	at java.lang.reflect.Method.invoke(Method.java:606)
	at org.apache.maven.surefire.booter.ProviderFactory$ClassLoaderProxy.invoke(ProviderFactory.java:103)
	at com.sun.proxy.$Proxy0.invoke(Unknown Source)
	at org.apache.maven.surefire.booter.SurefireStarter.invokeProvider(SurefireStarter.java:150)
	at org.apache.maven.surefire.booter.SurefireStarter.runSuitesInProcess(SurefireStarter.java:91)
	at org.apache.maven.surefire.booter.ForkedBooter.main(ForkedBooter.java:69)
Caused by: org.dataone.client.exception.ClientSideException: /Connect to mn-dev-ucsb-2.test.dataone.org:443 [mn-dev-ucsb-2.test.dataone.org/128.111.54.109] failed: connect timed out
	... 35 more
Caused by: org.apache.http.conn.ConnectTimeoutException: Connect to mn-dev-ucsb-2.test.dataone.org:443 [mn-dev-ucsb-2.test.dataone.org/128.111.54.109] failed: connect timed out
	at org.apache.http.impl.conn.HttpClientConnectionOperator.connect(HttpClientConnectionOperator.java:132)
	at org.apache.http.impl.conn.PoolingHttpClientConnectionManager.connect(PoolingHttpClientConnectionManager.java:314)
	at org.apache.http.impl.execchain.MainClientExec.establishRoute(MainClientExec.java:363)
	at org.apache.http.impl.execchain.MainClientExec.execute(MainClientExec.java:219)
	at org.apache.http.impl.execchain.ProtocolExec.execute(ProtocolExec.java:195)
	at org.apache.http.impl.execchain.RetryExec.execute(RetryExec.java:86)
	at org.apache.http.impl.execchain.RedirectExec.execute(RedirectExec.java:108)
	at org.apache.http.impl.client.InternalHttpClient.doExecute(InternalHttpClient.java:186)
	at org.apache.http.impl.client.CloseableHttpClient.execute(CloseableHttpClient.java:82)
	at org.apache.http.impl.client.CloseableHttpClient.execute(CloseableHttpClient.java:106)
	at org.apache.http.impl.client.CloseableHttpClient.execute(CloseableHttpClient.java:57)
	at org.dataone.client.rest.RestClient.doRequest(RestClient.java:294)
	at org.dataone.client.rest.RestClient.doRequestNoBody(RestClient.java:230)
	at org.dataone.client.rest.RestClient.doGetRequest(RestClient.java:148)
	at org.dataone.client.rest.HttpMultipartRestClient.doGetRequest(HttpMultipartRestClient.java:329)
	... 34 more
Caused by: java.net.SocketTimeoutException: connect timed out
	at java.net.PlainSocketImpl.socketConnect(Native Method)
	at java.net.AbstractPlainSocketImpl.doConnect(AbstractPlainSocketImpl.java:339)
	at java.net.AbstractPlainSocketImpl.connectToAddress(AbstractPlainSocketImpl.java:200)
	at java.net.AbstractPlainSocketImpl.connect(AbstractPlainSocketImpl.java:182)
	at java.net.SocksSocketImpl.connect(SocksSocketImpl.java:392)
	at java.net.Socket.connect(Socket.java:579)
	at org.apache.http.conn.ssl.SSLConnectionSocketFactory.connectSocket(SSLConnectionSocketFactory.java:239)
	at org.apache.http.impl.conn.HttpClientConnectionOperator.connect(HttpClientConnectionOperator.java:117)
	... 48 more
20151110-08:30:05: [INFO]: CREATING test object... pid: P1_20153140305149 with a sid: S1_20153140305151 obsoletes: null obsoletedBy: null [org.dataone.integration.ContextAwareTestCaseDataone]
20151110-08:30:05: [INFO]: certificate directory: /etc/dataone/client/testClientCerts/ [org.dataone.integration.ContextAwareTestCaseDataone]
20151110-08:30:05: [INFO]: certificate filename: cnDevUNM2 [org.dataone.integration.ContextAwareTestCaseDataone]
20151110-08:30:05: [INFO]: client setup as Subject: CN=urn:node:cnDevUNM2,DC=dataone,DC=org [org.dataone.integration.ContextAwareTestCaseDataone]
20151110-08:30:05: [WARN]: Unable to find a valid authoritative MN to use for the object: org.dataone.service.types.v1.Identifier@4710f058 [org.dataone.integration.ContextAwareTestCaseDataone]
20151110-08:30:05: [INFO]: creating a test object.  pid = P1_20153140305149 on https://mn-dev-unm-2.test.dataone.org/metacat/d1/mn/v2 [org.dataone.integration.ContextAwareTestCaseDataone]
20151110-08:30:05: [INFO]: SystemMetadata for pid: P1_20153140305149
<?xml version="1.0" encoding="UTF-8"?><d1_v2.0:systemMetadata xmlns:d1_v2.0="http://ns.dataone.org/service/types/v2.0" xmlns:d1="http://ns.dataone.org/service/types/v1"><serialVersion>1</serialVersion><identifier>P1_20153140305149</identifier><formatId>eml://ecoinformatics.org/eml-2.0.1</formatId><size>17181</size><checksum algorithm="MD5">03ce09c6b4c3efc1681f3023402998a2</checksum><submitter>CN=urn:node:cnDevUNM2,DC=dataone,DC=org</submitter><rightsHolder>CN=testRightsHolder,DC=dataone,DC=org</rightsHolder><accessPolicy><allow><subject>public</subject><permission>read</permission></allow></accessPolicy><dateUploaded>2015-11-10T08:30:05.167+00:00</dateUploaded><dateSysMetadataModified>2015-11-10T08:30:05.167+00:00</dateSysMetadataModified><originMemberNode>bogusAuthoritativeNode</originMemberNode><authoritativeMemberNode>bogusAuthoritativeNode</authoritativeMemberNode><seriesId>S1_20153140305151</seriesId></d1_v2.0:systemMetadata> [org.dataone.integration.ContextAwareTestCaseDataone]
20151110-08:30:06: [INFO]: rest call info: POST https://mn-dev-unm-2.test.dataone.org/metacat/d1/mn/v2/object; MMP message has: ParamPart:pid = P1_20153140305149; FilePart:object = /tmp/mmp.output.2399609373051359319.tmp (17181 bytes); FilePart:sysmeta = /tmp/mmp.output.4459938900091316408.tmp (944 bytes);  [org.dataone.client.rest.RestClient]
20151110-08:30:06: [INFO]: object created.  pid = P1_20153140305149 [org.dataone.integration.ContextAwareTestCaseDataone]
20151110-08:30:16: [INFO]: Created SID (S1_20153140305151) and head PID (P1_20153140305149) pair. [org.dataone.integration.ContextAwareTestCaseDataone]
20151110-08:30:26: [INFO]: rest call info: GET https://mn-dev-unm-2.test.dataone.org/metacat/d1/mn/v2/object?identifier=P1_20153140305149 [org.dataone.client.rest.RestClient]
20151110-08:30:26: [INFO]: rest call info: GET https://mn-dev-unm-2.test.dataone.org/metacat/d1/mn/v2/object?identifier=S1_20153140305151 [org.dataone.client.rest.RestClient]
20151110-08:30:26: [INFO]: **************************************************** [org.dataone.integration.ContextAwareTestCaseDataone]
20151110-08:30:26: [INFO]: ***  context label:   DEV2 [org.dataone.integration.ContextAwareTestCaseDataone]
20151110-08:30:26: [INFO]: **************************************************** [org.dataone.integration.ContextAwareTestCaseDataone]
20151110-08:30:26: [INFO]: **************************************************** [org.dataone.integration.ContextAwareTestCaseDataone]
20151110-08:30:26: [INFO]: Testing isAuthorized() method ...  [org.dataone.integration.ContextAwareTestCaseDataone]
20151110-08:30:26: [INFO]: Testing isAuthorized(), Case1 [org.dataone.integration.ContextAwareTestCaseDataone]
20151110-08:30:33: [INFO]: rest call info: GET https://mn-dev-ucsb-1.test.dataone.org/metacat/d1/mn/v2/monitor/ping [org.dataone.client.rest.RestClient]
20151110-08:30:33: [INFO]: MN excluded from test: https://mn-dev-ucsb-1.test.dataone.org/metacat/d1/mn [org.dataone.integration.ContextAwareTestCaseDataone]
20151110-08:30:41: [INFO]: rest call info: GET https://mn-dev-ucsb-2.test.dataone.org/metacat/d1/mn/v2/monitor/ping [org.dataone.client.rest.RestClient]
20151110-08:30:41: [INFO]: MN included in test: https://mn-dev-ucsb-2.test.dataone.org/metacat/d1/mn [org.dataone.integration.ContextAwareTestCaseDataone]
20151110-08:30:41: [INFO]: rest call info: GET https://mn-dev-unm-1.test.dataone.org/metacat/d1/mn/v2/monitor/ping [org.dataone.client.rest.RestClient]
20151110-08:30:41: [INFO]: MN excluded from test: https://mn-dev-unm-1.test.dataone.org/metacat/d1/mn [org.dataone.integration.ContextAwareTestCaseDataone]
20151110-08:30:41: [INFO]: rest call info: GET https://mn-dev-unm-2.test.dataone.org/metacat/d1/mn/v2/monitor/ping [org.dataone.client.rest.RestClient]
20151110-08:30:41: [INFO]: MN included in test: https://mn-dev-unm-2.test.dataone.org/metacat/d1/mn [org.dataone.integration.ContextAwareTestCaseDataone]
20151110-08:30:41: [INFO]: CREATING test object... pid: P1_201531403041584 with a sid: S1_201531403041586 obsoletes: null obsoletedBy: null [org.dataone.integration.ContextAwareTestCaseDataone]
20151110-08:30:41: [INFO]: certificate directory: /etc/dataone/client/testClientCerts/ [org.dataone.integration.ContextAwareTestCaseDataone]
20151110-08:30:41: [INFO]: certificate filename: cnDevUNM2 [org.dataone.integration.ContextAwareTestCaseDataone]
20151110-08:30:41: [INFO]: client setup as Subject: CN=urn:node:cnDevUNM2,DC=dataone,DC=org [org.dataone.integration.ContextAwareTestCaseDataone]
20151110-08:30:41: [WARN]: Unable to find a valid authoritative MN to use for the object: org.dataone.service.types.v1.Identifier@9aff06fd [org.dataone.integration.ContextAwareTestCaseDataone]
20151110-08:30:41: [INFO]: creating a test object.  pid = P1_201531403041584 on https://mn-dev-ucsb-2.test.dataone.org/metacat/d1/mn/v2 [org.dataone.integration.ContextAwareTestCaseDataone]
20151110-08:30:41: [INFO]: SystemMetadata for pid: P1_201531403041584
<?xml version="1.0" encoding="UTF-8"?><d1_v2.0:systemMetadata xmlns:d1_v2.0="http://ns.dataone.org/service/types/v2.0" xmlns:d1="http://ns.dataone.org/service/types/v1"><serialVersion>1</serialVersion><identifier>P1_201531403041584</identifier><formatId>eml://ecoinformatics.org/eml-2.0.1</formatId><size>17181</size><checksum algorithm="MD5">03ce09c6b4c3efc1681f3023402998a2</checksum><submitter>CN=urn:node:cnDevUNM2,DC=dataone,DC=org</submitter><rightsHolder>CN=testRightsHolder,DC=dataone,DC=org</rightsHolder><accessPolicy><allow><subject>public</subject><permission>read</permission></allow></accessPolicy><dateUploaded>2015-11-10T08:30:41.602+00:00</dateUploaded><dateSysMetadataModified>2015-11-10T08:30:41.602+00:00</dateSysMetadataModified><originMemberNode>bogusAuthoritativeNode</originMemberNode><authoritativeMemberNode>bogusAuthoritativeNode</authoritativeMemberNode><seriesId>S1_201531403041586</seriesId></d1_v2.0:systemMetadata> [org.dataone.integration.ContextAwareTestCaseDataone]
20151110-08:31:05: [INFO]: rest call info: POST https://mn-dev-ucsb-2.test.dataone.org/metacat/d1/mn/v2/object; MMP message has: ParamPart:pid = P1_201531403041584; FilePart:object = /tmp/mmp.output.7393910103308071250.tmp (17181 bytes); FilePart:sysmeta = /tmp/mmp.output.6992158497280485513.tmp (946 bytes);  [org.dataone.client.rest.RestClient]
20151110-08:31:05: [INFO]: object created.  pid = P1_201531403041584 [org.dataone.integration.ContextAwareTestCaseDataone]
20151110-08:31:15: [INFO]: Created SID (S1_201531403041586) and head PID (P1_201531403041584) pair. [org.dataone.integration.ContextAwareTestCaseDataone]
20151110-08:31:45: [INFO]: rest call info: GET https://mn-dev-ucsb-2.test.dataone.org/metacat/d1/mn/v2/isAuthorized/S1_201531403041586?action=read [org.dataone.client.rest.RestClient]
20151110-08:32:22: [INFO]: rest call info: GET https://mn-dev-ucsb-2.test.dataone.org/metacat/d1/mn/v2/isAuthorized/P1_201531403041584?action=read [org.dataone.client.rest.RestClient]
20151110-08:32:22: [INFO]: **************************************************** [org.dataone.integration.ContextAwareTestCaseDataone]
20151110-08:32:22: [INFO]: ***  context label:   DEV2 [org.dataone.integration.ContextAwareTestCaseDataone]
20151110-08:32:22: [INFO]: **************************************************** [org.dataone.integration.ContextAwareTestCaseDataone]
20151110-08:32:22: [INFO]: **************************************************** [org.dataone.integration.ContextAwareTestCaseDataone]
20151110-08:32:22: [INFO]: Testing view() method ...  [org.dataone.integration.ContextAwareTestCaseDataone]
20151110-08:32:22: [INFO]: Testing view(), Case1 [org.dataone.integration.ContextAwareTestCaseDataone]
20151110-08:32:30: [INFO]: rest call info: GET https://mn-dev-ucsb-1.test.dataone.org/metacat/d1/mn/v2/monitor/ping [org.dataone.client.rest.RestClient]
20151110-08:32:30: [INFO]: MN excluded from test: https://mn-dev-ucsb-1.test.dataone.org/metacat/d1/mn [org.dataone.integration.ContextAwareTestCaseDataone]
20151110-08:32:38: [INFO]: rest call info: GET https://mn-dev-ucsb-2.test.dataone.org/metacat/d1/mn/v2/monitor/ping [org.dataone.client.rest.RestClient]
20151110-08:32:38: [INFO]: MN included in test: https://mn-dev-ucsb-2.test.dataone.org/metacat/d1/mn [org.dataone.integration.ContextAwareTestCaseDataone]
20151110-08:32:38: [INFO]: rest call info: GET https://mn-dev-unm-1.test.dataone.org/metacat/d1/mn/v2/monitor/ping [org.dataone.client.rest.RestClient]
20151110-08:32:38: [INFO]: MN excluded from test: https://mn-dev-unm-1.test.dataone.org/metacat/d1/mn [org.dataone.integration.ContextAwareTestCaseDataone]
20151110-08:32:38: [INFO]: rest call info: GET https://mn-dev-unm-2.test.dataone.org/metacat/d1/mn/v2/monitor/ping [org.dataone.client.rest.RestClient]
20151110-08:32:38: [INFO]: MN included in test: https://mn-dev-unm-2.test.dataone.org/metacat/d1/mn [org.dataone.integration.ContextAwareTestCaseDataone]
20151110-08:32:38: [INFO]: CREATING test object... pid: P1_201531403238552 with a sid: S1_201531403238555 obsoletes: null obsoletedBy: null [org.dataone.integration.ContextAwareTestCaseDataone]
20151110-08:32:38: [INFO]: certificate directory: /etc/dataone/client/testClientCerts/ [org.dataone.integration.ContextAwareTestCaseDataone]
20151110-08:32:38: [INFO]: certificate filename: cnDevUNM2 [org.dataone.integration.ContextAwareTestCaseDataone]
20151110-08:32:38: [INFO]: client setup as Subject: CN=urn:node:cnDevUNM2,DC=dataone,DC=org [org.dataone.integration.ContextAwareTestCaseDataone]
20151110-08:32:38: [WARN]: Unable to find a valid authoritative MN to use for the object: org.dataone.service.types.v1.Identifier@9e5dcef4 [org.dataone.integration.ContextAwareTestCaseDataone]
20151110-08:32:38: [INFO]: creating a test object.  pid = P1_201531403238552 on https://mn-dev-ucsb-2.test.dataone.org/metacat/d1/mn/v2 [org.dataone.integration.ContextAwareTestCaseDataone]
20151110-08:32:38: [INFO]: SystemMetadata for pid: P1_201531403238552
<?xml version="1.0" encoding="UTF-8"?><d1_v2.0:systemMetadata xmlns:d1_v2.0="http://ns.dataone.org/service/types/v2.0" xmlns:d1="http://ns.dataone.org/service/types/v1"><serialVersion>1</serialVersion><identifier>P1_201531403238552</identifier><formatId>eml://ecoinformatics.org/eml-2.0.1</formatId><size>17181</size><checksum algorithm="MD5">03ce09c6b4c3efc1681f3023402998a2</checksum><submitter>CN=urn:node:cnDevUNM2,DC=dataone,DC=org</submitter><rightsHolder>CN=testRightsHolder,DC=dataone,DC=org</rightsHolder><accessPolicy><allow><subject>public</subject><permission>read</permission></allow></accessPolicy><dateUploaded>2015-11-10T08:32:38.569+00:00</dateUploaded><dateSysMetadataModified>2015-11-10T08:32:38.569+00:00</dateSysMetadataModified><originMemberNode>bogusAuthoritativeNode</originMemberNode><authoritativeMemberNode>bogusAuthoritativeNode</authoritativeMemberNode><seriesId>S1_201531403238555</seriesId></d1_v2.0:systemMetadata> [org.dataone.integration.ContextAwareTestCaseDataone]
20151110-08:32:53: [INFO]: rest call info: POST https://mn-dev-ucsb-2.test.dataone.org/metacat/d1/mn/v2/object; MMP message has: ParamPart:pid = P1_201531403238552; FilePart:object = /tmp/mmp.output.3003334606471568649.tmp (17181 bytes); FilePart:sysmeta = /tmp/mmp.output.8894234579733987719.tmp (946 bytes);  [org.dataone.client.rest.RestClient]
20151110-08:32:53: [INFO]: object created.  pid = P1_201531403238552 [org.dataone.integration.ContextAwareTestCaseDataone]
20151110-08:33:03: [INFO]: Created SID (S1_201531403238555) and head PID (P1_201531403238552) pair. [org.dataone.integration.ContextAwareTestCaseDataone]
20151110-08:33:11: [INFO]: rest call info: GET https://mn-dev-ucsb-2.test.dataone.org/metacat/d1/mn/v2/views/default/S1_201531403238555 [org.dataone.client.rest.RestClient]
20151110-08:33:12: [INFO]: rest call info: GET https://mn-dev-ucsb-2.test.dataone.org/metacat/d1/mn/v2/views/default/P1_201531403238552 [org.dataone.client.rest.RestClient]
20151110-08:33:12: [INFO]: CREATING test object... pid: P1_201531403312212 with a sid: S1_201531403312214 obsoletes: null obsoletedBy: null [org.dataone.integration.ContextAwareTestCaseDataone]
20151110-08:33:12: [INFO]: certificate directory: /etc/dataone/client/testClientCerts/ [org.dataone.integration.ContextAwareTestCaseDataone]
20151110-08:33:12: [INFO]: certificate filename: cnDevUNM2 [org.dataone.integration.ContextAwareTestCaseDataone]
20151110-08:33:12: [INFO]: client setup as Subject: CN=urn:node:cnDevUNM2,DC=dataone,DC=org [org.dataone.integration.ContextAwareTestCaseDataone]
20151110-08:33:12: [WARN]: Unable to find a valid authoritative MN to use for the object: org.dataone.service.types.v1.Identifier@9ff3b298 [org.dataone.integration.ContextAwareTestCaseDataone]
20151110-08:33:12: [INFO]: creating a test object.  pid = P1_201531403312212 on https://mn-dev-unm-2.test.dataone.org/metacat/d1/mn/v2 [org.dataone.integration.ContextAwareTestCaseDataone]
20151110-08:33:12: [INFO]: SystemMetadata for pid: P1_201531403312212
<?xml version="1.0" encoding="UTF-8"?><d1_v2.0:systemMetadata xmlns:d1_v2.0="http://ns.dataone.org/service/types/v2.0" xmlns:d1="http://ns.dataone.org/service/types/v1"><serialVersion>1</serialVersion><identifier>P1_201531403312212</identifier><formatId>eml://ecoinformatics.org/eml-2.0.1</formatId><size>17181</size><checksum algorithm="MD5">03ce09c6b4c3efc1681f3023402998a2</checksum><submitter>CN=urn:node:cnDevUNM2,DC=dataone,DC=org</submitter><rightsHolder>CN=testRightsHolder,DC=dataone,DC=org</rightsHolder><accessPolicy><allow><subject>public</subject><permission>read</permission></allow></accessPolicy><dateUploaded>2015-11-10T08:33:12.229+00:00</dateUploaded><dateSysMetadataModified>2015-11-10T08:33:12.229+00:00</dateSysMetadataModified><originMemberNode>bogusAuthoritativeNode</originMemberNode><authoritativeMemberNode>bogusAuthoritativeNode</authoritativeMemberNode><seriesId>S1_201531403312214</seriesId></d1_v2.0:systemMetadata> [org.dataone.integration.ContextAwareTestCaseDataone]
20151110-08:33:13: [INFO]: rest call info: POST https://mn-dev-unm-2.test.dataone.org/metacat/d1/mn/v2/object; MMP message has: ParamPart:pid = P1_201531403312212; FilePart:object = /tmp/mmp.output.4793222243755129753.tmp (17181 bytes); FilePart:sysmeta = /tmp/mmp.output.8848935769004821544.tmp (946 bytes);  [org.dataone.client.rest.RestClient]
20151110-08:33:13: [INFO]: object created.  pid = P1_201531403312212 [org.dataone.integration.ContextAwareTestCaseDataone]
20151110-08:33:23: [INFO]: Created SID (S1_201531403312214) and head PID (P1_201531403312212) pair. [org.dataone.integration.ContextAwareTestCaseDataone]
20151110-08:33:23: [INFO]: rest call info: GET https://mn-dev-unm-2.test.dataone.org/metacat/d1/mn/v2/views/default/S1_201531403312214 [org.dataone.client.rest.RestClient]
20151110-08:33:23: [INFO]: rest call info: GET https://mn-dev-unm-2.test.dataone.org/metacat/d1/mn/v2/views/default/P1_201531403312212 [org.dataone.client.rest.RestClient]
Tests run: 13, Failures: 11, Errors: 0, Skipped: 1, Time elapsed: 1,150.695 sec <<< FAILURE!

Results :

Failed tests: 
  testGetPackage(org.dataone.integration.it.testImplementations.SidMNTestImplementations): https://mn-dev-ucsb-2.test.dataone.org/metacat/d1/mn/v2 Case: 1 : ServiceFailure : 0 Client_Error : class org.dataone.client.exception.ClientSideException: /Read timed out : class org.dataone.client.exception.ClientSideException: /Read timed out
  testUpdate(org.dataone.integration.it.testImplementations.SidMNTestImplementations): update() Case 1, setup step failed for testUpdate(): couldn't archive().
  testSidReuse(org.dataone.integration.it.testImplementations.SidMNTestImplementations): testSidReuse() : unable to set up test! : ServiceFailure : class org.dataone.client.exception.ClientSideException: /Read timed out
  testSidReuseDiffChain(org.dataone.integration.it.testImplementations.SidMNTestImplementations): testSidReuseDiffChain() : unable to set up test! : ClientSideException : Unable to create test object!/class org.dataone.client.exception.ClientSideException: /Read timed out
  testGetSystemMetadata(org.dataone.integration.it.testImplementations.SidMNTestImplementations): Case: 0 : nullUnable to create test object!/class org.dataone.client.exception.ClientSideException: /Read timed out  [for host https://mn-dev-ucsb-2.test.dataone.org/metacat/d1/mn/v2 ]
  testGet(org.dataone.integration.it.testImplementations.SidMNTestImplementations): Case: 0 : nullUnable to create test object!/class org.dataone.client.exception.ClientSideException: /Read timed out  [for host https://mn-dev-ucsb-2.test.dataone.org/metacat/d1/mn/v2 ]
  testDescribe(org.dataone.integration.it.testImplementations.SidMNTestImplementations): Case: 0 : nullUnable to create test object!/class org.dataone.client.exception.ClientSideException: /Read timed out  [for host https://mn-dev-ucsb-2.test.dataone.org/metacat/d1/mn/v2 ]
  testCreate(org.dataone.integration.it.testImplementations.SidMNTestImplementations): class org.dataone.client.exception.ClientSideException: /Read timed out  [for host https://mn-dev-ucsb-2.test.dataone.org/metacat/d1/mn/v2 ]
  testDelete(org.dataone.integration.it.testImplementations.SidMNTestImplementations): Case: 0 : nullUnable to create test object!/class org.dataone.client.exception.ClientSideException: /Read timed out  [for host https://mn-dev-ucsb-2.test.dataone.org/metacat/d1/mn/v2 ]
  testListObjects(org.dataone.integration.it.testImplementations.SidMNTestImplementations): Case: 0 : class org.dataone.client.exception.ClientSideException: /Connect to mn-dev-ucsb-2.test.dataone.org:443 [mn-dev-ucsb-2.test.dataone.org/128.111.54.109] failed: connect timed out  [for host https://mn-dev-ucsb-2.test.dataone.org/metacat/d1/mn/v2 ]
  testIsAuthorized(org.dataone.integration.it.testImplementations.SidMNTestImplementations): isAuthorized() Case 1, read permissions should match expected:<true> but was:<false>

Tests run: 13, Failures: 11, Errors: 0, Skipped: 1

[WARNING] File encoding has not been set, using platform encoding UTF-8, i.e. build is platform dependent!
[JENKINS] Recording test results
[INFO] 
[INFO] --- maven-failsafe-plugin:2.8.1:verify (verify) @ d1_integration ---
[INFO] Failsafe report directory: /var/lib/jenkins/jobs/d1_integration_DEV2_MN_sid_functional/workspace/target/failsafe-reports
[WARNING] File encoding has not been set, using platform encoding UTF-8, i.e. build is platform dependent!
[ERROR] There are test failures.

Please refer to /var/lib/jenkins/jobs/d1_integration_DEV2_MN_sid_functional/workspace/target/failsafe-reports for the individual test results.
[JENKINS] Recording test results
Notifying upstream projects of job completion
Join notifier requires a CauseAction
[INFO] ------------------------------------------------------------------------
[INFO] BUILD SUCCESS
[INFO] ------------------------------------------------------------------------
[INFO] Total time: 19:41.156s
[INFO] Finished at: Tue Nov 10 08:33:24 UTC 2015
[INFO] Final Memory: 41M/360M
[INFO] ------------------------------------------------------------------------
Waiting for Jenkins to finish collecting data
[JENKINS] Archiving /var/lib/jenkins/jobs/d1_integration_DEV2_MN_sid_functional/workspace/pom.xml to org.dataone/d1_integration/2.0-SNAPSHOT/d1_integration-2.0-SNAPSHOT.pom
channel stopped
Notifying upstream projects of job completion
Warning: you have no plugins providing access control for builds, so falling back to legacy behavior of permitting any downstream builds to be triggered
Finished: UNSTABLE