SuccessConsole Output

Established TCP socket on 46665
<===[JENKINS REMOTING CAPACITY]===>channel started
Executing Maven:  -B -f /var/lib/jenkins/jobs/d1_cn_service/workspace/d1_cn_rest/pom.xml clean install
[INFO] Scanning for projects...
[WARNING] 
[WARNING] Some problems were encountered while building the effective model for org.dataone.cn:d1_cn_rest:war:2.4.0-SNAPSHOT
[WARNING] 'build.plugins.plugin.version' for org.apache.maven.plugins:maven-compiler-plugin is missing. @ line 47, column 21
[WARNING] 'build.plugins.plugin.version' for org.codehaus.mojo:buildnumber-maven-plugin is missing. @ line 55, column 21
[WARNING] 
[WARNING] It is highly recommended to fix these problems because they threaten the stability of your build.
[WARNING] 
[WARNING] For this reason, future Maven versions might no longer support building such malformed projects.
[WARNING] 
[INFO] 
[INFO] ---------------------< org.dataone.cn:d1_cn_rest >----------------------
[INFO] Building DataONE_Cn_Rest 2.4.0-SNAPSHOT
[INFO] --------------------------------[ war ]---------------------------------
[INFO] Downloading from com.springsource.repository.bundles.external: http://repository.springsource.com/maven/bundles/external/org/dataone/d1_common_java/2.4.0-SNAPSHOT/maven-metadata.xml
[INFO] Downloading from com.springsource.repository.bundles.external: http://repository.springsource.com/maven/bundles/external/org/dataone/d1_libclient_java/2.4.0-SNAPSHOT/maven-metadata.xml
[INFO] Downloading from com.springsource.repository.bundles.release: http://repository.springsource.com/maven/bundles/release/org/dataone/d1_libclient_java/2.4.0-SNAPSHOT/maven-metadata.xml
[INFO] Downloading from com.springsource.repository.bundles.release: http://repository.springsource.com/maven/bundles/release/com/googlecode/foresite-toolkit/foresite/1.0-SNAPSHOT/maven-metadata.xml
[INFO] Downloading from com.springsource.repository.bundles.external: http://repository.springsource.com/maven/bundles/external/com/googlecode/foresite-toolkit/foresite/1.0-SNAPSHOT/maven-metadata.xml
[INFO] Downloading from com.springsource.repository.bundles.release: http://repository.springsource.com/maven/bundles/release/org/dataone/d1_identity_manager/2.4.0-SNAPSHOT/maven-metadata.xml
[INFO] Downloading from com.springsource.repository.bundles.external: http://repository.springsource.com/maven/bundles/external/org/dataone/d1_identity_manager/2.4.0-SNAPSHOT/maven-metadata.xml
[INFO] Downloading from Jibx Maven Repository: http://jibx.sourceforge.net/maven/org/dataone/d1_identity_manager/2.4.0-SNAPSHOT/maven-metadata.xml
[INFO] Downloading from dataone.org: http://maven.dataone.org/org/dataone/d1_identity_manager/2.4.0-SNAPSHOT/maven-metadata.xml
[INFO] Downloaded from dataone.org: http://maven.dataone.org/org/dataone/d1_identity_manager/2.4.0-SNAPSHOT/maven-metadata.xml (780 B at 87 kB/s)
[INFO] Downloading from dataone.org: http://maven.dataone.org/org/dataone/d1_cn_noderegistry/2.4.0-SNAPSHOT/maven-metadata.xml
[INFO] Downloading from com.springsource.repository.bundles.release: http://repository.springsource.com/maven/bundles/release/org/dataone/d1_cn_noderegistry/2.4.0-SNAPSHOT/maven-metadata.xml
[INFO] Downloading from com.springsource.repository.bundles.external: http://repository.springsource.com/maven/bundles/external/org/dataone/d1_cn_noderegistry/2.4.0-SNAPSHOT/maven-metadata.xml
[INFO] Downloading from Jibx Maven Repository: http://jibx.sourceforge.net/maven/org/dataone/d1_cn_noderegistry/2.4.0-SNAPSHOT/maven-metadata.xml
[INFO] Downloaded from dataone.org: http://maven.dataone.org/org/dataone/d1_cn_noderegistry/2.4.0-SNAPSHOT/maven-metadata.xml (779 B at 156 kB/s)
[INFO] Downloading from Jibx Maven Repository: http://jibx.sourceforge.net/maven/org/dataone/d1_cn_common/2.4.0-SNAPSHOT/maven-metadata.xml
[INFO] Downloading from com.springsource.repository.bundles.release: http://repository.springsource.com/maven/bundles/release/org/dataone/d1_cn_common/2.4.0-SNAPSHOT/maven-metadata.xml
[INFO] Downloading from com.springsource.repository.bundles.external: http://repository.springsource.com/maven/bundles/external/org/dataone/d1_cn_common/2.4.0-SNAPSHOT/maven-metadata.xml
[INFO] Downloading from apache.snapshots: https://repository.apache.org/content/repositories/snapshots/org/dataone/d1_cn_common/2.4.0-SNAPSHOT/maven-metadata.xml
[INFO] Downloading from com.springsource.repository.bundles.release: http://repository.springsource.com/maven/bundles/release/org/dataone/d1_portal/2.4.0-SNAPSHOT/maven-metadata.xml
[INFO] Downloading from com.springsource.repository.bundles.external: http://repository.springsource.com/maven/bundles/external/org/dataone/d1_portal/2.4.0-SNAPSHOT/maven-metadata.xml
[INFO] Downloading from com.springsource.repository.bundles.release: http://repository.springsource.com/maven/bundles/release/org/dataone/d1_cn_index_common/2.4.0-SNAPSHOT/maven-metadata.xml
[INFO] Downloading from Jibx Maven Repository: http://jibx.sourceforge.net/maven/org/dataone/d1_cn_index_common/2.4.0-SNAPSHOT/maven-metadata.xml
[INFO] Downloading from com.springsource.repository.bundles.external: http://repository.springsource.com/maven/bundles/external/org/dataone/d1_cn_index_common/2.4.0-SNAPSHOT/maven-metadata.xml
[INFO] Downloading from com.springsource.repository.bundles.external: http://repository.springsource.com/maven/bundles/external/org/dataone/d1_cn_index_generator/2.4.0-SNAPSHOT/maven-metadata.xml
[INFO] Downloading from Jibx Maven Repository: http://jibx.sourceforge.net/maven/org/dataone/d1_cn_index_generator/2.4.0-SNAPSHOT/maven-metadata.xml
[INFO] Downloading from com.springsource.repository.bundles.release: http://repository.springsource.com/maven/bundles/release/org/dataone/d1_cn_index_generator/2.4.0-SNAPSHOT/maven-metadata.xml
[INFO] Downloading from com.springsource.repository.bundles.external: http://repository.springsource.com/maven/bundles/external/org/dataone/d1_test_resources/2.4.0-SNAPSHOT/maven-metadata.xml
[INFO] Downloading from com.springsource.repository.bundles.release: http://repository.springsource.com/maven/bundles/release/org/dataone/d1_test_resources/2.4.0-SNAPSHOT/maven-metadata.xml
[INFO] 
[INFO] --- maven-clean-plugin:2.5:clean (default-clean) @ d1_cn_rest ---
[INFO] 
[INFO] --- buildnumber-maven-plugin:1.4:create (default) @ d1_cn_rest ---
[INFO] Executing: /bin/sh -c cd '/var/lib/jenkins/jobs/d1_cn_service/workspace/d1_cn_rest' && 'svn' '--non-interactive' 'info'
[INFO] Working directory: /var/lib/jenkins/jobs/d1_cn_service/workspace/d1_cn_rest
[INFO] Storing buildNumber: null at timestamp: 1570735972758
[INFO] Executing: /bin/sh -c cd '/var/lib/jenkins/jobs/d1_cn_service/workspace/d1_cn_rest' && 'svn' '--non-interactive' 'info'
[INFO] Working directory: /var/lib/jenkins/jobs/d1_cn_service/workspace/d1_cn_rest
[INFO] Storing buildScmBranch: UNKNOWN_BRANCH
[INFO] 
[INFO] --- maven-resources-plugin:2.4.3:resources (default-resources) @ d1_cn_rest ---
[INFO] Using 'UTF-8' encoding to copy filtered resources.
[INFO] Copying 25 resources
[INFO] Copying 25 resources
[INFO] 
[INFO] --- maven-resources-plugin:2.4.3:copy-resources (exclude-src-resources-beforeTests) @ d1_cn_rest ---
[INFO] Using 'UTF-8' encoding to copy filtered resources.
[INFO] Copying 25 resources
[INFO] 
[INFO] --- maven-compiler-plugin:3.1:compile (default-compile) @ d1_cn_rest ---
[INFO] Changes detected - recompiling the module!
[INFO] Compiling 23 source files to /var/lib/jenkins/jobs/d1_cn_service/workspace/d1_cn_rest/target/classes
[WARNING] /var/lib/jenkins/jobs/d1_cn_service/workspace/d1_cn_rest/src/main/java/org/dataone/cn/rest/v1/RegistryController.java: Some input files use or override a deprecated API.
[WARNING] /var/lib/jenkins/jobs/d1_cn_service/workspace/d1_cn_rest/src/main/java/org/dataone/cn/rest/v1/RegistryController.java: Recompile with -Xlint:deprecation for details.
[WARNING] /var/lib/jenkins/jobs/d1_cn_service/workspace/d1_cn_rest/src/main/java/org/dataone/cn/rest/v1/RegistryController.java: Some input files use unchecked or unsafe operations.
[WARNING] /var/lib/jenkins/jobs/d1_cn_service/workspace/d1_cn_rest/src/main/java/org/dataone/cn/rest/v1/RegistryController.java: Recompile with -Xlint:unchecked for details.
[INFO] 
[INFO] --- maven-resources-plugin:2.4.3:testResources (default-testResources) @ d1_cn_rest ---
[INFO] Using 'UTF-8' encoding to copy filtered resources.
[INFO] Copying 39 resources
[INFO] 
[INFO] --- maven-compiler-plugin:3.1:testCompile (default-testCompile) @ d1_cn_rest ---
[INFO] Changes detected - recompiling the module!
[INFO] Compiling 18 source files to /var/lib/jenkins/jobs/d1_cn_service/workspace/d1_cn_rest/target/test-classes
[WARNING] /var/lib/jenkins/jobs/d1_cn_service/workspace/d1_cn_rest/src/test/java/org/dataone/cn/rest/v1/suite/SuiteTestUnit4Identity.java: /var/lib/jenkins/jobs/d1_cn_service/workspace/d1_cn_rest/src/test/java/org/dataone/cn/rest/v1/suite/SuiteTestUnit4Identity.java uses or overrides a deprecated API.
[WARNING] /var/lib/jenkins/jobs/d1_cn_service/workspace/d1_cn_rest/src/test/java/org/dataone/cn/rest/v1/suite/SuiteTestUnit4Identity.java: Recompile with -Xlint:deprecation for details.
[WARNING] /var/lib/jenkins/jobs/d1_cn_service/workspace/d1_cn_rest/src/test/java/org/dataone/cn/rest/v1/suite/SuiteTestUnit2Core.java: /var/lib/jenkins/jobs/d1_cn_service/workspace/d1_cn_rest/src/test/java/org/dataone/cn/rest/v1/suite/SuiteTestUnit2Core.java uses unchecked or unsafe operations.
[WARNING] /var/lib/jenkins/jobs/d1_cn_service/workspace/d1_cn_rest/src/test/java/org/dataone/cn/rest/v1/suite/SuiteTestUnit2Core.java: Recompile with -Xlint:unchecked for details.
[INFO] 
[INFO] --- maven-surefire-plugin:2.12.4:test (default-test) @ d1_cn_rest ---
[INFO] Surefire report directory: /var/lib/jenkins/jobs/d1_cn_service/workspace/d1_cn_rest/target/surefire-reports

-------------------------------------------------------
 T E S T S
-------------------------------------------------------
Running org.dataone.cn.rest.ServiceDisableFilterTest
 INFO [main] (TestContextManager.java:185) - @TestExecutionListeners is not present for class [class org.dataone.cn.rest.ServiceDisableFilterTest]: using defaults.
 INFO [main] (XmlBeanDefinitionReader.java:315) - Loading XML bean definitions from class path resource [org/dataone/cn/rest/mock-dispatcher.xml]
 INFO [main] (XmlBeanDefinitionReader.java:315) - Loading XML bean definitions from class path resource [org/dataone/cn/rest/mockServiceDisableFilter-beans.xml]
 INFO [main] (AbstractApplicationContext.java:503) - Refreshing org.springframework.web.context.support.GenericWebApplicationContext@69b0fd6f: startup date [Thu Oct 10 19:32:55 UTC 2019]; root of context hierarchy
 INFO [main] (PropertiesLoaderSupport.java:177) - Loading properties file from class path resource [org/dataone/configuration/node.properties]
 INFO [main] (AutowiredAnnotationBeanPostProcessor.java:139) - JSR-330 'javax.inject.Inject' annotation found and supported for autowiring
 INFO [main] (DefaultListableBeanFactory.java:577) - Pre-instantiating singletons in org.springframework.beans.factory.support.DefaultListableBeanFactory@366647c2: defining beans [test,mylog,log4jInitialization,properties,systemMetadata-valid,org.springframework.context.annotation.internalConfigurationAnnotationProcessor,org.springframework.context.annotation.internalAutowiredAnnotationProcessor,org.springframework.context.annotation.internalRequiredAnnotationProcessor,org.springframework.context.annotation.internalCommonAnnotationProcessor,org.springframework.context.annotation.internalPersistenceAnnotationProcessor,org.springframework.context.annotation.ConfigurationClassPostProcessor.importAwareProcessor]; root of factory hierarchy
ERROR [main] (Settings.java:109) - org.apache.commons.configuration.ConfigurationException while loading config file org/dataone/configuration/config.xml. Message: org.apache.commons.configuration.ConfigurationRuntimeException: org.apache.commons.configuration.ConfigurationException: Cannot locate configuration source file:///etc/dataone/node.properties
ERROR [main] (Settings.java:109) - org.apache.commons.configuration.ConfigurationException while loading config file org/dataone/configuration/config.xml. Message: org.apache.commons.configuration.ConfigurationRuntimeException: org.apache.commons.configuration.ConfigurationException: Cannot locate configuration source file:///etc/dataone/index/d1client.properties
 INFO [main] (ServiceDisableFilter.java:54) - init CNServiceDisableFilter
ERROR [main] (Settings.java:109) - org.apache.commons.configuration.ConfigurationException while loading config file org/dataone/configuration/config.xml. Message: org.apache.commons.configuration.ConfigurationRuntimeException: org.apache.commons.configuration.ConfigurationException: Cannot locate configuration source file:///etc/dataone/node.properties
ERROR [main] (Settings.java:109) - org.apache.commons.configuration.ConfigurationException while loading config file org/dataone/configuration/config.xml. Message: org.apache.commons.configuration.ConfigurationRuntimeException: org.apache.commons.configuration.ConfigurationException: Cannot locate configuration source file:///etc/dataone/index/d1client.properties
 INFO [main] (ServiceDisableFilter.java:54) - init CNServiceDisableFilter
This node is set to disabled.
ERROR [main] (Settings.java:109) - org.apache.commons.configuration.ConfigurationException while loading config file org/dataone/configuration/config.xml. Message: org.apache.commons.configuration.ConfigurationRuntimeException: org.apache.commons.configuration.ConfigurationException: Cannot locate configuration source file:///etc/dataone/node.properties
ERROR [main] (Settings.java:109) - org.apache.commons.configuration.ConfigurationException while loading config file org/dataone/configuration/config.xml. Message: org.apache.commons.configuration.ConfigurationRuntimeException: org.apache.commons.configuration.ConfigurationException: Cannot locate configuration source file:///etc/dataone/index/d1client.properties
 INFO [main] (ServiceDisableFilter.java:54) - init CNServiceDisableFilter
<?xml version="1.0" encoding="UTF-8"?>
<d1:systemMetadata xmlns:d1="http://ns.dataone.org/service/types/v1"
	 xmlns:xsi="http://www.w3.org/2001/XMLSchema-instance">
    <serialVersion>1</serialVersion>
    <identifier>aAbBcC12345</identifier>
    <formatId>eml://ecoinformatics.org/eml-2.0.1</formatId>

    <size>0</size>
    <checksum algorithm="SHA-1">2e01e17467891f7c933dbaa00e1459d23db3fe4f</checksum>
    <submitter>uid=jones,o=NCEAS,dc=ecoinformatics,dc=org</submitter>
    <rightsHolder>uid=jones,o=NCEAS,dc=ecoinformatics,dc=org</rightsHolder>
    <accessPolicy>
        <allow>
            <subject>uid=jones,o=NCEAS,dc=ecoinformatics,dc=org</subject>
            <permission>read</permission>
        </allow>
    </accessPolicy>
    <dateUploaded>2006-05-04T18:13:51.000-00:00</dateUploaded>
    <dateSysMetadataModified>2006-05-04T18:13:51.000-00:00</dateSysMetadataModified>
    <originMemberNode>urn:node:testmn</originMemberNode>
    <authoritativeMemberNode>urn:node:testmn</authoritativeMemberNode>
    <replica>
        <replicaMemberNode>urn:node:testmn</replicaMemberNode>
        <replicationStatus>completed</replicationStatus>
        <replicaVerified>2006-05-04T18:13:51.000-00:00</replicaVerified>
    </replica>
    <replica>
        <replicaMemberNode>urn:node:testcn</replicaMemberNode>
        <replicationStatus>completed</replicationStatus>
        <replicaVerified>2006-05-04T18:13:51.000-00:00</replicaVerified>
    </replica>
</d1:systemMetadata>
Tests run: 3, Failures: 0, Errors: 0, Skipped: 0, Time elapsed: 0.828 sec
Running org.dataone.cn.rest.v2.DiagnosticControllerTest
 INFO [main] (TestContextManager.java:185) - @TestExecutionListeners is not present for class [class org.dataone.cn.rest.v2.DiagnosticControllerTest]: using defaults.
 INFO [main] (XmlBeanDefinitionReader.java:315) - Loading XML bean definitions from class path resource [org/dataone/cn/rest/mock-dispatcher.xml]
 INFO [main] (XmlBeanDefinitionReader.java:315) - Loading XML bean definitions from class path resource [org/dataone/cn/rest/v2/mockDiagnosticController-beans.xml]
 INFO [main] (AbstractApplicationContext.java:503) - Refreshing org.springframework.web.context.support.GenericWebApplicationContext@4dd02341: startup date [Thu Oct 10 19:32:56 UTC 2019]; root of context hierarchy
 INFO [main] (AutowiredAnnotationBeanPostProcessor.java:139) - JSR-330 'javax.inject.Inject' annotation found and supported for autowiring
 INFO [main] (DefaultListableBeanFactory.java:577) - Pre-instantiating singletons in org.springframework.beans.factory.support.DefaultListableBeanFactory@6c45ee6e: defining beans [test,mylog,log4jInitialization,systemMetadata-valid,systemMetadata-invalid,solrQueryUri,solrIndexUri,httpComponentsClientHttpRequestFactory,httpService,org.springframework.context.annotation.internalConfigurationAnnotationProcessor,org.springframework.context.annotation.internalAutowiredAnnotationProcessor,org.springframework.context.annotation.internalRequiredAnnotationProcessor,org.springframework.context.annotation.internalCommonAnnotationProcessor,org.springframework.context.annotation.internalPersistenceAnnotationProcessor,mockSolrIndexService,subprocessorUtility,diagnosticControllerV2,org.springframework.context.annotation.ConfigurationClassPostProcessor.importAwareProcessor]; root of factory hierarchy
 WARN [main] (PerformanceLogger.java:19) - Setting up PerformanceLogger: set to enabled? false
 INFO [main] (DiagnosticControllerTest.java:94) - <?xml version="1.0" encoding="UTF-8"?>
<d1_v2.0:systemMetadata xmlns:d1_v2.0="http://ns.dataone.org/service/types/v2.0" 
	xmlns:d1="http://ns.dataone.org/service/types/v1">
    <serialVersion>1</serialVersion>
    <identifier>aAbBcC12345</identifier>
    <formatId>eml://ecoinformatics.org/eml-2.0.1</formatId>
    <size>0</size>
    <checksum algorithm="SHA-1">2e01e17467891f7c933dbaa00e1459d23db3fe4f</checksum>
    <submitter>uid=jones,o=NCEAS,dc=ecoinformatics,dc=org</submitter>
    <rightsHolder>uid=jones,o=NCEAS,dc=ecoinformatics,dc=org</rightsHolder>
    <accessPolicy>
        <allow>
            <subject>uid=jones,o=NCEAS,dc=ecoinformatics,dc=org</subject>
            <permission>read</permission>
        </allow>
    </accessPolicy>
    <obsoletes>Obsoletes0</obsoletes>
    <obsoletedBy>ObsoletedBy0</obsoletedBy>
    <dateUploaded>2006-05-04T18:13:51.000-00:00</dateUploaded>
    <dateSysMetadataModified>2006-05-04T18:13:51.000-00:00</dateSysMetadataModified>
    <originMemberNode>urn:node:testmn</originMemberNode>
    <authoritativeMemberNode>urn:node:testmn</authoritativeMemberNode>
    <replica>
        <replicaMemberNode>urn:node:testmn</replicaMemberNode>
        <replicationStatus>completed</replicationStatus>
        <replicaVerified>2006-05-04T18:13:51.000-00:00</replicaVerified>
    </replica>
    <replica>
        <replicaMemberNode>urn:node:testcn</replicaMemberNode>
        <replicationStatus>completed</replicationStatus>
        <replicaVerified>2006-05-04T18:13:51.000-00:00</replicaVerified>
    </replica>
</d1_v2.0:systemMetadata>
 INFO [main] (DiagnosticController.java:104) - Found filepart sysmeta
Tests run: 2, Failures: 0, Errors: 0, Skipped: 1, Time elapsed: 0.27 sec
Running org.dataone.cn.rest.v1.suite.ARestServiceSuiteTest
 INFO [main] (TestContextManager.java:185) - @TestExecutionListeners is not present for class [class org.dataone.cn.rest.v1.suite.SuiteTestUnit1DisableFilter]: using defaults.
 INFO [main] (TestContextManager.java:185) - @TestExecutionListeners is not present for class [class org.dataone.cn.rest.v1.suite.SuiteTestUnit2Core]: using defaults.
 INFO [main] (TestContextManager.java:185) - @TestExecutionListeners is not present for class [class org.dataone.cn.rest.v1.suite.SuiteTestUnit3Registry]: using defaults.
 INFO [main] (TestContextManager.java:185) - @TestExecutionListeners is not present for class [class org.dataone.cn.rest.v1.suite.SuiteTestUnit4Identity]: using defaults.
 INFO [main] (TestContextManager.java:185) - @TestExecutionListeners is not present for class [class org.dataone.cn.rest.v1.suite.SuiteTestUnit6ResolveFilter]: using defaults.
 INFO [main] (TestContextManager.java:185) - @TestExecutionListeners is not present for class [class org.dataone.cn.rest.v1.suite.SuiteTestUnit5ReadController]: using defaults.
 INFO [main] (TestContextManager.java:185) - @TestExecutionListeners is not present for class [class org.dataone.cn.rest.v2.suite.SuiteTestUnit7Core]: using defaults.
 INFO [main] (DefaultLdapCodecService.java:109) - Registered pre-bundled control factory: 1.3.6.1.4.1.18060.0.0.1
 INFO [main] (DefaultLdapCodecService.java:113) - Registered pre-bundled control factory: 2.16.840.1.113730.3.4.7
 INFO [main] (DefaultLdapCodecService.java:117) - Registered pre-bundled control factory: 2.16.840.1.113730.3.4.2
 INFO [main] (DefaultLdapCodecService.java:121) - Registered pre-bundled control factory: 2.16.840.1.113730.3.4.18
 INFO [main] (DefaultLdapCodecService.java:125) - Registered pre-bundled control factory: 1.2.840.113556.1.4.319
 INFO [main] (DefaultLdapCodecService.java:129) - Registered pre-bundled control factory: 2.16.840.1.113730.3.4.3
 INFO [main] (DefaultLdapCodecService.java:133) - Registered pre-bundled control factory: 1.3.6.1.4.1.4203.1.10.1
 INFO [main] (CodecFactoryUtil.java:98) - Registered pre-bundled control factory: 1.3.6.1.4.1.18060.0.0.1
 INFO [main] (CodecFactoryUtil.java:102) - Registered pre-bundled control factory: 2.16.840.1.113730.3.4.7
 INFO [main] (CodecFactoryUtil.java:106) - Registered pre-bundled control factory: 2.16.840.1.113730.3.4.2
 INFO [main] (CodecFactoryUtil.java:110) - Registered pre-bundled control factory: 2.16.840.1.113730.3.4.18
 INFO [main] (CodecFactoryUtil.java:114) - Registered pre-bundled control factory: 1.2.840.113556.1.4.319
 INFO [main] (CodecFactoryUtil.java:118) - Registered pre-bundled control factory: 2.16.840.1.113730.3.4.3
 INFO [main] (CodecFactoryUtil.java:122) - Registered pre-bundled control factory: 1.3.6.1.4.1.4203.1.10.1
 INFO [main] (CodecFactoryUtil.java:126) - Registered pre-bundled control factory: 1.3.6.1.4.1.42.2.27.8.5.1
 INFO [main] (CodecFactoryUtil.java:131) - Registered pre-bundled control factory: 2.16.840.1.113730.3.4.9
 INFO [main] (CodecFactoryUtil.java:136) - Registered pre-bundled control factory: 2.16.840.1.113730.3.4.10
 INFO [main] (CodecFactoryUtil.java:140) - Registered pre-bundled control factory: 1.3.6.1.4.1.4203.1.9.1.3
 INFO [main] (CodecFactoryUtil.java:144) - Registered pre-bundled control factory: 1.3.6.1.4.1.4203.1.9.1.4
 INFO [main] (CodecFactoryUtil.java:148) - Registered pre-bundled control factory: 1.3.6.1.4.1.4203.1.9.1.1
 INFO [main] (CodecFactoryUtil.java:152) - Registered pre-bundled control factory: 1.3.6.1.4.1.4203.1.9.1.2
 INFO [main] (CodecFactoryUtil.java:156) - Registered pre-bundled control factory: 1.2.840.113556.1.4.473
 INFO [main] (CodecFactoryUtil.java:160) - Registered pre-bundled control factory: 1.2.840.113556.1.4.474
 INFO [main] (CodecFactoryUtil.java:164) - Registered pre-bundled control factory: 1.2.840.113556.1.4.841
 INFO [main] (CodecFactoryUtil.java:168) - Registered pre-bundled control factory: 1.2.840.113556.1.4.417
 INFO [main] (CodecFactoryUtil.java:177) - Registered pre-bundled extended operation factory: 1.3.6.1.1.8
 INFO [main] (CodecFactoryUtil.java:181) - Registered pre-bundled extended operation factory: 1.3.6.1.4.1.18060.0.1.8
 INFO [main] (CodecFactoryUtil.java:185) - Registered pre-bundled extended operation factory: 1.3.6.1.4.1.18060.0.1.3
 INFO [main] (CodecFactoryUtil.java:189) - Registered pre-bundled extended operation factory: 1.3.6.1.4.1.18060.0.1.6
 INFO [main] (CodecFactoryUtil.java:193) - Registered pre-bundled extended operation factory: 1.3.6.1.4.1.18060.0.1.5
 INFO [main] (CodecFactoryUtil.java:197) - Registered pre-bundled extended operation factory: 1.3.6.1.4.1.4203.1.11.1
 INFO [main] (CodecFactoryUtil.java:201) - Registered pre-bundled extended operation factory: 1.3.6.1.4.1.4203.1.11.3
 INFO [main] (CodecFactoryUtil.java:205) - Registered pre-bundled extended operation factory: 1.3.6.1.4.1.1466.20037
 INFO [main] (CacheService.java:131) - no custom cache configuration was set, loading the default cache configuration
 INFO [main] (DefaultSchemaLdifExtractor.java:108) - Schema directory '/tmp/server-work-org/partitions/schema' does NOT exist: extracted state set to false.
 INFO [main] (LdifReader.java:1606) - No version information : assuming version: 1
 INFO [main] (DefaultSchemaManager.java:696) - Loading system enabled schema: 
	Schema Name: system
		Disabled: false
		Owner: uid=admin,ou=system
		Dependencies: []
 INFO [main] (DefaultSchemaManager.java:696) - Loading core enabled schema: 
	Schema Name: core
		Disabled: false
		Owner: uid=admin,ou=system
		Dependencies: [system]
 INFO [main] (DefaultSchemaManager.java:1153) - system schema has already been loaded
 INFO [main] (DefaultSchemaManager.java:1153) - core schema has already been loaded
 INFO [main] (DefaultSchemaManager.java:1153) - system schema has already been loaded
 INFO [main] (DefaultSchemaManager.java:696) - Loading apache enabled schema: 
	Schema Name: apache
		Disabled: false
		Owner: uid=admin,ou=system
		Dependencies: [core, system]
 INFO [main] (DefaultSchemaManager.java:1153) - system schema has already been loaded
 INFO [main] (DefaultSchemaManager.java:696) - Loading apachemeta enabled schema: 
	Schema Name: apachemeta
		Disabled: false
		Owner: uid=admin,ou=system
		Dependencies: [system]
 INFO [main] (DefaultSchemaManager.java:696) - Loading other enabled schema: 
	Schema Name: other
		Disabled: false
		Owner: uid=admin,ou=system
		Dependencies: [core, system, apache, apachemeta]
 INFO [main] (DefaultSchemaManager.java:1153) - core schema has already been loaded
 INFO [main] (DefaultSchemaManager.java:1153) - system schema has already been loaded
 INFO [main] (DefaultSchemaManager.java:1153) - core schema has already been loaded
 INFO [main] (DefaultSchemaManager.java:1153) - system schema has already been loaded
 INFO [main] (DefaultSchemaManager.java:696) - Loading cosine enabled schema: 
	Schema Name: cosine
		Disabled: false
		Owner: uid=admin,ou=system
		Dependencies: [core, system]
 INFO [main] (DefaultSchemaManager.java:696) - Loading inetorgperson enabled schema: 
	Schema Name: inetorgperson
		Disabled: false
		Owner: uid=admin,ou=system
		Dependencies: [core, system, cosine]
 INFO [main] (DefaultSchemaManager.java:1153) - apachemeta schema has already been loaded
 INFO [main] (DefaultSchemaManager.java:1153) - core schema has already been loaded
 INFO [main] (DefaultSchemaManager.java:1153) - core schema has already been loaded
 INFO [main] (DefaultSchemaManager.java:1153) - system schema has already been loaded
 INFO [main] (DefaultSchemaManager.java:696) - Loading krb5kdc enabled schema: 
	Schema Name: krb5kdc
		Disabled: false
		Owner: uid=admin,ou=system
		Dependencies: [core, system]
 INFO [main] (DefaultSchemaManager.java:1153) - core schema has already been loaded
 INFO [main] (DefaultSchemaManager.java:1153) - system schema has already been loaded
 INFO [main] (DefaultSchemaManager.java:696) - Loading java enabled schema: 
	Schema Name: java
		Disabled: false
		Owner: uid=admin,ou=system
		Dependencies: [core, system]
 INFO [main] (DefaultSchemaManager.java:1153) - apache schema has already been loaded
 INFO [main] (DefaultSchemaManager.java:1153) - system schema has already been loaded
 INFO [main] (DefaultSchemaManager.java:1153) - system schema has already been loaded
 INFO [main] (DefaultSchemaManager.java:696) - Loading pwdpolicy enabled schema: 
	Schema Name: pwdpolicy
		Disabled: false
		Owner: uid=admin,ou=system
		Dependencies: [system]
 INFO [main] (DefaultSchemaManager.java:1153) - cosine schema has already been loaded
 INFO [main] (DefaultSchemaManager.java:1153) - core schema has already been loaded
 INFO [main] (DefaultSchemaManager.java:1153) - system schema has already been loaded
 INFO [main] (DefaultSchemaManager.java:696) - Loading collective enabled schema: 
	Schema Name: collective
		Disabled: false
		Owner: uid=admin,ou=system
		Dependencies: [core, system]
 INFO [main] (DefaultSchemaManager.java:1153) - core schema has already been loaded
 INFO [main] (DefaultSchemaManager.java:1153) - apache schema has already been loaded
 INFO [main] (DefaultSchemaManager.java:1153) - system schema has already been loaded
 INFO [main] (DefaultSchemaManager.java:696) - Loading adsconfig enabled schema: 
	Schema Name: adsconfig
		Disabled: false
		Owner: uid=admin,ou=system
		Dependencies: [core, apache, system]
 INFO [main] (LdifReader.java:1606) - No version information : assuming version: 1
 INFO [main] (LdifReader.java:1606) - No version information : assuming version: 1
 INFO [main] (LdifReader.java:1606) - No version information : assuming version: 1
 INFO [main] (LdifReader.java:1606) - No version information : assuming version: 1
 INFO [main] (LdifReader.java:1606) - No version information : assuming version: 1
 INFO [main] (LdifReader.java:1606) - No version information : assuming version: 1
 INFO [main] (LdifReader.java:1606) - No version information : assuming version: 1
 INFO [main] (LdifReader.java:1606) - No version information : assuming version: 1
 INFO [main] (LdifReader.java:1606) - No version information : assuming version: 1
 INFO [main] (LdifReader.java:1606) - No version information : assuming version: 1
 INFO [main] (LdifReader.java:1606) - No version information : assuming version: 1
 WARN [main] (DefaultDirectoryService.java:1246) - ApacheDS shutdown hook has NOT been registered with the runtime.  This default setting for standalone operation has been overriden.
 INFO [main] (CacheService.java:203) - fetching the cache named dnCache
 INFO [main] (CacheService.java:203) - fetching the cache named alias
 INFO [main] (CacheService.java:209) - No cache with name alias exists, creating one
 INFO [main] (CacheService.java:203) - fetching the cache named piar
 INFO [main] (CacheService.java:209) - No cache with name piar exists, creating one
 INFO [main] (CacheService.java:203) - fetching the cache named entryDn
 INFO [main] (CacheService.java:209) - No cache with name entryDn exists, creating one
 INFO [main] (LdifReader.java:1606) - No version information : assuming version: 1
 INFO [main] (LdifReader.java:1606) - No version information : assuming version: 1
 INFO [main] (AbstractValue.java:191) - ERR_04447_CANNOT_NORMALIZE_VALUE Cannot normalize the wrapped value ERR_04226 I do not know how to handle NameAndOptionalUID normalization with objects of class: uidNumber
 INFO [main] (AbstractValue.java:191) - ERR_04447_CANNOT_NORMALIZE_VALUE Cannot normalize the wrapped value ERR_04226 I do not know how to handle NameAndOptionalUID normalization with objects of class: nisPublicKey
 INFO [main] (AbstractValue.java:191) - ERR_04447_CANNOT_NORMALIZE_VALUE Cannot normalize the wrapped value ERR_04226 I do not know how to handle NameAndOptionalUID normalization with objects of class: nisSecretKey
 INFO [main] (LdifReader.java:1606) - No version information : assuming version: 1
 INFO [main] (AbstractValue.java:191) - ERR_04447_CANNOT_NORMALIZE_VALUE Cannot normalize the wrapped value ERR_04226 I do not know how to handle NameAndOptionalUID normalization with objects of class: nisDomain
 INFO [main] (LdifReader.java:1606) - No version information : assuming version: 1
 INFO [main] (LdifReader.java:1606) - No version information : assuming version: 1
 INFO [main] (AbstractValue.java:191) - ERR_04447_CANNOT_NORMALIZE_VALUE Cannot normalize the wrapped value ERR_04226 I do not know how to handle NameAndOptionalUID normalization with objects of class: caseExactIA5SubstringsMatch
 INFO [main] (LdifReader.java:1606) - No version information : assuming version: 1
 INFO [main] (AbstractValue.java:191) - ERR_04447_CANNOT_NORMALIZE_VALUE Cannot normalize the wrapped value ERR_04226 I do not know how to handle NameAndOptionalUID normalization with objects of class: caseExactIA5SubstringsMatch
 INFO [main] (LdifReader.java:1606) - No version information : assuming version: 1
 INFO [main] (LdifReader.java:1606) - No version information : assuming version: 1
 INFO [main] (AbstractValue.java:191) - ERR_04447_CANNOT_NORMALIZE_VALUE Cannot normalize the wrapped value ERR_04226 I do not know how to handle NameAndOptionalUID normalization with objects of class: corbaIor
 INFO [main] (AbstractValue.java:191) - ERR_04447_CANNOT_NORMALIZE_VALUE Cannot normalize the wrapped value ERR_04226 I do not know how to handle NameAndOptionalUID normalization with objects of class: corbaObject
 INFO [main] (AbstractValue.java:191) - ERR_04447_CANNOT_NORMALIZE_VALUE Cannot normalize the wrapped value ERR_04226 I do not know how to handle NameAndOptionalUID normalization with objects of class: corbaRepositoryId
 INFO [main] (AbstractValue.java:191) - ERR_04447_CANNOT_NORMALIZE_VALUE Cannot normalize the wrapped value ERR_04226 I do not know how to handle NameAndOptionalUID normalization with objects of class: sambaPwdLastSet
 INFO [main] (AbstractValue.java:191) - ERR_04447_CANNOT_NORMALIZE_VALUE Cannot normalize the wrapped value ERR_04226 I do not know how to handle NameAndOptionalUID normalization with objects of class: sambaSID
 INFO [main] (AbstractValue.java:191) - ERR_04447_CANNOT_NORMALIZE_VALUE Cannot normalize the wrapped value ERR_04226 I do not know how to handle NameAndOptionalUID normalization with objects of class: sambaDomainName
 INFO [main] (AbstractValue.java:191) - ERR_04447_CANNOT_NORMALIZE_VALUE Cannot normalize the wrapped value ERR_04226 I do not know how to handle NameAndOptionalUID normalization with objects of class: sambaNTPassword
 INFO [main] (AbstractValue.java:191) - ERR_04447_CANNOT_NORMALIZE_VALUE Cannot normalize the wrapped value ERR_04226 I do not know how to handle NameAndOptionalUID normalization with objects of class: sambaTrustFlags
 INFO [main] (AbstractValue.java:191) - ERR_04447_CANNOT_NORMALIZE_VALUE Cannot normalize the wrapped value ERR_04226 I do not know how to handle NameAndOptionalUID normalization with objects of class: gidNumber
 INFO [main] (AbstractValue.java:191) - ERR_04447_CANNOT_NORMALIZE_VALUE Cannot normalize the wrapped value ERR_04226 I do not know how to handle NameAndOptionalUID normalization with objects of class: uidNumber
 INFO [main] (AbstractValue.java:191) - ERR_04447_CANNOT_NORMALIZE_VALUE Cannot normalize the wrapped value ERR_04226 I do not know how to handle NameAndOptionalUID normalization with objects of class: sambaSID
 INFO [main] (AbstractValue.java:191) - ERR_04447_CANNOT_NORMALIZE_VALUE Cannot normalize the wrapped value ERR_04226 I do not know how to handle NameAndOptionalUID normalization with objects of class: sambaSIDList
 INFO [main] (AbstractValue.java:191) - ERR_04447_CANNOT_NORMALIZE_VALUE Cannot normalize the wrapped value ERR_04226 I do not know how to handle NameAndOptionalUID normalization with objects of class: gidNumber
 INFO [main] (AbstractValue.java:191) - ERR_04447_CANNOT_NORMALIZE_VALUE Cannot normalize the wrapped value ERR_04226 I do not know how to handle NameAndOptionalUID normalization with objects of class: sambaGroupType
 INFO [main] (AbstractValue.java:191) - ERR_04447_CANNOT_NORMALIZE_VALUE Cannot normalize the wrapped value ERR_04226 I do not know how to handle NameAndOptionalUID normalization with objects of class: sambaSID
 INFO [main] (AbstractValue.java:191) - ERR_04447_CANNOT_NORMALIZE_VALUE Cannot normalize the wrapped value ERR_04226 I do not know how to handle NameAndOptionalUID normalization with objects of class: sambaAlgorithmicRidBase
 INFO [main] (AbstractValue.java:191) - ERR_04447_CANNOT_NORMALIZE_VALUE Cannot normalize the wrapped value ERR_04226 I do not know how to handle NameAndOptionalUID normalization with objects of class: sambaForceLogoff
 INFO [main] (AbstractValue.java:191) - ERR_04447_CANNOT_NORMALIZE_VALUE Cannot normalize the wrapped value ERR_04226 I do not know how to handle NameAndOptionalUID normalization with objects of class: sambaLockoutDuration
 INFO [main] (AbstractValue.java:191) - ERR_04447_CANNOT_NORMALIZE_VALUE Cannot normalize the wrapped value ERR_04226 I do not know how to handle NameAndOptionalUID normalization with objects of class: sambaLockoutObservationWindow
 INFO [main] (AbstractValue.java:191) - ERR_04447_CANNOT_NORMALIZE_VALUE Cannot normalize the wrapped value ERR_04226 I do not know how to handle NameAndOptionalUID normalization with objects of class: sambaLockoutThreshold
 INFO [main] (AbstractValue.java:191) - ERR_04447_CANNOT_NORMALIZE_VALUE Cannot normalize the wrapped value ERR_04226 I do not know how to handle NameAndOptionalUID normalization with objects of class: sambaLogonToChgPwd
 INFO [main] (AbstractValue.java:191) - ERR_04447_CANNOT_NORMALIZE_VALUE Cannot normalize the wrapped value ERR_04226 I do not know how to handle NameAndOptionalUID normalization with objects of class: sambaMaxPwdAge
 INFO [main] (AbstractValue.java:191) - ERR_04447_CANNOT_NORMALIZE_VALUE Cannot normalize the wrapped value ERR_04226 I do not know how to handle NameAndOptionalUID normalization with objects of class: sambaMinPwdAge
 INFO [main] (AbstractValue.java:191) - ERR_04447_CANNOT_NORMALIZE_VALUE Cannot normalize the wrapped value ERR_04226 I do not know how to handle NameAndOptionalUID normalization with objects of class: sambaMinPwdLength
 INFO [main] (AbstractValue.java:191) - ERR_04447_CANNOT_NORMALIZE_VALUE Cannot normalize the wrapped value ERR_04226 I do not know how to handle NameAndOptionalUID normalization with objects of class: sambaNextGroupRid
 INFO [main] (AbstractValue.java:191) - ERR_04447_CANNOT_NORMALIZE_VALUE Cannot normalize the wrapped value ERR_04226 I do not know how to handle NameAndOptionalUID normalization with objects of class: sambaNextRid
 INFO [main] (AbstractValue.java:191) - ERR_04447_CANNOT_NORMALIZE_VALUE Cannot normalize the wrapped value ERR_04226 I do not know how to handle NameAndOptionalUID normalization with objects of class: sambaNextUserRid
 INFO [main] (AbstractValue.java:191) - ERR_04447_CANNOT_NORMALIZE_VALUE Cannot normalize the wrapped value ERR_04226 I do not know how to handle NameAndOptionalUID normalization with objects of class: sambaPwdHistoryLength
 INFO [main] (AbstractValue.java:191) - ERR_04447_CANNOT_NORMALIZE_VALUE Cannot normalize the wrapped value ERR_04226 I do not know how to handle NameAndOptionalUID normalization with objects of class: sambaRefuseMachinePwdChange
 INFO [main] (AbstractValue.java:191) - ERR_04447_CANNOT_NORMALIZE_VALUE Cannot normalize the wrapped value ERR_04226 I do not know how to handle NameAndOptionalUID normalization with objects of class: sambaDomainName
 INFO [main] (AbstractValue.java:191) - ERR_04447_CANNOT_NORMALIZE_VALUE Cannot normalize the wrapped value ERR_04226 I do not know how to handle NameAndOptionalUID normalization with objects of class: sambaSID
 INFO [main] (AbstractValue.java:191) - ERR_04447_CANNOT_NORMALIZE_VALUE Cannot normalize the wrapped value ERR_04226 I do not know how to handle NameAndOptionalUID normalization with objects of class: sambaShareName
 INFO [main] (AbstractValue.java:191) - ERR_04447_CANNOT_NORMALIZE_VALUE Cannot normalize the wrapped value ERR_04226 I do not know how to handle NameAndOptionalUID normalization with objects of class: sambaSID
 INFO [main] (AbstractValue.java:191) - ERR_04447_CANNOT_NORMALIZE_VALUE Cannot normalize the wrapped value ERR_04226 I do not know how to handle NameAndOptionalUID normalization with objects of class: gidNumber
 INFO [main] (AbstractValue.java:191) - ERR_04447_CANNOT_NORMALIZE_VALUE Cannot normalize the wrapped value ERR_04226 I do not know how to handle NameAndOptionalUID normalization with objects of class: uidNumber
 INFO [main] (AbstractValue.java:191) - ERR_04447_CANNOT_NORMALIZE_VALUE Cannot normalize the wrapped value ERR_04226 I do not know how to handle NameAndOptionalUID normalization with objects of class: sambaPrivilegeList
 INFO [main] (AbstractValue.java:191) - ERR_04447_CANNOT_NORMALIZE_VALUE Cannot normalize the wrapped value ERR_04226 I do not know how to handle NameAndOptionalUID normalization with objects of class: sambaSID
 INFO [main] (AbstractValue.java:191) - ERR_04447_CANNOT_NORMALIZE_VALUE Cannot normalize the wrapped value ERR_04226 I do not know how to handle NameAndOptionalUID normalization with objects of class: sambaBoolOption
 INFO [main] (AbstractValue.java:191) - ERR_04447_CANNOT_NORMALIZE_VALUE Cannot normalize the wrapped value ERR_04226 I do not know how to handle NameAndOptionalUID normalization with objects of class: sambaIntegerOption
 INFO [main] (AbstractValue.java:191) - ERR_04447_CANNOT_NORMALIZE_VALUE Cannot normalize the wrapped value ERR_04226 I do not know how to handle NameAndOptionalUID normalization with objects of class: sambaStringListOption
 INFO [main] (AbstractValue.java:191) - ERR_04447_CANNOT_NORMALIZE_VALUE Cannot normalize the wrapped value ERR_04226 I do not know how to handle NameAndOptionalUID normalization with objects of class: sambaStringOption
 INFO [main] (AbstractValue.java:191) - ERR_04447_CANNOT_NORMALIZE_VALUE Cannot normalize the wrapped value ERR_04226 I do not know how to handle NameAndOptionalUID normalization with objects of class: sambaOptionName
 INFO [main] (AbstractValue.java:191) - ERR_04447_CANNOT_NORMALIZE_VALUE Cannot normalize the wrapped value ERR_04226 I do not know how to handle NameAndOptionalUID normalization with objects of class: sambaAcctFlags
 INFO [main] (AbstractValue.java:191) - ERR_04447_CANNOT_NORMALIZE_VALUE Cannot normalize the wrapped value ERR_04226 I do not know how to handle NameAndOptionalUID normalization with objects of class: sambaBadPasswordCount
 INFO [main] (AbstractValue.java:191) - ERR_04447_CANNOT_NORMALIZE_VALUE Cannot normalize the wrapped value ERR_04226 I do not know how to handle NameAndOptionalUID normalization with objects of class: sambaBadPasswordTime
 INFO [main] (AbstractValue.java:191) - ERR_04447_CANNOT_NORMALIZE_VALUE Cannot normalize the wrapped value ERR_04226 I do not know how to handle NameAndOptionalUID normalization with objects of class: sambaDomainName
 INFO [main] (AbstractValue.java:191) - ERR_04447_CANNOT_NORMALIZE_VALUE Cannot normalize the wrapped value ERR_04226 I do not know how to handle NameAndOptionalUID normalization with objects of class: sambaHomeDrive
 INFO [main] (AbstractValue.java:191) - ERR_04447_CANNOT_NORMALIZE_VALUE Cannot normalize the wrapped value ERR_04226 I do not know how to handle NameAndOptionalUID normalization with objects of class: sambaHomePath
 INFO [main] (AbstractValue.java:191) - ERR_04447_CANNOT_NORMALIZE_VALUE Cannot normalize the wrapped value ERR_04226 I do not know how to handle NameAndOptionalUID normalization with objects of class: sambaKickoffTime
 INFO [main] (AbstractValue.java:191) - ERR_04447_CANNOT_NORMALIZE_VALUE Cannot normalize the wrapped value ERR_04226 I do not know how to handle NameAndOptionalUID normalization with objects of class: sambaLMPassword
 INFO [main] (AbstractValue.java:191) - ERR_04447_CANNOT_NORMALIZE_VALUE Cannot normalize the wrapped value ERR_04226 I do not know how to handle NameAndOptionalUID normalization with objects of class: sambaLogoffTime
 INFO [main] (AbstractValue.java:191) - ERR_04447_CANNOT_NORMALIZE_VALUE Cannot normalize the wrapped value ERR_04226 I do not know how to handle NameAndOptionalUID normalization with objects of class: sambaLogonHours
 INFO [main] (AbstractValue.java:191) - ERR_04447_CANNOT_NORMALIZE_VALUE Cannot normalize the wrapped value ERR_04226 I do not know how to handle NameAndOptionalUID normalization with objects of class: sambaLogonScript
 INFO [main] (AbstractValue.java:191) - ERR_04447_CANNOT_NORMALIZE_VALUE Cannot normalize the wrapped value ERR_04226 I do not know how to handle NameAndOptionalUID normalization with objects of class: sambaLogonTime
 INFO [main] (AbstractValue.java:191) - ERR_04447_CANNOT_NORMALIZE_VALUE Cannot normalize the wrapped value ERR_04226 I do not know how to handle NameAndOptionalUID normalization with objects of class: sambaMungedDial
 INFO [main] (AbstractValue.java:191) - ERR_04447_CANNOT_NORMALIZE_VALUE Cannot normalize the wrapped value ERR_04226 I do not know how to handle NameAndOptionalUID normalization with objects of class: sambaNTPassword
 INFO [main] (AbstractValue.java:191) - ERR_04447_CANNOT_NORMALIZE_VALUE Cannot normalize the wrapped value ERR_04226 I do not know how to handle NameAndOptionalUID normalization with objects of class: sambaPasswordHistory
 INFO [main] (AbstractValue.java:191) - ERR_04447_CANNOT_NORMALIZE_VALUE Cannot normalize the wrapped value ERR_04226 I do not know how to handle NameAndOptionalUID normalization with objects of class: sambaPrimaryGroupSID
 INFO [main] (AbstractValue.java:191) - ERR_04447_CANNOT_NORMALIZE_VALUE Cannot normalize the wrapped value ERR_04226 I do not know how to handle NameAndOptionalUID normalization with objects of class: sambaProfilePath
 INFO [main] (AbstractValue.java:191) - ERR_04447_CANNOT_NORMALIZE_VALUE Cannot normalize the wrapped value ERR_04226 I do not know how to handle NameAndOptionalUID normalization with objects of class: sambaPwdCanChange
 INFO [main] (AbstractValue.java:191) - ERR_04447_CANNOT_NORMALIZE_VALUE Cannot normalize the wrapped value ERR_04226 I do not know how to handle NameAndOptionalUID normalization with objects of class: sambaPwdLastSet
 INFO [main] (AbstractValue.java:191) - ERR_04447_CANNOT_NORMALIZE_VALUE Cannot normalize the wrapped value ERR_04226 I do not know how to handle NameAndOptionalUID normalization with objects of class: sambaPwdMustChange
 INFO [main] (AbstractValue.java:191) - ERR_04447_CANNOT_NORMALIZE_VALUE Cannot normalize the wrapped value ERR_04226 I do not know how to handle NameAndOptionalUID normalization with objects of class: sambaUserWorkstations
 INFO [main] (AbstractValue.java:191) - ERR_04447_CANNOT_NORMALIZE_VALUE Cannot normalize the wrapped value ERR_04226 I do not know how to handle NameAndOptionalUID normalization with objects of class: sambaSID
 INFO [main] (AbstractValue.java:191) - ERR_04447_CANNOT_NORMALIZE_VALUE Cannot normalize the wrapped value ERR_04226 I do not know how to handle NameAndOptionalUID normalization with objects of class: apacheDnsDomainName
 INFO [main] (AbstractValue.java:191) - ERR_04447_CANNOT_NORMALIZE_VALUE Cannot normalize the wrapped value ERR_04226 I do not know how to handle NameAndOptionalUID normalization with objects of class: apacheDnsIpAddress
 INFO [main] (AbstractValue.java:191) - ERR_04447_CANNOT_NORMALIZE_VALUE Cannot normalize the wrapped value ERR_04226 I do not know how to handle NameAndOptionalUID normalization with objects of class: apacheDnsAbstractRecord
 INFO [main] (AbstractValue.java:191) - ERR_04447_CANNOT_NORMALIZE_VALUE Cannot normalize the wrapped value ERR_04226 I do not know how to handle NameAndOptionalUID normalization with objects of class: apacheDnsDomainName
 INFO [main] (AbstractValue.java:191) - ERR_04447_CANNOT_NORMALIZE_VALUE Cannot normalize the wrapped value ERR_04226 I do not know how to handle NameAndOptionalUID normalization with objects of class: apacheDnsAbstractRecord
 INFO [main] (AbstractValue.java:191) - ERR_04447_CANNOT_NORMALIZE_VALUE Cannot normalize the wrapped value ERR_04226 I do not know how to handle NameAndOptionalUID normalization with objects of class: apacheDnsMxPreference
 INFO [main] (AbstractValue.java:191) - ERR_04447_CANNOT_NORMALIZE_VALUE Cannot normalize the wrapped value ERR_04226 I do not know how to handle NameAndOptionalUID normalization with objects of class: apacheDnsDomainName
 INFO [main] (AbstractValue.java:191) - ERR_04447_CANNOT_NORMALIZE_VALUE Cannot normalize the wrapped value ERR_04226 I do not know how to handle NameAndOptionalUID normalization with objects of class: apacheDnsAbstractRecord
 INFO [main] (AbstractValue.java:191) - ERR_04447_CANNOT_NORMALIZE_VALUE Cannot normalize the wrapped value ERR_04226 I do not know how to handle NameAndOptionalUID normalization with objects of class: apacheDnsIpAddress
 INFO [main] (AbstractValue.java:191) - ERR_04447_CANNOT_NORMALIZE_VALUE Cannot normalize the wrapped value ERR_04226 I do not know how to handle NameAndOptionalUID normalization with objects of class: apacheDnsAbstractRecord
 INFO [main] (AbstractValue.java:191) - ERR_04447_CANNOT_NORMALIZE_VALUE Cannot normalize the wrapped value ERR_04226 I do not know how to handle NameAndOptionalUID normalization with objects of class: apacheDnsDomainName
 INFO [main] (AbstractValue.java:191) - ERR_04447_CANNOT_NORMALIZE_VALUE Cannot normalize the wrapped value ERR_04226 I do not know how to handle NameAndOptionalUID normalization with objects of class: apacheDnsAbstractRecord
 INFO [main] (AbstractValue.java:191) - ERR_04447_CANNOT_NORMALIZE_VALUE Cannot normalize the wrapped value ERR_04226 I do not know how to handle NameAndOptionalUID normalization with objects of class: apacheDnsDomainName
 INFO [main] (AbstractValue.java:191) - ERR_04447_CANNOT_NORMALIZE_VALUE Cannot normalize the wrapped value ERR_04226 I do not know how to handle NameAndOptionalUID normalization with objects of class: apacheDnsAbstractRecord
 INFO [main] (AbstractValue.java:191) - ERR_04447_CANNOT_NORMALIZE_VALUE Cannot normalize the wrapped value ERR_04226 I do not know how to handle NameAndOptionalUID normalization with objects of class: apacheDnsDomainName
 INFO [main] (AbstractValue.java:191) - ERR_04447_CANNOT_NORMALIZE_VALUE Cannot normalize the wrapped value ERR_04226 I do not know how to handle NameAndOptionalUID normalization with objects of class: apacheDnsAbstractRecord
 INFO [main] (AbstractValue.java:191) - ERR_04447_CANNOT_NORMALIZE_VALUE Cannot normalize the wrapped value ERR_04226 I do not know how to handle NameAndOptionalUID normalization with objects of class: apacheDnsCharacterString
 INFO [main] (AbstractValue.java:191) - ERR_04447_CANNOT_NORMALIZE_VALUE Cannot normalize the wrapped value ERR_04226 I do not know how to handle NameAndOptionalUID normalization with objects of class: apacheDnsAbstractRecord
 INFO [main] (AbstractValue.java:191) - ERR_04447_CANNOT_NORMALIZE_VALUE Cannot normalize the wrapped value ERR_04226 I do not know how to handle NameAndOptionalUID normalization with objects of class: apacheDnsServicePriority
 INFO [main] (AbstractValue.java:191) - ERR_04447_CANNOT_NORMALIZE_VALUE Cannot normalize the wrapped value ERR_04226 I do not know how to handle NameAndOptionalUID normalization with objects of class: apacheDnsServiceWeight
 INFO [main] (AbstractValue.java:191) - ERR_04447_CANNOT_NORMALIZE_VALUE Cannot normalize the wrapped value ERR_04226 I do not know how to handle NameAndOptionalUID normalization with objects of class: apacheDnsServicePort
 INFO [main] (AbstractValue.java:191) - ERR_04447_CANNOT_NORMALIZE_VALUE Cannot normalize the wrapped value ERR_04226 I do not know how to handle NameAndOptionalUID normalization with objects of class: apacheDnsDomainName
 INFO [main] (AbstractValue.java:191) - ERR_04447_CANNOT_NORMALIZE_VALUE Cannot normalize the wrapped value ERR_04226 I do not know how to handle NameAndOptionalUID normalization with objects of class: apacheDnsAbstractRecord
 INFO [main] (AbstractValue.java:191) - ERR_04447_CANNOT_NORMALIZE_VALUE Cannot normalize the wrapped value ERR_04226 I do not know how to handle NameAndOptionalUID normalization with objects of class: apacheDnsTtl
 INFO [main] (AbstractValue.java:191) - ERR_04447_CANNOT_NORMALIZE_VALUE Cannot normalize the wrapped value ERR_04226 I do not know how to handle NameAndOptionalUID normalization with objects of class: apacheDnsClass
 INFO [main] (AbstractValue.java:191) - ERR_04447_CANNOT_NORMALIZE_VALUE Cannot normalize the wrapped value ERR_04226 I do not know how to handle NameAndOptionalUID normalization with objects of class: apacheDnsSoaSerial
 INFO [main] (AbstractValue.java:191) - ERR_04447_CANNOT_NORMALIZE_VALUE Cannot normalize the wrapped value ERR_04226 I do not know how to handle NameAndOptionalUID normalization with objects of class: apacheDnsSoaRefresh
 INFO [main] (AbstractValue.java:191) - ERR_04447_CANNOT_NORMALIZE_VALUE Cannot normalize the wrapped value ERR_04226 I do not know how to handle NameAndOptionalUID normalization with objects of class: apacheDnsSoaRetry
 INFO [main] (AbstractValue.java:191) - ERR_04447_CANNOT_NORMALIZE_VALUE Cannot normalize the wrapped value ERR_04226 I do not know how to handle NameAndOptionalUID normalization with objects of class: apacheDnsSoaExpire
 INFO [main] (AbstractValue.java:191) - ERR_04447_CANNOT_NORMALIZE_VALUE Cannot normalize the wrapped value ERR_04226 I do not know how to handle NameAndOptionalUID normalization with objects of class: apacheDnsSoaMName
 INFO [main] (AbstractValue.java:191) - ERR_04447_CANNOT_NORMALIZE_VALUE Cannot normalize the wrapped value ERR_04226 I do not know how to handle NameAndOptionalUID normalization with objects of class: apacheDnsSoaRName
 INFO [main] (AbstractValue.java:191) - ERR_04447_CANNOT_NORMALIZE_VALUE Cannot normalize the wrapped value ERR_04226 I do not know how to handle NameAndOptionalUID normalization with objects of class: apacheDnsSoaMinimum
 INFO [main] (AbstractValue.java:191) - ERR_04447_CANNOT_NORMALIZE_VALUE Cannot normalize the wrapped value ERR_04226 I do not know how to handle NameAndOptionalUID normalization with objects of class: apacheDnsAbstractRecord
 INFO [main] (AbstractValue.java:191) - ERR_04447_CANNOT_NORMALIZE_VALUE Cannot normalize the wrapped value ERR_04226 I do not know how to handle NameAndOptionalUID normalization with objects of class: apacheDnsDomainName
 INFO [main] (AbstractValue.java:191) - ERR_04447_CANNOT_NORMALIZE_VALUE Cannot normalize the wrapped value ERR_04226 I do not know how to handle NameAndOptionalUID normalization with objects of class: apacheDnsDomainName
 INFO [main] (AbstractValue.java:191) - ERR_04447_CANNOT_NORMALIZE_VALUE Cannot normalize the wrapped value ERR_04226 I do not know how to handle NameAndOptionalUID normalization with objects of class: dhcpSubnetDN
 INFO [main] (AbstractValue.java:191) - ERR_04447_CANNOT_NORMALIZE_VALUE Cannot normalize the wrapped value ERR_04226 I do not know how to handle NameAndOptionalUID normalization with objects of class: dhcpPoolDN
 INFO [main] (AbstractValue.java:191) - ERR_04447_CANNOT_NORMALIZE_VALUE Cannot normalize the wrapped value ERR_04226 I do not know how to handle NameAndOptionalUID normalization with objects of class: dhcpOptionsDN
 INFO [main] (AbstractValue.java:191) - ERR_04447_CANNOT_NORMALIZE_VALUE Cannot normalize the wrapped value ERR_04226 I do not know how to handle NameAndOptionalUID normalization with objects of class: dhcpStatements
 INFO [main] (AbstractValue.java:191) - ERR_04447_CANNOT_NORMALIZE_VALUE Cannot normalize the wrapped value ERR_04226 I do not know how to handle NameAndOptionalUID normalization with objects of class: dhcpExpirationTime
 INFO [main] (AbstractValue.java:191) - ERR_04447_CANNOT_NORMALIZE_VALUE Cannot normalize the wrapped value ERR_04226 I do not know how to handle NameAndOptionalUID normalization with objects of class: dhcpStartTimeOfState
 INFO [main] (AbstractValue.java:191) - ERR_04447_CANNOT_NORMALIZE_VALUE Cannot normalize the wrapped value ERR_04226 I do not know how to handle NameAndOptionalUID normalization with objects of class: dhcpLastTransactionTime
 INFO [main] (AbstractValue.java:191) - ERR_04447_CANNOT_NORMALIZE_VALUE Cannot normalize the wrapped value ERR_04226 I do not know how to handle NameAndOptionalUID normalization with objects of class: dhcpBootpFlag
 INFO [main] (AbstractValue.java:191) - ERR_04447_CANNOT_NORMALIZE_VALUE Cannot normalize the wrapped value ERR_04226 I do not know how to handle NameAndOptionalUID normalization with objects of class: dhcpDomainName
 INFO [main] (AbstractValue.java:191) - ERR_04447_CANNOT_NORMALIZE_VALUE Cannot normalize the wrapped value ERR_04226 I do not know how to handle NameAndOptionalUID normalization with objects of class: dhcpDnsStatus
 INFO [main] (AbstractValue.java:191) - ERR_04447_CANNOT_NORMALIZE_VALUE Cannot normalize the wrapped value ERR_04226 I do not know how to handle NameAndOptionalUID normalization with objects of class: dhcpRequestedHostName
 INFO [main] (AbstractValue.java:191) - ERR_04447_CANNOT_NORMALIZE_VALUE Cannot normalize the wrapped value ERR_04226 I do not know how to handle NameAndOptionalUID normalization with objects of class: dhcpAssignedHostName
 INFO [main] (AbstractValue.java:191) - ERR_04447_CANNOT_NORMALIZE_VALUE Cannot normalize the wrapped value ERR_04226 I do not know how to handle NameAndOptionalUID normalization with objects of class: dhcpReservedForClient
 INFO [main] (AbstractValue.java:191) - ERR_04447_CANNOT_NORMALIZE_VALUE Cannot normalize the wrapped value ERR_04226 I do not know how to handle NameAndOptionalUID normalization with objects of class: dhcpAssignedToClient
 INFO [main] (AbstractValue.java:191) - ERR_04447_CANNOT_NORMALIZE_VALUE Cannot normalize the wrapped value ERR_04226 I do not know how to handle NameAndOptionalUID normalization with objects of class: dhcpRelayAgentInfo
 INFO [main] (AbstractValue.java:191) - ERR_04447_CANNOT_NORMALIZE_VALUE Cannot normalize the wrapped value ERR_04226 I do not know how to handle NameAndOptionalUID normalization with objects of class: dhcpHWAddress
 INFO [main] (AbstractValue.java:191) - ERR_04447_CANNOT_NORMALIZE_VALUE Cannot normalize the wrapped value ERR_04226 I do not know how to handle NameAndOptionalUID normalization with objects of class: dhcpAddressState
 INFO [main] (AbstractValue.java:191) - ERR_04447_CANNOT_NORMALIZE_VALUE Cannot normalize the wrapped value ERR_04226 I do not know how to handle NameAndOptionalUID normalization with objects of class: dhcpLeaseDN
 INFO [main] (AbstractValue.java:191) - ERR_04447_CANNOT_NORMALIZE_VALUE Cannot normalize the wrapped value ERR_04226 I do not know how to handle NameAndOptionalUID normalization with objects of class: dhcpHWAddress
 INFO [main] (AbstractValue.java:191) - ERR_04447_CANNOT_NORMALIZE_VALUE Cannot normalize the wrapped value ERR_04226 I do not know how to handle NameAndOptionalUID normalization with objects of class: dhcpOptionsDN
 INFO [main] (AbstractValue.java:191) - ERR_04447_CANNOT_NORMALIZE_VALUE Cannot normalize the wrapped value ERR_04226 I do not know how to handle NameAndOptionalUID normalization with objects of class: dhcpStatements
 INFO [main] (AbstractValue.java:191) - ERR_04447_CANNOT_NORMALIZE_VALUE Cannot normalize the wrapped value ERR_04226 I do not know how to handle NameAndOptionalUID normalization with objects of class: dhcpRange
 INFO [main] (AbstractValue.java:191) - ERR_04447_CANNOT_NORMALIZE_VALUE Cannot normalize the wrapped value ERR_04226 I do not know how to handle NameAndOptionalUID normalization with objects of class: dhcpPoolDN
 INFO [main] (AbstractValue.java:191) - ERR_04447_CANNOT_NORMALIZE_VALUE Cannot normalize the wrapped value ERR_04226 I do not know how to handle NameAndOptionalUID normalization with objects of class: dhcpGroupDN
 INFO [main] (AbstractValue.java:191) - ERR_04447_CANNOT_NORMALIZE_VALUE Cannot normalize the wrapped value ERR_04226 I do not know how to handle NameAndOptionalUID normalization with objects of class: dhcpHostDN
 INFO [main] (AbstractValue.java:191) - ERR_04447_CANNOT_NORMALIZE_VALUE Cannot normalize the wrapped value ERR_04226 I do not know how to handle NameAndOptionalUID normalization with objects of class: dhcpClassesDN
 INFO [main] (AbstractValue.java:191) - ERR_04447_CANNOT_NORMALIZE_VALUE Cannot normalize the wrapped value ERR_04226 I do not know how to handle NameAndOptionalUID normalization with objects of class: dhcpLeasesDN
 INFO [main] (AbstractValue.java:191) - ERR_04447_CANNOT_NORMALIZE_VALUE Cannot normalize the wrapped value ERR_04226 I do not know how to handle NameAndOptionalUID normalization with objects of class: dhcpOptionsDN
 INFO [main] (AbstractValue.java:191) - ERR_04447_CANNOT_NORMALIZE_VALUE Cannot normalize the wrapped value ERR_04226 I do not know how to handle NameAndOptionalUID normalization with objects of class: dhcpStatements
 INFO [main] (AbstractValue.java:191) - ERR_04447_CANNOT_NORMALIZE_VALUE Cannot normalize the wrapped value ERR_04226 I do not know how to handle NameAndOptionalUID normalization with objects of class: dhcpNetMask
 INFO [main] (AbstractValue.java:191) - ERR_04447_CANNOT_NORMALIZE_VALUE Cannot normalize the wrapped value ERR_04226 I do not know how to handle NameAndOptionalUID normalization with objects of class: dhcpAddressState
 INFO [main] (AbstractValue.java:191) - ERR_04447_CANNOT_NORMALIZE_VALUE Cannot normalize the wrapped value ERR_04226 I do not know how to handle NameAndOptionalUID normalization with objects of class: dhcpExpirationTime
 INFO [main] (AbstractValue.java:191) - ERR_04447_CANNOT_NORMALIZE_VALUE Cannot normalize the wrapped value ERR_04226 I do not know how to handle NameAndOptionalUID normalization with objects of class: dhcpStartTimeOfState
 INFO [main] (AbstractValue.java:191) - ERR_04447_CANNOT_NORMALIZE_VALUE Cannot normalize the wrapped value ERR_04226 I do not know how to handle NameAndOptionalUID normalization with objects of class: dhcpLastTransactionTime
 INFO [main] (AbstractValue.java:191) - ERR_04447_CANNOT_NORMALIZE_VALUE Cannot normalize the wrapped value ERR_04226 I do not know how to handle NameAndOptionalUID normalization with objects of class: dhcpBootpFlag
 INFO [main] (AbstractValue.java:191) - ERR_04447_CANNOT_NORMALIZE_VALUE Cannot normalize the wrapped value ERR_04226 I do not know how to handle NameAndOptionalUID normalization with objects of class: dhcpDomainName
 INFO [main] (AbstractValue.java:191) - ERR_04447_CANNOT_NORMALIZE_VALUE Cannot normalize the wrapped value ERR_04226 I do not know how to handle NameAndOptionalUID normalization with objects of class: dhcpDnsStatus
 INFO [main] (AbstractValue.java:191) - ERR_04447_CANNOT_NORMALIZE_VALUE Cannot normalize the wrapped value ERR_04226 I do not know how to handle NameAndOptionalUID normalization with objects of class: dhcpRequestedHostName
 INFO [main] (AbstractValue.java:191) - ERR_04447_CANNOT_NORMALIZE_VALUE Cannot normalize the wrapped value ERR_04226 I do not know how to handle NameAndOptionalUID normalization with objects of class: dhcpAssignedHostName
 INFO [main] (AbstractValue.java:191) - ERR_04447_CANNOT_NORMALIZE_VALUE Cannot normalize the wrapped value ERR_04226 I do not know how to handle NameAndOptionalUID normalization with objects of class: dhcpReservedForClient
 INFO [main] (AbstractValue.java:191) - ERR_04447_CANNOT_NORMALIZE_VALUE Cannot normalize the wrapped value ERR_04226 I do not know how to handle NameAndOptionalUID normalization with objects of class: dhcpAssignedToClient
 INFO [main] (AbstractValue.java:191) - ERR_04447_CANNOT_NORMALIZE_VALUE Cannot normalize the wrapped value ERR_04226 I do not know how to handle NameAndOptionalUID normalization with objects of class: dhcpRelayAgentInfo
 INFO [main] (AbstractValue.java:191) - ERR_04447_CANNOT_NORMALIZE_VALUE Cannot normalize the wrapped value ERR_04226 I do not know how to handle NameAndOptionalUID normalization with objects of class: dhcpHWAddress
 INFO [main] (AbstractValue.java:191) - ERR_04447_CANNOT_NORMALIZE_VALUE Cannot normalize the wrapped value ERR_04226 I do not know how to handle NameAndOptionalUID normalization with objects of class: dhcpErrorLog
 INFO [main] (AbstractValue.java:191) - ERR_04447_CANNOT_NORMALIZE_VALUE Cannot normalize the wrapped value ERR_04226 I do not know how to handle NameAndOptionalUID normalization with objects of class: dhcpSubclassesDN
 INFO [main] (AbstractValue.java:191) - ERR_04447_CANNOT_NORMALIZE_VALUE Cannot normalize the wrapped value ERR_04226 I do not know how to handle NameAndOptionalUID normalization with objects of class: dhcpOptionsDN
 INFO [main] (AbstractValue.java:191) - ERR_04447_CANNOT_NORMALIZE_VALUE Cannot normalize the wrapped value ERR_04226 I do not know how to handle NameAndOptionalUID normalization with objects of class: dhcpStatements
 INFO [main] (AbstractValue.java:191) - ERR_04447_CANNOT_NORMALIZE_VALUE Cannot normalize the wrapped value ERR_04226 I do not know how to handle NameAndOptionalUID normalization with objects of class: dhcpOption
 INFO [main] (AbstractValue.java:191) - ERR_04447_CANNOT_NORMALIZE_VALUE Cannot normalize the wrapped value ERR_04226 I do not know how to handle NameAndOptionalUID normalization with objects of class: dhcpSecondaryDN
 INFO [main] (AbstractValue.java:191) - ERR_04447_CANNOT_NORMALIZE_VALUE Cannot normalize the wrapped value ERR_04226 I do not know how to handle NameAndOptionalUID normalization with objects of class: dhcpSharedNetworkDN
 INFO [main] (AbstractValue.java:191) - ERR_04447_CANNOT_NORMALIZE_VALUE Cannot normalize the wrapped value ERR_04226 I do not know how to handle NameAndOptionalUID normalization with objects of class: dhcpSubnetDN
 INFO [main] (AbstractValue.java:191) - ERR_04447_CANNOT_NORMALIZE_VALUE Cannot normalize the wrapped value ERR_04226 I do not know how to handle NameAndOptionalUID normalization with objects of class: dhcpGroupDN
 INFO [main] (AbstractValue.java:191) - ERR_04447_CANNOT_NORMALIZE_VALUE Cannot normalize the wrapped value ERR_04226 I do not know how to handle NameAndOptionalUID normalization with objects of class: dhcpHostDN
 INFO [main] (AbstractValue.java:191) - ERR_04447_CANNOT_NORMALIZE_VALUE Cannot normalize the wrapped value ERR_04226 I do not know how to handle NameAndOptionalUID normalization with objects of class: dhcpClassesDN
 INFO [main] (AbstractValue.java:191) - ERR_04447_CANNOT_NORMALIZE_VALUE Cannot normalize the wrapped value ERR_04226 I do not know how to handle NameAndOptionalUID normalization with objects of class: dhcpOptionsDN
 INFO [main] (AbstractValue.java:191) - ERR_04447_CANNOT_NORMALIZE_VALUE Cannot normalize the wrapped value ERR_04226 I do not know how to handle NameAndOptionalUID normalization with objects of class: dhcpStatements
 INFO [main] (AbstractValue.java:191) - ERR_04447_CANNOT_NORMALIZE_VALUE Cannot normalize the wrapped value ERR_04226 I do not know how to handle NameAndOptionalUID normalization with objects of class: dhcpPrimaryDN
 INFO [main] (AbstractValue.java:191) - ERR_04447_CANNOT_NORMALIZE_VALUE Cannot normalize the wrapped value ERR_04226 I do not know how to handle NameAndOptionalUID normalization with objects of class: dhcpHostDN
 INFO [main] (AbstractValue.java:191) - ERR_04447_CANNOT_NORMALIZE_VALUE Cannot normalize the wrapped value ERR_04226 I do not know how to handle NameAndOptionalUID normalization with objects of class: dhcpOptionsDN
 INFO [main] (AbstractValue.java:191) - ERR_04447_CANNOT_NORMALIZE_VALUE Cannot normalize the wrapped value ERR_04226 I do not know how to handle NameAndOptionalUID normalization with objects of class: dhcpStatements
 INFO [main] (AbstractValue.java:191) - ERR_04447_CANNOT_NORMALIZE_VALUE Cannot normalize the wrapped value ERR_04226 I do not know how to handle NameAndOptionalUID normalization with objects of class: dhcpVersion
 INFO [main] (AbstractValue.java:191) - ERR_04447_CANNOT_NORMALIZE_VALUE Cannot normalize the wrapped value ERR_04226 I do not know how to handle NameAndOptionalUID normalization with objects of class: dhcpImplementation
 INFO [main] (AbstractValue.java:191) - ERR_04447_CANNOT_NORMALIZE_VALUE Cannot normalize the wrapped value ERR_04226 I do not know how to handle NameAndOptionalUID normalization with objects of class: dhcpHashBucketAssignment
 INFO [main] (AbstractValue.java:191) - ERR_04447_CANNOT_NORMALIZE_VALUE Cannot normalize the wrapped value ERR_04226 I do not know how to handle NameAndOptionalUID normalization with objects of class: dhcpDelayedServiceParameter
 INFO [main] (AbstractValue.java:191) - ERR_04447_CANNOT_NORMALIZE_VALUE Cannot normalize the wrapped value ERR_04226 I do not know how to handle NameAndOptionalUID normalization with objects of class: dhcpMaxClientLeadTime
 INFO [main] (AbstractValue.java:191) - ERR_04447_CANNOT_NORMALIZE_VALUE Cannot normalize the wrapped value ERR_04226 I do not know how to handle NameAndOptionalUID normalization with objects of class: dhcpFailOverEndpointState
 INFO [main] (AbstractValue.java:191) - ERR_04447_CANNOT_NORMALIZE_VALUE Cannot normalize the wrapped value ERR_04226 I do not know how to handle NameAndOptionalUID normalization with objects of class: dhcpStatements
 INFO [main] (AbstractValue.java:191) - ERR_04447_CANNOT_NORMALIZE_VALUE Cannot normalize the wrapped value ERR_04226 I do not know how to handle NameAndOptionalUID normalization with objects of class: dhcpServiceDN
 INFO [main] (AbstractValue.java:191) - ERR_04447_CANNOT_NORMALIZE_VALUE Cannot normalize the wrapped value ERR_04226 I do not know how to handle NameAndOptionalUID normalization with objects of class: dhcpClassesDN
 INFO [main] (AbstractValue.java:191) - ERR_04447_CANNOT_NORMALIZE_VALUE Cannot normalize the wrapped value ERR_04226 I do not know how to handle NameAndOptionalUID normalization with objects of class: dhcpPermitList
 INFO [main] (AbstractValue.java:191) - ERR_04447_CANNOT_NORMALIZE_VALUE Cannot normalize the wrapped value ERR_04226 I do not know how to handle NameAndOptionalUID normalization with objects of class: dhcpLeasesDN
 INFO [main] (AbstractValue.java:191) - ERR_04447_CANNOT_NORMALIZE_VALUE Cannot normalize the wrapped value ERR_04226 I do not know how to handle NameAndOptionalUID normalization with objects of class: dhcpOptionsDN
 INFO [main] (AbstractValue.java:191) - ERR_04447_CANNOT_NORMALIZE_VALUE Cannot normalize the wrapped value ERR_04226 I do not know how to handle NameAndOptionalUID normalization with objects of class: dhcpStatements
 INFO [main] (AbstractValue.java:191) - ERR_04447_CANNOT_NORMALIZE_VALUE Cannot normalize the wrapped value ERR_04226 I do not know how to handle NameAndOptionalUID normalization with objects of class: dhcpRange
 INFO [main] (AbstractValue.java:191) - ERR_04447_CANNOT_NORMALIZE_VALUE Cannot normalize the wrapped value ERR_04226 I do not know how to handle NameAndOptionalUID normalization with objects of class: dhcpClassData
 INFO [main] (AbstractValue.java:191) - ERR_04447_CANNOT_NORMALIZE_VALUE Cannot normalize the wrapped value ERR_04226 I do not know how to handle NameAndOptionalUID normalization with objects of class: dhcpOptionsDN
 INFO [main] (AbstractValue.java:191) - ERR_04447_CANNOT_NORMALIZE_VALUE Cannot normalize the wrapped value ERR_04226 I do not know how to handle NameAndOptionalUID normalization with objects of class: dhcpStatements
 INFO [main] (AbstractValue.java:191) - ERR_04447_CANNOT_NORMALIZE_VALUE Cannot normalize the wrapped value ERR_04226 I do not know how to handle NameAndOptionalUID normalization with objects of class: automountInformation
 INFO [main] (AbstractValue.java:191) - ERR_04447_CANNOT_NORMALIZE_VALUE Cannot normalize the wrapped value ERR_04226 I do not know how to handle NameAndOptionalUID normalization with objects of class: xmozillanickname
 INFO [main] (AbstractValue.java:191) - ERR_04447_CANNOT_NORMALIZE_VALUE Cannot normalize the wrapped value ERR_04226 I do not know how to handle NameAndOptionalUID normalization with objects of class: xmozillausehtmlmail
 INFO [main] (AbstractValue.java:191) - ERR_04447_CANNOT_NORMALIZE_VALUE Cannot normalize the wrapped value ERR_04226 I do not know how to handle NameAndOptionalUID normalization with objects of class: mozillaSecondEmail
 INFO [main] (AbstractValue.java:191) - ERR_04447_CANNOT_NORMALIZE_VALUE Cannot normalize the wrapped value ERR_04226 I do not know how to handle NameAndOptionalUID normalization with objects of class: mozillaPostalAddress2
 INFO [main] (AbstractValue.java:191) - ERR_04447_CANNOT_NORMALIZE_VALUE Cannot normalize the wrapped value ERR_04226 I do not know how to handle NameAndOptionalUID normalization with objects of class: mozillaHomePostalAddress2
 INFO [main] (AbstractValue.java:191) - ERR_04447_CANNOT_NORMALIZE_VALUE Cannot normalize the wrapped value ERR_04226 I do not know how to handle NameAndOptionalUID normalization with objects of class: mozillaHomeLocalityName
 INFO [main] (AbstractValue.java:191) - ERR_04447_CANNOT_NORMALIZE_VALUE Cannot normalize the wrapped value ERR_04226 I do not know how to handle NameAndOptionalUID normalization with objects of class: mozillaHomeState
 INFO [main] (AbstractValue.java:191) - ERR_04447_CANNOT_NORMALIZE_VALUE Cannot normalize the wrapped value ERR_04226 I do not know how to handle NameAndOptionalUID normalization with objects of class: mozillaHomePostalCode
 INFO [main] (AbstractValue.java:191) - ERR_04447_CANNOT_NORMALIZE_VALUE Cannot normalize the wrapped value ERR_04226 I do not know how to handle NameAndOptionalUID normalization with objects of class: mozillaHomeCountryName
 INFO [main] (AbstractValue.java:191) - ERR_04447_CANNOT_NORMALIZE_VALUE Cannot normalize the wrapped value ERR_04226 I do not know how to handle NameAndOptionalUID normalization with objects of class: mozillaHomeFriendlyCountryName
 INFO [main] (AbstractValue.java:191) - ERR_04447_CANNOT_NORMALIZE_VALUE Cannot normalize the wrapped value ERR_04226 I do not know how to handle NameAndOptionalUID normalization with objects of class: homeurl
 INFO [main] (AbstractValue.java:191) - ERR_04447_CANNOT_NORMALIZE_VALUE Cannot normalize the wrapped value ERR_04226 I do not know how to handle NameAndOptionalUID normalization with objects of class: workurl
 INFO [main] (AbstractValue.java:191) - ERR_04447_CANNOT_NORMALIZE_VALUE Cannot normalize the wrapped value ERR_04226 I do not know how to handle NameAndOptionalUID normalization with objects of class: custom1
 INFO [main] (AbstractValue.java:191) - ERR_04447_CANNOT_NORMALIZE_VALUE Cannot normalize the wrapped value ERR_04226 I do not know how to handle NameAndOptionalUID normalization with objects of class: custom2
 INFO [main] (AbstractValue.java:191) - ERR_04447_CANNOT_NORMALIZE_VALUE Cannot normalize the wrapped value ERR_04226 I do not know how to handle NameAndOptionalUID normalization with objects of class: custom3
 INFO [main] (AbstractValue.java:191) - ERR_04447_CANNOT_NORMALIZE_VALUE Cannot normalize the wrapped value ERR_04226 I do not know how to handle NameAndOptionalUID normalization with objects of class: custom4
 INFO [main] (AbstractValue.java:191) - ERR_04447_CANNOT_NORMALIZE_VALUE Cannot normalize the wrapped value ERR_04226 I do not know how to handle NameAndOptionalUID normalization with objects of class: nsAIMid
 INFO [main] (AbstractValue.java:191) - ERR_04447_CANNOT_NORMALIZE_VALUE Cannot normalize the wrapped value ERR_04226 I do not know how to handle NameAndOptionalUID normalization with objects of class: ipProtocolNumber
 INFO [main] (AbstractValue.java:191) - ERR_04447_CANNOT_NORMALIZE_VALUE Cannot normalize the wrapped value ERR_04226 I do not know how to handle NameAndOptionalUID normalization with objects of class: loginShell
 INFO [main] (AbstractValue.java:191) - ERR_04447_CANNOT_NORMALIZE_VALUE Cannot normalize the wrapped value ERR_04226 I do not know how to handle NameAndOptionalUID normalization with objects of class: gecos
 INFO [main] (AbstractValue.java:191) - ERR_04447_CANNOT_NORMALIZE_VALUE Cannot normalize the wrapped value ERR_04226 I do not know how to handle NameAndOptionalUID normalization with objects of class: uidNumber
 INFO [main] (AbstractValue.java:191) - ERR_04447_CANNOT_NORMALIZE_VALUE Cannot normalize the wrapped value ERR_04226 I do not know how to handle NameAndOptionalUID normalization with objects of class: gidNumber
 INFO [main] (AbstractValue.java:191) - ERR_04447_CANNOT_NORMALIZE_VALUE Cannot normalize the wrapped value ERR_04226 I do not know how to handle NameAndOptionalUID normalization with objects of class: homeDirectory
 INFO [main] (AbstractValue.java:191) - ERR_04447_CANNOT_NORMALIZE_VALUE Cannot normalize the wrapped value ERR_04226 I do not know how to handle NameAndOptionalUID normalization with objects of class: nisMapEntry
 INFO [main] (AbstractValue.java:191) - ERR_04447_CANNOT_NORMALIZE_VALUE Cannot normalize the wrapped value ERR_04226 I do not know how to handle NameAndOptionalUID normalization with objects of class: nisMapName
 INFO [main] (AbstractValue.java:191) - ERR_04447_CANNOT_NORMALIZE_VALUE Cannot normalize the wrapped value ERR_04226 I do not know how to handle NameAndOptionalUID normalization with objects of class: nisNetgroupTriple
 INFO [main] (AbstractValue.java:191) - ERR_04447_CANNOT_NORMALIZE_VALUE Cannot normalize the wrapped value ERR_04226 I do not know how to handle NameAndOptionalUID normalization with objects of class: memberNisNetgroup
 INFO [main] (AbstractValue.java:191) - ERR_04447_CANNOT_NORMALIZE_VALUE Cannot normalize the wrapped value ERR_04226 I do not know how to handle NameAndOptionalUID normalization with objects of class: macAddress
 INFO [main] (AbstractValue.java:191) - ERR_04447_CANNOT_NORMALIZE_VALUE Cannot normalize the wrapped value ERR_04226 I do not know how to handle NameAndOptionalUID normalization with objects of class: nisMapName
 INFO [main] (AbstractValue.java:191) - ERR_04447_CANNOT_NORMALIZE_VALUE Cannot normalize the wrapped value ERR_04226 I do not know how to handle NameAndOptionalUID normalization with objects of class: oncRpcNumber
 INFO [main] (AbstractValue.java:191) - ERR_04447_CANNOT_NORMALIZE_VALUE Cannot normalize the wrapped value ERR_04226 I do not know how to handle NameAndOptionalUID normalization with objects of class: shadowLastChange
 INFO [main] (AbstractValue.java:191) - ERR_04447_CANNOT_NORMALIZE_VALUE Cannot normalize the wrapped value ERR_04226 I do not know how to handle NameAndOptionalUID normalization with objects of class: shadowMin
 INFO [main] (AbstractValue.java:191) - ERR_04447_CANNOT_NORMALIZE_VALUE Cannot normalize the wrapped value ERR_04226 I do not know how to handle NameAndOptionalUID normalization with objects of class: shadowMax
 INFO [main] (AbstractValue.java:191) - ERR_04447_CANNOT_NORMALIZE_VALUE Cannot normalize the wrapped value ERR_04226 I do not know how to handle NameAndOptionalUID normalization with objects of class: shadowWarning
 INFO [main] (AbstractValue.java:191) - ERR_04447_CANNOT_NORMALIZE_VALUE Cannot normalize the wrapped value ERR_04226 I do not know how to handle NameAndOptionalUID normalization with objects of class: shadowInactive
 INFO [main] (AbstractValue.java:191) - ERR_04447_CANNOT_NORMALIZE_VALUE Cannot normalize the wrapped value ERR_04226 I do not know how to handle NameAndOptionalUID normalization with objects of class: shadowExpire
 INFO [main] (AbstractValue.java:191) - ERR_04447_CANNOT_NORMALIZE_VALUE Cannot normalize the wrapped value ERR_04226 I do not know how to handle NameAndOptionalUID normalization with objects of class: shadowFlag
 INFO [main] (AbstractValue.java:191) - ERR_04447_CANNOT_NORMALIZE_VALUE Cannot normalize the wrapped value ERR_04226 I do not know how to handle NameAndOptionalUID normalization with objects of class: ipNetmaskNumber
 INFO [main] (AbstractValue.java:191) - ERR_04447_CANNOT_NORMALIZE_VALUE Cannot normalize the wrapped value ERR_04226 I do not know how to handle NameAndOptionalUID normalization with objects of class: ipNetworkNumber
 INFO [main] (AbstractValue.java:191) - ERR_04447_CANNOT_NORMALIZE_VALUE Cannot normalize the wrapped value ERR_04226 I do not know how to handle NameAndOptionalUID normalization with objects of class: ipServicePort
 INFO [main] (AbstractValue.java:191) - ERR_04447_CANNOT_NORMALIZE_VALUE Cannot normalize the wrapped value ERR_04226 I do not know how to handle NameAndOptionalUID normalization with objects of class: ipServiceProtocol
 INFO [main] (AbstractValue.java:191) - ERR_04447_CANNOT_NORMALIZE_VALUE Cannot normalize the wrapped value ERR_04226 I do not know how to handle NameAndOptionalUID normalization with objects of class: ipHostNumber
 INFO [main] (AbstractValue.java:191) - ERR_04447_CANNOT_NORMALIZE_VALUE Cannot normalize the wrapped value ERR_04226 I do not know how to handle NameAndOptionalUID normalization with objects of class: memberUid
 INFO [main] (AbstractValue.java:191) - ERR_04447_CANNOT_NORMALIZE_VALUE Cannot normalize the wrapped value ERR_04226 I do not know how to handle NameAndOptionalUID normalization with objects of class: gidNumber
 INFO [main] (AbstractValue.java:191) - ERR_04447_CANNOT_NORMALIZE_VALUE Cannot normalize the wrapped value ERR_04226 I do not know how to handle NameAndOptionalUID normalization with objects of class: bootFile
 INFO [main] (AbstractValue.java:191) - ERR_04447_CANNOT_NORMALIZE_VALUE Cannot normalize the wrapped value ERR_04226 I do not know how to handle NameAndOptionalUID normalization with objects of class: bootParameter
 INFO [main] (AbstractValue.java:191) - ERR_04447_CANNOT_NORMALIZE_VALUE Cannot normalize the wrapped value ERR_04226 I do not know how to handle NameAndOptionalUID normalization with objects of class: caseExactIA5SubstringsMatch
 INFO [main] (AbstractValue.java:191) - ERR_04447_CANNOT_NORMALIZE_VALUE Cannot normalize the wrapped value ERR_04226 I do not know how to handle NameAndOptionalUID normalization with objects of class: caseExactIA5SubstringsMatch
 INFO [main] (AbstractValue.java:191) - ERR_04447_CANNOT_NORMALIZE_VALUE Cannot normalize the wrapped value ERR_04226 I do not know how to handle NameAndOptionalUID normalization with objects of class: caseExactIA5SubstringsMatch
 INFO [main] (LdifReader.java:1606) - No version information : assuming version: 1
 INFO [main] (LdifReader.java:1606) - No version information : assuming version: 1
 INFO [main] (LdifReader.java:1606) - No version information : assuming version: 1
 INFO [main] (LdifReader.java:1606) - No version information : assuming version: 1
 INFO [main] (LdifReader.java:1606) - No version information : assuming version: 1
 INFO [main] (LdifReader.java:1606) - No version information : assuming version: 1
 INFO [main] (LdifReader.java:1606) - No version information : assuming version: 1
 INFO [main] (LdifReader.java:1606) - No version information : assuming version: 1
 INFO [main] (LdifReader.java:1606) - No version information : assuming version: 1
 INFO [main] (LdifReader.java:1606) - No version information : assuming version: 1
 INFO [main] (LdifReader.java:1606) - No version information : assuming version: 1
 INFO [main] (JdbmIndex.java:172) - Setting CacheRecondManager's cache size to 100
 INFO [main] (JdbmIndex.java:172) - Setting CacheRecondManager's cache size to 100
 INFO [main] (JdbmIndex.java:172) - Setting CacheRecondManager's cache size to 100
 INFO [main] (JdbmIndex.java:172) - Setting CacheRecondManager's cache size to 100
 INFO [main] (JdbmIndex.java:172) - Setting CacheRecondManager's cache size to 100
 INFO [main] (JdbmIndex.java:172) - Setting CacheRecondManager's cache size to 100
 INFO [main] (CacheService.java:203) - fetching the cache named alias
 INFO [main] (CacheService.java:203) - fetching the cache named piar
 INFO [main] (CacheService.java:203) - fetching the cache named entryDn
 INFO [main] (JdbmPartition.java:208) - Setting CacheRecondManager's cache size to 100
 INFO [main] (CacheService.java:203) - fetching the cache named system
 INFO [main] (CacheService.java:209) - No cache with name system exists, creating one
 INFO [main] (TlsKeyGenerator.java:300) - Keys and self signed certificate successfully generated.
 INFO [main] (CacheService.java:203) - fetching the cache named groupCache
 INFO [main] (EventInterceptor.java:92) - Initializing ...
 INFO [main] (EventInterceptor.java:99) - Initialization complete.
 WARN [main] (DefaultDirectoryService.java:1690) - You didn't change the admin password of directory service instance 'org'.  Please update the admin password as soon as possible to prevent a possible security breach.
 INFO [main] (JdbmIndex.java:172) - Setting CacheRecondManager's cache size to 100
 INFO [main] (JdbmIndex.java:172) - Setting CacheRecondManager's cache size to 100
 INFO [main] (JdbmIndex.java:172) - Setting CacheRecondManager's cache size to 100
 INFO [main] (JdbmIndex.java:172) - Setting CacheRecondManager's cache size to 100
 INFO [main] (JdbmIndex.java:172) - Setting CacheRecondManager's cache size to 100
 INFO [main] (JdbmIndex.java:172) - Setting CacheRecondManager's cache size to 100
 INFO [main] (CacheService.java:203) - fetching the cache named alias
 INFO [main] (CacheService.java:203) - fetching the cache named piar
 INFO [main] (CacheService.java:203) - fetching the cache named entryDn
 INFO [main] (JdbmPartition.java:208) - Setting CacheRecondManager's cache size to 100
 INFO [main] (CacheService.java:203) - fetching the cache named org
 INFO [main] (CacheService.java:209) - No cache with name org exists, creating one
 INFO [main] (LdifReader.java:1606) - No version information : assuming version: 1
 INFO [main] (DefaultSchemaManager.java:696) - Loading dataone enabled schema: 
	Schema Name: dataone
		Disabled: false
		Owner: 0.9.2342.19200300.100.1.1=admin,2.5.4.11=system
		Dependencies: [core, system]
 INFO [main] (DefaultSchemaManager.java:696) - Loading dataone enabled schema: 
	Schema Name: dataone
		Disabled: false
		Owner: 0.9.2342.19200300.100.1.1=admin,2.5.4.11=system
		Dependencies: [core, system]
 INFO [main] (LdifReader.java:1606) - No version information : assuming version: 1
 INFO [main] (LdifReader.java:1606) - No version information : assuming version: 1
 INFO [main] (LdifReader.java:1606) - No version information : assuming version: 1
 INFO [main] (LdifReader.java:1606) - No version information : assuming version: 1
 INFO [main] (LdifReader.java:1606) - No version information : assuming version: 1
 INFO [main] (LdapServer.java:689) - Successful bind of an LDAP Service (10389) is completed.
 INFO [main] (LdapServer.java:556) - Ldap service started.
 INFO [main] (XmlBeanDefinitionReader.java:315) - Loading XML bean definitions from class path resource [org/dataone/cn/rest/mock-dispatcher.xml]
 INFO [main] (XmlBeanDefinitionReader.java:315) - Loading XML bean definitions from class path resource [org/dataone/cn/rest/v1/mockResolveFilter-beans.xml]
 INFO [main] (AbstractApplicationContext.java:503) - Refreshing org.springframework.web.context.support.GenericWebApplicationContext@8054fe2: startup date [Thu Oct 10 19:32:59 UTC 2019]; root of context hierarchy
 INFO [main] (PropertiesLoaderSupport.java:177) - Loading properties file from class path resource [org/dataone/configuration/node.properties]
 INFO [main] (AutowiredAnnotationBeanPostProcessor.java:139) - JSR-330 'javax.inject.Inject' annotation found and supported for autowiring
 INFO [main] (DefaultListableBeanFactory.java:577) - Pre-instantiating singletons in org.springframework.beans.factory.support.DefaultListableBeanFactory@7fe07361: defining beans [test,mylog,log4jInitialization,properties,systemMetadata-valid,systemMetadata-valid-disallowed-ascii,systemMetadata-valid-nonAscii-id-utf8,metacat-error,metacat-error-docNotFound,systemMetadata-malformedXML,systemMetadata-noReplicasCompletedStatus,systemMetadata-unregisteredNode,systemMetadata-disabledReplicaNodeIdentifier,nodeRegistryServiceV1,org.springframework.context.annotation.internalConfigurationAnnotationProcessor,org.springframework.context.annotation.internalAutowiredAnnotationProcessor,org.springframework.context.annotation.internalRequiredAnnotationProcessor,org.springframework.context.annotation.internalCommonAnnotationProcessor,org.springframework.context.annotation.internalPersistenceAnnotationProcessor,org.springframework.context.annotation.ConfigurationClassPostProcessor.importAwareProcessor]; root of factory hierarchy
 INFO [main] (ServiceDisableFilter.java:54) - init CNServiceDisableFilter
ERROR [main] (Settings.java:109) - org.apache.commons.configuration.ConfigurationException while loading config file org/dataone/configuration/config.xml. Message: org.apache.commons.configuration.ConfigurationRuntimeException: org.apache.commons.configuration.ConfigurationException: Cannot locate configuration source file:///etc/dataone/node.properties
ERROR [main] (Settings.java:109) - org.apache.commons.configuration.ConfigurationException while loading config file org/dataone/configuration/config.xml. Message: org.apache.commons.configuration.ConfigurationRuntimeException: org.apache.commons.configuration.ConfigurationException: Cannot locate configuration source file:///etc/dataone/index/d1client.properties
 INFO [main] (ServiceDisableFilter.java:54) - init CNServiceDisableFilter
This node is set to disabled.
ERROR [main] (Settings.java:109) - org.apache.commons.configuration.ConfigurationException while loading config file org/dataone/configuration/config.xml. Message: org.apache.commons.configuration.ConfigurationRuntimeException: org.apache.commons.configuration.ConfigurationException: Cannot locate configuration source file:///etc/dataone/node.properties
ERROR [main] (Settings.java:109) - org.apache.commons.configuration.ConfigurationException while loading config file org/dataone/configuration/config.xml. Message: org.apache.commons.configuration.ConfigurationRuntimeException: org.apache.commons.configuration.ConfigurationException: Cannot locate configuration source file:///etc/dataone/index/d1client.properties
 INFO [main] (ServiceDisableFilter.java:54) - init CNServiceDisableFilter
<?xml version="1.0" encoding="UTF-8"?>
<d1:systemMetadata xmlns:d1="http://ns.dataone.org/service/types/v1"
	 xmlns:xsi="http://www.w3.org/2001/XMLSchema-instance">
    <serialVersion>1</serialVersion>
    <identifier>aAbBcC12345</identifier>
    <formatId>eml://ecoinformatics.org/eml-2.0.1</formatId>

    <size>0</size>
    <checksum algorithm="SHA-1">2e01e17467891f7c933dbaa00e1459d23db3fe4f</checksum>
    <submitter>uid=jones,o=NCEAS,dc=ecoinformatics,dc=org</submitter>
    <rightsHolder>uid=jones,o=NCEAS,dc=ecoinformatics,dc=org</rightsHolder>
    <accessPolicy>
        <allow>
            <subject>uid=jones,o=NCEAS,dc=ecoinformatics,dc=org</subject>
            <permission>read</permission>
        </allow>
    </accessPolicy>
    <dateUploaded>2006-05-04T18:13:51.000-00:00</dateUploaded>
    <dateSysMetadataModified>2006-05-04T18:13:51.000-00:00</dateSysMetadataModified>
    <originMemberNode>urn:node:testmn</originMemberNode>
    <authoritativeMemberNode>urn:node:testmn</authoritativeMemberNode>
    <replica>
        <replicaMemberNode>urn:node:testmn</replicaMemberNode>
        <replicationStatus>completed</replicationStatus>
        <replicaVerified>2006-05-04T18:13:51.000-00:00</replicaVerified>
    </replica>
    <replica>
        <replicaMemberNode>urn:node:testcn</replicaMemberNode>
        <replicationStatus>completed</replicationStatus>
        <replicaVerified>2006-05-04T18:13:51.000-00:00</replicaVerified>
    </replica>
</d1:systemMetadata>
 INFO [main] (XmlBeanDefinitionReader.java:315) - Loading XML bean definitions from class path resource [org/dataone/cn/rest/mock-dispatcher.xml]
 INFO [main] (XmlBeanDefinitionReader.java:315) - Loading XML bean definitions from class path resource [org/dataone/cn/rest/v1/mockCoreController-beans.xml]
 INFO [main] (ClassPathScanningCandidateComponentProvider.java:211) - JSR-330 'javax.inject.Named' annotation found and supported for component scanning
 INFO [main] (AbstractApplicationContext.java:503) - Refreshing org.springframework.web.context.support.GenericWebApplicationContext@7cff3f1d: startup date [Thu Oct 10 19:32:59 UTC 2019]; root of context hierarchy
 INFO [main] (PropertiesLoaderSupport.java:177) - Loading properties file from class path resource [org/dataone/configuration/node.properties]
 INFO [main] (AutowiredAnnotationBeanPostProcessor.java:139) - JSR-330 'javax.inject.Inject' annotation found and supported for autowiring
 INFO [main] (DefaultListableBeanFactory.java:577) - Pre-instantiating singletons in org.springframework.beans.factory.support.DefaultListableBeanFactory@2ee39e73: defining beans [test,mylog,log4jInitialization,properties,nodeRegistryServiceV1,reserveIdentifierServiceV1,hzInstance,org.springframework.context.annotation.internalConfigurationAnnotationProcessor,org.springframework.context.annotation.internalAutowiredAnnotationProcessor,org.springframework.context.annotation.internalRequiredAnnotationProcessor,org.springframework.context.annotation.internalCommonAnnotationProcessor,org.springframework.context.annotation.internalPersistenceAnnotationProcessor,dataoneX509CertificateGenerator,ciLogonX509CertificateGenerator,coreControllerV1,org.springframework.context.annotation.ConfigurationClassPostProcessor.importAwareProcessor]; root of factory hierarchy
Oct 10, 2019 7:32:59 PM com.hazelcast.impl.AddressPicker
INFO: Interfaces is disabled, trying to pick one address from TCP-IP config addresses: [127.0.0.1]
Oct 10, 2019 7:32:59 PM com.hazelcast.impl.AddressPicker
WARNING: Picking loopback address [127.0.0.1]; setting 'java.net.preferIPv4Stack' to true.
Oct 10, 2019 7:32:59 PM com.hazelcast.impl.AddressPicker
INFO: Picked Address[127.0.0.1]:15782, using socket ServerSocket[addr=/0:0:0:0:0:0:0:0,localport=15782], bind any local is true
 INFO [main] (?:?) - [127.0.0.1]:15782 [hzTestingIdentifier] Hazelcast Community Edition 2.4.1 (20121213) starting at Address[127.0.0.1]:15782
 INFO [main] (?:?) - [127.0.0.1]:15782 [hzTestingIdentifier] Copyright (C) 2008-2012 Hazelcast.com
 INFO [main] (FactoryImpl.java:387) - [127.0.0.1]:15782 [hzTestingIdentifier] Address[127.0.0.1]:15782 is STARTING
 INFO [hz.hzInstance.ServiceThread] (?:?) - [127.0.0.1]:15782 [hzTestingIdentifier] 


Members [1] {
	Member [127.0.0.1]:15782 this
}

 INFO [main] (FactoryImpl.java:175) - [127.0.0.1]:15782 [hzTestingIdentifier] Address[127.0.0.1]:15782 is STARTED
 INFO [main] (CoreController.java:181) - SHA-1
 INFO [main] (CoreController.java:181) - MD5
 INFO [main] (SuiteTestUnit2Core.java:111) - SHA-1
 INFO [main] (SuiteTestUnit2Core.java:111) - MD5
 INFO [main] (SuiteTestUnit2Core.java:136) - solr
 INFO [main] (SuiteTestUnit2Core.java:136) - spambot
 INFO [main] (SuiteTestUnit2Core.java:167) - Test failReserveIdentifier
 INFO [main] (AbstractX509CertificateGenerator.java:112) - DC=org,DC=cilogon,C=US,O=Test,CN=Mock CIlogon Root CA
 INFO [hz.hzInstance.ServiceThread] (PartitionServiceImpl.java:143) - [127.0.0.1]:15782 [hzTestingIdentifier] Initializing cluster partition table first arrangement...
 INFO [main] (CertificateManager.java:1144) - selectSession: using the default certificate location
 WARN [main] (CertificateManager.java:203) - FileNotFound: No certificate installed in the default location: /tmp/x509up_u107
Oct 10, 2019 7:33:00 PM com.hazelcast.config.ClasspathXmlConfig
INFO: Configuring Hazelcast from 'org/dataone/configuration/hazelcastTestClientConf.xml'.
 INFO [main] (HazelcastClientFactory.java:156) - group hzTestingIdentifier addresses 127.0.0.1:15782
Oct 10, 2019 7:33:00 PM com.hazelcast.client.LifecycleServiceClientImpl
INFO: HazelcastClient is STARTING
 INFO [hz.hzInstance.cached.thread-1] (SocketAcceptor.java:111) - [127.0.0.1]:15782 [hzTestingIdentifier] 15782 is accepting socket connection from /127.0.0.1:40410
 INFO [hz.hzInstance.cached.thread-1] (SocketAcceptor.java:122) - [127.0.0.1]:15782 [hzTestingIdentifier] 15782 accepted socket connection from /127.0.0.1:40410
 INFO [hz.hzInstance.cached.thread-2] (?:?) - [127.0.0.1]:15782 [hzTestingIdentifier] received auth from Connection [/127.0.0.1:40410 -> null] live=true, client=true, type=CLIENT, successfully authenticated
Oct 10, 2019 7:33:00 PM com.hazelcast.client.LifecycleServiceClientImpl
INFO: HazelcastClient is CLIENT_CONNECTION_OPENING
Oct 10, 2019 7:33:00 PM com.hazelcast.client.LifecycleServiceClientImpl
INFO: HazelcastClient is CLIENT_CONNECTION_OPENED
Oct 10, 2019 7:33:00 PM com.hazelcast.client.LifecycleServiceClientImpl
INFO: HazelcastClient is STARTED
 INFO [main] (SuiteTestUnit2Core.java:211) - Test reserveIdentifier
 INFO [main] (CertificateManager.java:1144) - selectSession: using the default certificate location
 INFO [main] (CertificateManager.java:1134) - Did not find a certificate for the subject specified: null
 INFO [main] (CertificateManager.java:858) - ...trying SSLContext protocol: TLSv1.2
 INFO [main] (CertificateManager.java:860) - ...setting SSLContext with protocol: TLSv1.2
 INFO [main] (CertificateManager.java:1008) - creating custom TrustManager
 INFO [main] (CertificateManager.java:355) - certificate.truststore.aux.location=/etc/dataone/truststore
 INFO [main] (CertificateManager.java:372) - shippedCAcerts=/org/dataone/client/auth/d1-trusted-certs.crt
 INFO [main] (CertificateManager.java:415) - loading into client truststore: java.io.InputStreamReader@111a7973
 INFO [main] (CertificateManager.java:426) - 0 alias CN=DataONE Root CA,DC=dataone,DC=org
 INFO [main] (CertificateManager.java:426) - 1 alias CN=DataONE Production CA,DC=dataone,DC=org
 INFO [main] (CertificateManager.java:426) - 2 alias CN=CILogon Basic CA 1,O=CILogon,C=US,DC=cilogon,DC=org
 INFO [main] (CertificateManager.java:426) - 3 alias CN=CILogon OpenID CA 1,O=CILogon,C=US,DC=cilogon,DC=org
 INFO [main] (CertificateManager.java:426) - 4 alias CN=CILogon Silver CA 1,O=CILogon,C=US,DC=cilogon,DC=org
 INFO [main] (CertificateManager.java:426) - 5 alias CN=RapidSSL CA,O=GeoTrust\, Inc.,C=US
 INFO [main] (CertificateManager.java:426) - 6 alias CN=ISRG Root X1,O=Internet Security Research Group,C=US
 INFO [main] (CertificateManager.java:426) - 7 alias CN=DST Root CA X3,O=Digital Signature Trust Co.
 INFO [main] (CertificateManager.java:958) - getSSLConnectionSocketFactory: using allow-all hostname verifier
 WARN [main] (HttpConnectionMonitorService.java:46) - Starting monitor thread
 WARN [main] (HttpConnectionMonitorService.java:65) - registering ConnectionManager...
 WARN [Thread-13] (HttpConnectionMonitorService.java:96) - Starting monitoring...
 INFO [main] (RestClient.java:268) - RestClient.doRequestNoBody, thread(1) call Info: GET https://cn-dev.test.dataone.org/cn/v2/node
 INFO [main] (ExceptionHandler.java:128) - response httpCode: 404
 WARN [main] (D1Client.java:327) - Could not refresh D1Client's NodeLocator, using previous one.
org.dataone.service.exceptions.ServiceFailure: 404: 404: parser for deserializing HTML not written yet.  Providing stripped-down html message body starting next line:
HTTP Status 404 – Not FoundType Status ReportMessage &#47;cn&#47;v2&#47;nodeDescription The origin server did not find a current representation for the target resource or is not willing to disclose that one exists.Apache Tomcat/8.5.39 (Ubuntu)
	at org.dataone.service.util.ExceptionHandler.deserializeHtmlAndThrowException(ExceptionHandler.java:465)
	at org.dataone.service.util.ExceptionHandler.deserializeAndThrowException(ExceptionHandler.java:403)
	at org.dataone.service.util.ExceptionHandler.deserializeAndThrowException(ExceptionHandler.java:344)
	at org.dataone.service.util.ExceptionHandler.filterErrors(ExceptionHandler.java:138)
	at org.dataone.client.rest.HttpMultipartRestClient.doGetRequest(HttpMultipartRestClient.java:343)
	at org.dataone.client.rest.HttpMultipartRestClient.doGetRequest(HttpMultipartRestClient.java:328)
	at org.dataone.client.v2.impl.MultipartCNode.listNodes(MultipartCNode.java:445)
	at org.dataone.client.v2.impl.SettingsContextNodeLocator.getNodeListFromSettingsCN(SettingsContextNodeLocator.java:116)
	at org.dataone.client.v2.impl.SettingsContextNodeLocator.<init>(SettingsContextNodeLocator.java:83)
	at org.dataone.client.v2.itk.D1Client.bestAttemptRefreshNodeLocator(D1Client.java:322)
	at org.dataone.client.v2.itk.D1Client.getCN(D1Client.java:164)
	at org.dataone.service.cn.impl.v2.ReserveIdentifierService.reserveIdentifier(ReserveIdentifierService.java:136)
	at org.dataone.service.cn.impl.v1.ReserveIdentifierService.reserveIdentifier(ReserveIdentifierService.java:78)
	at org.dataone.cn.rest.v1.CoreController.reserveIdentifier(CoreController.java:244)
	at org.dataone.cn.rest.v1.suite.SuiteTestUnit2Core.reserveIdentifier(SuiteTestUnit2Core.java:238)
	at sun.reflect.NativeMethodAccessorImpl.invoke0(Native Method)
	at sun.reflect.NativeMethodAccessorImpl.invoke(NativeMethodAccessorImpl.java:62)
	at sun.reflect.DelegatingMethodAccessorImpl.invoke(DelegatingMethodAccessorImpl.java:43)
	at java.lang.reflect.Method.invoke(Method.java:498)
	at org.junit.runners.model.FrameworkMethod$1.runReflectiveCall(FrameworkMethod.java:44)
	at org.junit.internal.runners.model.ReflectiveCallable.run(ReflectiveCallable.java:15)
	at org.junit.runners.model.FrameworkMethod.invokeExplosively(FrameworkMethod.java:41)
	at org.junit.internal.runners.statements.InvokeMethod.evaluate(InvokeMethod.java:20)
	at org.springframework.test.context.junit4.statements.RunBeforeTestMethodCallbacks.evaluate(RunBeforeTestMethodCallbacks.java:74)
	at org.springframework.test.context.junit4.statements.RunAfterTestMethodCallbacks.evaluate(RunAfterTestMethodCallbacks.java:83)
	at org.springframework.test.context.junit4.statements.SpringRepeat.evaluate(SpringRepeat.java:72)
	at org.springframework.test.context.junit4.SpringJUnit4ClassRunner.runChild(SpringJUnit4ClassRunner.java:231)
	at org.junit.runners.BlockJUnit4ClassRunner.runChild(BlockJUnit4ClassRunner.java:50)
	at org.junit.runners.ParentRunner$3.run(ParentRunner.java:193)
	at org.junit.runners.ParentRunner$1.schedule(ParentRunner.java:52)
	at org.junit.runners.ParentRunner.runChildren(ParentRunner.java:191)
	at org.junit.runners.ParentRunner.access$000(ParentRunner.java:42)
	at org.junit.runners.ParentRunner$2.evaluate(ParentRunner.java:184)
	at org.springframework.test.context.junit4.statements.RunBeforeTestClassCallbacks.evaluate(RunBeforeTestClassCallbacks.java:61)
	at org.springframework.test.context.junit4.statements.RunAfterTestClassCallbacks.evaluate(RunAfterTestClassCallbacks.java:71)
	at org.junit.runners.ParentRunner.run(ParentRunner.java:236)
	at org.springframework.test.context.junit4.SpringJUnit4ClassRunner.run(SpringJUnit4ClassRunner.java:174)
	at org.junit.runners.Suite.runChild(Suite.java:128)
	at org.junit.runners.Suite.runChild(Suite.java:24)
	at org.junit.runners.ParentRunner$3.run(ParentRunner.java:193)
	at org.junit.runners.ParentRunner$1.schedule(ParentRunner.java:52)
	at org.junit.runners.ParentRunner.runChildren(ParentRunner.java:191)
	at org.junit.runners.ParentRunner.access$000(ParentRunner.java:42)
	at org.junit.runners.ParentRunner$2.evaluate(ParentRunner.java:184)
	at org.junit.runners.ParentRunner.run(ParentRunner.java:236)
	at org.dataone.test.apache.directory.server.integ.ApacheDSSuiteRunner.run(ApacheDSSuiteRunner.java:208)
	at org.apache.maven.surefire.junit4.JUnit4Provider.execute(JUnit4Provider.java:252)
	at org.apache.maven.surefire.junit4.JUnit4Provider.executeTestSet(JUnit4Provider.java:141)
	at org.apache.maven.surefire.junit4.JUnit4Provider.invoke(JUnit4Provider.java:112)
	at sun.reflect.NativeMethodAccessorImpl.invoke0(Native Method)
	at sun.reflect.NativeMethodAccessorImpl.invoke(NativeMethodAccessorImpl.java:62)
	at sun.reflect.DelegatingMethodAccessorImpl.invoke(DelegatingMethodAccessorImpl.java:43)
	at java.lang.reflect.Method.invoke(Method.java:498)
	at org.apache.maven.surefire.util.ReflectionUtils.invokeMethodWithArray(ReflectionUtils.java:189)
	at org.apache.maven.surefire.booter.ProviderFactory$ProviderProxy.invoke(ProviderFactory.java:165)
	at org.apache.maven.surefire.booter.ProviderFactory.invokeProvider(ProviderFactory.java:85)
	at org.apache.maven.surefire.booter.ForkedBooter.runSuitesInProcess(ForkedBooter.java:115)
	at org.apache.maven.surefire.booter.ForkedBooter.main(ForkedBooter.java:75)
 WARN [main] (ReserveIdentifierService.java:139) - Exception looking up SID (may or may not be an issue): test16db729002f
org.dataone.service.exceptions.ServiceFailure: Could not get CNode from the underlying context (D1Client.CN_URL)
	at org.dataone.client.v2.itk.D1Client.getCN(D1Client.java:168)
	at org.dataone.service.cn.impl.v2.ReserveIdentifierService.reserveIdentifier(ReserveIdentifierService.java:136)
	at org.dataone.service.cn.impl.v1.ReserveIdentifierService.reserveIdentifier(ReserveIdentifierService.java:78)
	at org.dataone.cn.rest.v1.CoreController.reserveIdentifier(CoreController.java:244)
	at org.dataone.cn.rest.v1.suite.SuiteTestUnit2Core.reserveIdentifier(SuiteTestUnit2Core.java:238)
	at sun.reflect.NativeMethodAccessorImpl.invoke0(Native Method)
	at sun.reflect.NativeMethodAccessorImpl.invoke(NativeMethodAccessorImpl.java:62)
	at sun.reflect.DelegatingMethodAccessorImpl.invoke(DelegatingMethodAccessorImpl.java:43)
	at java.lang.reflect.Method.invoke(Method.java:498)
	at org.junit.runners.model.FrameworkMethod$1.runReflectiveCall(FrameworkMethod.java:44)
	at org.junit.internal.runners.model.ReflectiveCallable.run(ReflectiveCallable.java:15)
	at org.junit.runners.model.FrameworkMethod.invokeExplosively(FrameworkMethod.java:41)
	at org.junit.internal.runners.statements.InvokeMethod.evaluate(InvokeMethod.java:20)
	at org.springframework.test.context.junit4.statements.RunBeforeTestMethodCallbacks.evaluate(RunBeforeTestMethodCallbacks.java:74)
	at org.springframework.test.context.junit4.statements.RunAfterTestMethodCallbacks.evaluate(RunAfterTestMethodCallbacks.java:83)
	at org.springframework.test.context.junit4.statements.SpringRepeat.evaluate(SpringRepeat.java:72)
	at org.springframework.test.context.junit4.SpringJUnit4ClassRunner.runChild(SpringJUnit4ClassRunner.java:231)
	at org.junit.runners.BlockJUnit4ClassRunner.runChild(BlockJUnit4ClassRunner.java:50)
	at org.junit.runners.ParentRunner$3.run(ParentRunner.java:193)
	at org.junit.runners.ParentRunner$1.schedule(ParentRunner.java:52)
	at org.junit.runners.ParentRunner.runChildren(ParentRunner.java:191)
	at org.junit.runners.ParentRunner.access$000(ParentRunner.java:42)
	at org.junit.runners.ParentRunner$2.evaluate(ParentRunner.java:184)
	at org.springframework.test.context.junit4.statements.RunBeforeTestClassCallbacks.evaluate(RunBeforeTestClassCallbacks.java:61)
	at org.springframework.test.context.junit4.statements.RunAfterTestClassCallbacks.evaluate(RunAfterTestClassCallbacks.java:71)
	at org.junit.runners.ParentRunner.run(ParentRunner.java:236)
	at org.springframework.test.context.junit4.SpringJUnit4ClassRunner.run(SpringJUnit4ClassRunner.java:174)
	at org.junit.runners.Suite.runChild(Suite.java:128)
	at org.junit.runners.Suite.runChild(Suite.java:24)
	at org.junit.runners.ParentRunner$3.run(ParentRunner.java:193)
	at org.junit.runners.ParentRunner$1.schedule(ParentRunner.java:52)
	at org.junit.runners.ParentRunner.runChildren(ParentRunner.java:191)
	at org.junit.runners.ParentRunner.access$000(ParentRunner.java:42)
	at org.junit.runners.ParentRunner$2.evaluate(ParentRunner.java:184)
	at org.junit.runners.ParentRunner.run(ParentRunner.java:236)
	at org.dataone.test.apache.directory.server.integ.ApacheDSSuiteRunner.run(ApacheDSSuiteRunner.java:208)
	at org.apache.maven.surefire.junit4.JUnit4Provider.execute(JUnit4Provider.java:252)
	at org.apache.maven.surefire.junit4.JUnit4Provider.executeTestSet(JUnit4Provider.java:141)
	at org.apache.maven.surefire.junit4.JUnit4Provider.invoke(JUnit4Provider.java:112)
	at sun.reflect.NativeMethodAccessorImpl.invoke0(Native Method)
	at sun.reflect.NativeMethodAccessorImpl.invoke(NativeMethodAccessorImpl.java:62)
	at sun.reflect.DelegatingMethodAccessorImpl.invoke(DelegatingMethodAccessorImpl.java:43)
	at java.lang.reflect.Method.invoke(Method.java:498)
	at org.apache.maven.surefire.util.ReflectionUtils.invokeMethodWithArray(ReflectionUtils.java:189)
	at org.apache.maven.surefire.booter.ProviderFactory$ProviderProxy.invoke(ProviderFactory.java:165)
	at org.apache.maven.surefire.booter.ProviderFactory.invokeProvider(ProviderFactory.java:85)
	at org.apache.maven.surefire.booter.ForkedBooter.runSuitesInProcess(ForkedBooter.java:115)
	at org.apache.maven.surefire.booter.ForkedBooter.main(ForkedBooter.java:75)
 INFO [main] (SuiteTestUnit2Core.java:252) - Test generateIdentifier
 INFO [main] (AbstractServiceController.java:304) - 
 INFO [main] (AbstractServiceController.java:313) - request ParameterMap: scheme = UUID
 INFO [main] (AbstractServiceController.java:304) - 
 INFO [main] (AbstractServiceController.java:313) - request ParameterMap: scheme = UUID
 WARN [main] (ReserveIdentifierService.java:139) - Exception looking up SID (may or may not be an issue): urn:uuid:acb7a42e-fd4e-4da4-a32f-058ce4bc6372
org.dataone.service.exceptions.ServiceFailure: Could not get CNode from the underlying context (D1Client.CN_URL)
	at org.dataone.client.v2.itk.D1Client.getCN(D1Client.java:168)
	at org.dataone.service.cn.impl.v2.ReserveIdentifierService.reserveIdentifier(ReserveIdentifierService.java:136)
	at org.dataone.service.cn.impl.v2.ReserveIdentifierService.generateIdentifier(ReserveIdentifierService.java:239)
	at org.dataone.service.cn.impl.v1.ReserveIdentifierService.generateIdentifier(ReserveIdentifierService.java:96)
	at org.dataone.cn.rest.v1.CoreController.generateIdentifier(CoreController.java:291)
	at org.dataone.cn.rest.v1.suite.SuiteTestUnit2Core.generateIdentifier(SuiteTestUnit2Core.java:269)
	at sun.reflect.NativeMethodAccessorImpl.invoke0(Native Method)
	at sun.reflect.NativeMethodAccessorImpl.invoke(NativeMethodAccessorImpl.java:62)
	at sun.reflect.DelegatingMethodAccessorImpl.invoke(DelegatingMethodAccessorImpl.java:43)
	at java.lang.reflect.Method.invoke(Method.java:498)
	at org.junit.runners.model.FrameworkMethod$1.runReflectiveCall(FrameworkMethod.java:44)
	at org.junit.internal.runners.model.ReflectiveCallable.run(ReflectiveCallable.java:15)
	at org.junit.runners.model.FrameworkMethod.invokeExplosively(FrameworkMethod.java:41)
	at org.junit.internal.runners.statements.InvokeMethod.evaluate(InvokeMethod.java:20)
	at org.springframework.test.context.junit4.statements.RunBeforeTestMethodCallbacks.evaluate(RunBeforeTestMethodCallbacks.java:74)
	at org.springframework.test.context.junit4.statements.RunAfterTestMethodCallbacks.evaluate(RunAfterTestMethodCallbacks.java:83)
	at org.springframework.test.context.junit4.statements.SpringRepeat.evaluate(SpringRepeat.java:72)
	at org.springframework.test.context.junit4.SpringJUnit4ClassRunner.runChild(SpringJUnit4ClassRunner.java:231)
	at org.junit.runners.BlockJUnit4ClassRunner.runChild(BlockJUnit4ClassRunner.java:50)
	at org.junit.runners.ParentRunner$3.run(ParentRunner.java:193)
	at org.junit.runners.ParentRunner$1.schedule(ParentRunner.java:52)
	at org.junit.runners.ParentRunner.runChildren(ParentRunner.java:191)
	at org.junit.runners.ParentRunner.access$000(ParentRunner.java:42)
	at org.junit.runners.ParentRunner$2.evaluate(ParentRunner.java:184)
	at org.springframework.test.context.junit4.statements.RunBeforeTestClassCallbacks.evaluate(RunBeforeTestClassCallbacks.java:61)
	at org.springframework.test.context.junit4.statements.RunAfterTestClassCallbacks.evaluate(RunAfterTestClassCallbacks.java:71)
	at org.junit.runners.ParentRunner.run(ParentRunner.java:236)
	at org.springframework.test.context.junit4.SpringJUnit4ClassRunner.run(SpringJUnit4ClassRunner.java:174)
	at org.junit.runners.Suite.runChild(Suite.java:128)
	at org.junit.runners.Suite.runChild(Suite.java:24)
	at org.junit.runners.ParentRunner$3.run(ParentRunner.java:193)
	at org.junit.runners.ParentRunner$1.schedule(ParentRunner.java:52)
	at org.junit.runners.ParentRunner.runChildren(ParentRunner.java:191)
	at org.junit.runners.ParentRunner.access$000(ParentRunner.java:42)
	at org.junit.runners.ParentRunner$2.evaluate(ParentRunner.java:184)
	at org.junit.runners.ParentRunner.run(ParentRunner.java:236)
	at org.dataone.test.apache.directory.server.integ.ApacheDSSuiteRunner.run(ApacheDSSuiteRunner.java:208)
	at org.apache.maven.surefire.junit4.JUnit4Provider.execute(JUnit4Provider.java:252)
	at org.apache.maven.surefire.junit4.JUnit4Provider.executeTestSet(JUnit4Provider.java:141)
	at org.apache.maven.surefire.junit4.JUnit4Provider.invoke(JUnit4Provider.java:112)
	at sun.reflect.NativeMethodAccessorImpl.invoke0(Native Method)
	at sun.reflect.NativeMethodAccessorImpl.invoke(NativeMethodAccessorImpl.java:62)
	at sun.reflect.DelegatingMethodAccessorImpl.invoke(DelegatingMethodAccessorImpl.java:43)
	at java.lang.reflect.Method.invoke(Method.java:498)
	at org.apache.maven.surefire.util.ReflectionUtils.invokeMethodWithArray(ReflectionUtils.java:189)
	at org.apache.maven.surefire.booter.ProviderFactory$ProviderProxy.invoke(ProviderFactory.java:165)
	at org.apache.maven.surefire.booter.ProviderFactory.invokeProvider(ProviderFactory.java:85)
	at org.apache.maven.surefire.booter.ForkedBooter.runSuitesInProcess(ForkedBooter.java:115)
	at org.apache.maven.surefire.booter.ForkedBooter.main(ForkedBooter.java:75)
 INFO [main] (SuiteTestUnit2Core.java:282) - Test reserveIdentifier
 WARN [main] (ReserveIdentifierService.java:139) - Exception looking up SID (may or may not be an issue): test16db72901b4
org.dataone.service.exceptions.ServiceFailure: Could not get CNode from the underlying context (D1Client.CN_URL)
	at org.dataone.client.v2.itk.D1Client.getCN(D1Client.java:168)
	at org.dataone.service.cn.impl.v2.ReserveIdentifierService.reserveIdentifier(ReserveIdentifierService.java:136)
	at org.dataone.service.cn.impl.v1.ReserveIdentifierService.reserveIdentifier(ReserveIdentifierService.java:78)
	at org.dataone.cn.rest.v1.CoreController.reserveIdentifier(CoreController.java:244)
	at org.dataone.cn.rest.v1.suite.SuiteTestUnit2Core.hasReservation(SuiteTestUnit2Core.java:327)
	at sun.reflect.NativeMethodAccessorImpl.invoke0(Native Method)
	at sun.reflect.NativeMethodAccessorImpl.invoke(NativeMethodAccessorImpl.java:62)
	at sun.reflect.DelegatingMethodAccessorImpl.invoke(DelegatingMethodAccessorImpl.java:43)
	at java.lang.reflect.Method.invoke(Method.java:498)
	at org.junit.runners.model.FrameworkMethod$1.runReflectiveCall(FrameworkMethod.java:44)
	at org.junit.internal.runners.model.ReflectiveCallable.run(ReflectiveCallable.java:15)
	at org.junit.runners.model.FrameworkMethod.invokeExplosively(FrameworkMethod.java:41)
	at org.junit.internal.runners.statements.InvokeMethod.evaluate(InvokeMethod.java:20)
	at org.springframework.test.context.junit4.statements.RunBeforeTestMethodCallbacks.evaluate(RunBeforeTestMethodCallbacks.java:74)
	at org.springframework.test.context.junit4.statements.RunAfterTestMethodCallbacks.evaluate(RunAfterTestMethodCallbacks.java:83)
	at org.springframework.test.context.junit4.statements.SpringRepeat.evaluate(SpringRepeat.java:72)
	at org.springframework.test.context.junit4.SpringJUnit4ClassRunner.runChild(SpringJUnit4ClassRunner.java:231)
	at org.junit.runners.BlockJUnit4ClassRunner.runChild(BlockJUnit4ClassRunner.java:50)
	at org.junit.runners.ParentRunner$3.run(ParentRunner.java:193)
	at org.junit.runners.ParentRunner$1.schedule(ParentRunner.java:52)
	at org.junit.runners.ParentRunner.runChildren(ParentRunner.java:191)
	at org.junit.runners.ParentRunner.access$000(ParentRunner.java:42)
	at org.junit.runners.ParentRunner$2.evaluate(ParentRunner.java:184)
	at org.springframework.test.context.junit4.statements.RunBeforeTestClassCallbacks.evaluate(RunBeforeTestClassCallbacks.java:61)
	at org.springframework.test.context.junit4.statements.RunAfterTestClassCallbacks.evaluate(RunAfterTestClassCallbacks.java:71)
	at org.junit.runners.ParentRunner.run(ParentRunner.java:236)
	at org.springframework.test.context.junit4.SpringJUnit4ClassRunner.run(SpringJUnit4ClassRunner.java:174)
	at org.junit.runners.Suite.runChild(Suite.java:128)
	at org.junit.runners.Suite.runChild(Suite.java:24)
	at org.junit.runners.ParentRunner$3.run(ParentRunner.java:193)
	at org.junit.runners.ParentRunner$1.schedule(ParentRunner.java:52)
	at org.junit.runners.ParentRunner.runChildren(ParentRunner.java:191)
	at org.junit.runners.ParentRunner.access$000(ParentRunner.java:42)
	at org.junit.runners.ParentRunner$2.evaluate(ParentRunner.java:184)
	at org.junit.runners.ParentRunner.run(ParentRunner.java:236)
	at org.dataone.test.apache.directory.server.integ.ApacheDSSuiteRunner.run(ApacheDSSuiteRunner.java:208)
	at org.apache.maven.surefire.junit4.JUnit4Provider.execute(JUnit4Provider.java:252)
	at org.apache.maven.surefire.junit4.JUnit4Provider.executeTestSet(JUnit4Provider.java:141)
	at org.apache.maven.surefire.junit4.JUnit4Provider.invoke(JUnit4Provider.java:112)
	at sun.reflect.NativeMethodAccessorImpl.invoke0(Native Method)
	at sun.reflect.NativeMethodAccessorImpl.invoke(NativeMethodAccessorImpl.java:62)
	at sun.reflect.DelegatingMethodAccessorImpl.invoke(DelegatingMethodAccessorImpl.java:43)
	at java.lang.reflect.Method.invoke(Method.java:498)
	at org.apache.maven.surefire.util.ReflectionUtils.invokeMethodWithArray(ReflectionUtils.java:189)
	at org.apache.maven.surefire.booter.ProviderFactory$ProviderProxy.invoke(ProviderFactory.java:165)
	at org.apache.maven.surefire.booter.ProviderFactory.invokeProvider(ProviderFactory.java:85)
	at org.apache.maven.surefire.booter.ForkedBooter.runSuitesInProcess(ForkedBooter.java:115)
	at org.apache.maven.surefire.booter.ForkedBooter.main(ForkedBooter.java:75)
 INFO [main] (CNIdentityLDAPImpl.java:919) - 9 returning DirContext
 INFO [main] (XmlBeanDefinitionReader.java:315) - Loading XML bean definitions from class path resource [org/dataone/cn/rest/mock-dispatcher.xml]
 INFO [main] (XmlBeanDefinitionReader.java:315) - Loading XML bean definitions from class path resource [org/dataone/cn/rest/v1/mockRegistryController-beans.xml]
 INFO [main] (ClassPathScanningCandidateComponentProvider.java:211) - JSR-330 'javax.inject.Named' annotation found and supported for component scanning
 INFO [main] (AbstractApplicationContext.java:503) - Refreshing org.springframework.web.context.support.GenericWebApplicationContext@4c5da4f9: startup date [Thu Oct 10 19:33:01 UTC 2019]; root of context hierarchy
 INFO [main] (AutowiredAnnotationBeanPostProcessor.java:139) - JSR-330 'javax.inject.Inject' annotation found and supported for autowiring
 INFO [main] (DefaultListableBeanFactory.java:577) - Pre-instantiating singletons in org.springframework.beans.factory.support.DefaultListableBeanFactory@36463b09: defining beans [test,mylog,log4jInitialization,mnNodeResource,mnInvalidBaseUrlNodeResource,mnInvalidSubjectNodeResource,nodeRegistryServiceV1,identityServiceV1,dataoneX509CertificateGenerator,ciLogonX509CertificateGenerator,org.springframework.context.annotation.internalConfigurationAnnotationProcessor,org.springframework.context.annotation.internalAutowiredAnnotationProcessor,org.springframework.context.annotation.internalRequiredAnnotationProcessor,org.springframework.context.annotation.internalCommonAnnotationProcessor,org.springframework.context.annotation.internalPersistenceAnnotationProcessor,hazelcastInstance,nodeControllerV1,org.springframework.context.annotation.ConfigurationClassPostProcessor.importAwareProcessor]; root of factory hierarchy
Oct 10, 2019 7:33:01 PM com.hazelcast.impl.AddressPicker
INFO: Interfaces is disabled, trying to pick one address from TCP-IP config addresses: [127.0.0.1]
Oct 10, 2019 7:33:01 PM com.hazelcast.impl.AddressPicker
INFO: Picked Address[127.0.0.1]:25802, using socket ServerSocket[addr=/0:0:0:0:0:0:0:0,localport=25802], bind any local is true
 INFO [main] (?:?) - [127.0.0.1]:25802 [hzProcess] Hazelcast Community Edition 2.4.1 (20121213) starting at Address[127.0.0.1]:25802
 INFO [main] (?:?) - [127.0.0.1]:25802 [hzProcess] Copyright (C) 2008-2012 Hazelcast.com
 INFO [main] (FactoryImpl.java:387) - [127.0.0.1]:25802 [hzProcess] Address[127.0.0.1]:25802 is STARTING
 INFO [hz.hzProcessInstance.ServiceThread] (?:?) - [127.0.0.1]:25802 [hzProcess] 


Members [1] {
	Member [127.0.0.1]:25802 this
}

 INFO [main] (FactoryImpl.java:175) - [127.0.0.1]:25802 [hzProcess] Address[127.0.0.1]:25802 is STARTED
 INFO [main] (RegistryController.java:540) - AdminList entry CN=Chen Lan,O=Test,C=US,DC=cilogon,DC=org
 INFO [main] (RegistryController.java:540) - AdminList entry CN=Test Admin Group,DC=dataone,DC=org
 INFO [main] (RegistryController.java:540) - AdminList entry CN=urn:node:testcn,DC=dataone,DC=org
 INFO [main] (NodeRegistryServiceImpl.java:352) -   nodelist refresh: new cached time: Oct 10, 2019 7:33:01 PM
 INFO [main] (SuiteTestUnit3Registry.java:176) - <?xml version="1.0" encoding="UTF-8"?>

<!--
    Document   : mnNode.xml
    Created on : September 20, 2011, 3:42 PM
    Author     : waltz
    Description:
        Purpose of the document follows.
-->
<d1:node xmlns:d1="http://ns.dataone.org/service/types/v1"
        xmlns:xsi="http://www.w3.org/2001/XMLSchema-instance"
        replicate="true" synchronize="true" type="mn" state="up">
    <identifier>urn:node:testMNv100</identifier>
    <name>testMNv100</name>
    <description>Nowhere Test Member node</description>
    <baseURL>https://testMNv100.nowhere.com/mn</baseURL>
    <services>
        <service name="MNCore" version="v1" available="true"/>
        <service name="MNRead" version="v1" available="true"/>
        <service name="MNAuthorization" version="v1" available="true"/>
        <service name="MNStorage" version="v1" available="true"/>
        <service name="MNReplication" version="v1" available="false"/>
    </services>
    <synchronization>
        <schedule hour="*" mday="*" min="0,5,10,15,20,25,30,35,40,45,50,55" mon="11" sec="30" wday="?" year="2001"/>
        <lastHarvested>1900-01-01T00:00:00.000+00:00</lastHarvested>
        <lastCompleteHarvest>1900-01-01T00:00:00.000+00:00</lastCompleteHarvest>
    </synchronization>
    <subject>CN=testMNv100,DC=dataone,DC=org</subject>
    <contactSubject>CN=TestONE,O=Test,C=US,DC=cilogon,DC=org</contactSubject>
</d1:node>

 INFO [main] (RegistryController.java:405) - Found filepart node
 INFO [main] (CNIdentityLDAPImpl.java:919) - 9 returning DirContext
 INFO [main] (NodeRegistryServiceImpl.java:352) -   nodelist refresh: new cached time: Oct 10, 2019 7:33:01 PM
 INFO [main] (CNIdentityLDAPImpl.java:919) - 9 returning DirContext
 INFO [main] (CNIdentityLDAPImpl.java:919) - 9 returning DirContext
 INFO [main] (CNIdentityLDAPImpl.java:919) - 9 returning DirContext
 INFO [main] (SuiteTestUnit3Registry.java:223) - <?xml version="1.0" encoding="UTF-8"?>

<!--
    Document   : mnNode.xml
    Created on : September 20, 2011, 3:42 PM
    Author     : waltz
    Description:
        Purpose of the document follows.
-->
<d1:node xmlns:d1="http://ns.dataone.org/service/types/v1"
        xmlns:xsi="http://www.w3.org/2001/XMLSchema-instance"
        replicate="true" synchronize="true" type="mn" state="up">
    <identifier>urn:node:testLocalBad</identifier>
    <name>test-local-bad</name>
    <description>Nasty Localhost Test Member node</description>
    <!-- localhost is not allowed in a baseURL -->
    <baseURL>https://localhost:8080/mn</baseURL>
    <services>
        <service name="MNCore" version="v1" available="true"/>
        <service name="MNRead" version="v1" available="true"/>
        <service name="MNAuthorization" version="v1" available="true"/>
        <service name="MNStorage" version="v1" available="true"/>
        <service name="MNReplication" version="v1" available="false"/>
    </services>
    <synchronization>
        <schedule hour="*" mday="*" min="0,5,10,15,20,25,30,35,40,45,50,55" mon="11" sec="30" wday="?" year="2001"/>
        <lastHarvested>1900-01-01T00:00:00.000+00:00</lastHarvested>
        <lastCompleteHarvest>1900-01-01T00:00:00.000+00:00</lastCompleteHarvest>
    </synchronization>
    <subject>cn=testLocalBad,dc=dataone,dc=org</subject>
    <contactSubject>cn=TestONE,o=Test,c=US,dc=cilogon,dc=org</contactSubject>
</d1:node>

 INFO [main] (RegistryController.java:405) - Found filepart node
 INFO [main] (CNIdentityLDAPImpl.java:919) - 9 returning DirContext
 INFO [main] (CNIdentityLDAPImpl.java:919) - 9 returning DirContext
 INFO [main] (CNIdentityLDAPImpl.java:919) - 9 returning DirContext
 INFO [main] (CNIdentityLDAPImpl.java:919) - 9 returning DirContext
 INFO [main] (SuiteTestUnit3Registry.java:274) - <?xml version="1.0" encoding="UTF-8"?>

<!--
    Document   : mnNode.xml
    Created on : September 20, 2011, 3:42 PM
    Author     : waltz
    Description:
        Purpose of the document follows.
-->
<d1:node xmlns:d1="http://ns.dataone.org/service/types/v1"
        xmlns:xsi="http://www.w3.org/2001/XMLSchema-instance"
        replicate="true" synchronize="true" type="mn" state="up">
    <identifier>urn:node:testLocalBad</identifier>
    <name>testLocalBad</name>
    <description>Nowhere Test Member node</description>
    <baseURL>https://testLocalBad.nowhere.com/mn</baseURL>
    <services>
        <service name="MNCore" version="v1" available="true"/>
        <service name="MNRead" version="v1" available="true"/>
        <service name="MNAuthorization" version="v1" available="true"/>
        <service name="MNStorage" version="v1" available="true"/>
        <service name="MNReplication" version="v1" available="false"/>
    </services>
    <synchronization>
        <schedule hour="*" mday="*" min="0,5,10,15,20,25,30,35,40,45,50,55" mon="11" sec="30" wday="?" year="2001"/>
        <lastHarvested>1900-01-01T00:00:00.000+00:00</lastHarvested>
        <lastCompleteHarvest>1900-01-01T00:00:00.000+00:00</lastCompleteHarvest>
    </synchronization>
    <subject>cn=testLocalBad,dc=dataone,dc=org</subject>
    <contactSubject>cn=Victor Salas,o=Test,c=US,dc=cilogon,dc=org</contactSubject>
</d1:node>

 INFO [main] (RegistryController.java:405) - Found filepart node
 INFO [main] (CNIdentityLDAPImpl.java:919) - 9 returning DirContext
 INFO [main] (CNIdentityLDAPImpl.java:919) - 9 returning DirContext
 INFO [main] (CNIdentityLDAPImpl.java:919) - 9 returning DirContext
 INFO [main] (CNIdentityLDAPImpl.java:919) - 9 returning DirContext
 INFO [main] (SuiteTestUnit3Registry.java:306) - DC=org,DC=dataone,CN=urn:node:testMNv1
 INFO [main] (RegistryController.java:229) - Found filepart node
 INFO [main] (NodeRegistryServiceImpl.java:372) - node initial refresh: new cached time: Oct 10, 2019 7:33:01 PM
 INFO [main] (CNIdentityLDAPImpl.java:919) - 9 returning DirContext
 INFO [main] (CNIdentityLDAPImpl.java:919) - 9 returning DirContext
 INFO [main] (CNIdentityLDAPImpl.java:919) - 9 returning DirContext
 INFO [main] (CNIdentityLDAPImpl.java:919) - 9 returning DirContext
 INFO [main] (NodeAccess.java:1076) - Updating Node org.dataone.service.types.v1.NodeReference@c8e4939d ...
 WARN [main] (NodeAccess.java:838) - ?-*-*-*-*-0,5,10,15,20,25,30,35,40,45,50,55-0
 INFO [main] (NodeAccess.java:1151) - Updated NodeCapabilities Node: urn:node:testMNv1
 INFO [main] (NodeRegistryServiceImpl.java:377) - node refresh: new cached time: Oct 10, 2019 7:33:01 PM
 INFO [main] (SuiteTestUnit3Registry.java:332) - sizeContactSubjectList 1
 INFO [main] (RegistryController.java:229) - Found filepart node
 INFO [main] (NodeRegistryServiceImpl.java:352) -   nodelist refresh: new cached time: Oct 10, 2019 7:33:02 PM
 INFO [main] (CNIdentityLDAPImpl.java:919) - 9 returning DirContext
 INFO [main] (CNIdentityLDAPImpl.java:919) - 9 returning DirContext
 INFO [main] (CNIdentityLDAPImpl.java:919) - 9 returning DirContext
 INFO [main] (CNIdentityLDAPImpl.java:919) - 9 returning DirContext
 INFO [main] (NodeAccess.java:1076) - Updating Node org.dataone.service.types.v1.NodeReference@c8e4939d ...
 WARN [main] (NodeAccess.java:838) - ?-*-*-*-*-0,5,10,15,20,25,30,35,40,45,50,55-0
 INFO [main] (NodeAccess.java:1151) - Updated NodeCapabilities Node: urn:node:testMNv1
 INFO [main] (NodeRegistryServiceImpl.java:377) - node refresh: new cached time: Oct 10, 2019 7:33:02 PM
 INFO [main] (RegistryController.java:229) - Found filepart node
 INFO [main] (NodeRegistryServiceImpl.java:352) -   nodelist refresh: new cached time: Oct 10, 2019 7:33:02 PM
 INFO [main] (CNIdentityLDAPImpl.java:919) - 9 returning DirContext
 INFO [main] (CNIdentityLDAPImpl.java:919) - 9 returning DirContext
 INFO [main] (CNIdentityLDAPImpl.java:919) - 9 returning DirContext
 INFO [main] (CNIdentityLDAPImpl.java:919) - 9 returning DirContext
 INFO [main] (CNIdentityLDAPImpl.java:919) - 9 returning DirContext
 INFO [main] (NodeAccess.java:1076) - Updating Node org.dataone.service.types.v1.NodeReference@c8e4939d ...
 WARN [main] (NodeAccess.java:838) - ?-*-*-*-*-0,5,10,15,20,25,30,35,40,45,50,55-0
 INFO [main] (NodeAccess.java:1151) - Updated NodeCapabilities Node: urn:node:testMNv1
 INFO [main] (NodeRegistryServiceImpl.java:377) - node refresh: new cached time: Oct 10, 2019 7:33:02 PM
 INFO [main] (RegistryController.java:229) - Found filepart node
 INFO [main] (NodeRegistryServiceImpl.java:352) -   nodelist refresh: new cached time: Oct 10, 2019 7:33:02 PM
 INFO [main] (CNIdentityLDAPImpl.java:919) - 9 returning DirContext
 INFO [main] (CNIdentityLDAPImpl.java:919) - 9 returning DirContext
 INFO [main] (CNIdentityLDAPImpl.java:919) - 9 returning DirContext
 INFO [main] (CNIdentityLDAPImpl.java:919) - 9 returning DirContext
 INFO [main] (CNIdentityLDAPImpl.java:919) - 9 returning DirContext
 INFO [main] (NodeAccess.java:1076) - Updating Node org.dataone.service.types.v1.NodeReference@c8e4939d ...
 WARN [main] (NodeAccess.java:838) - ?-*-*-*-*-0,5,10,15,20,25,30,35,40,45,50,55-0
 INFO [main] (NodeAccess.java:1151) - Updated NodeCapabilities Node: urn:node:testMNv1
 INFO [main] (NodeRegistryServiceImpl.java:377) - node refresh: new cached time: Oct 10, 2019 7:33:02 PM
 INFO [main] (XmlBeanDefinitionReader.java:315) - Loading XML bean definitions from class path resource [org/dataone/cn/rest/mock-dispatcher.xml]
 INFO [main] (XmlBeanDefinitionReader.java:315) - Loading XML bean definitions from class path resource [org/dataone/cn/rest/v1/mockIdentityController-beans.xml]
 INFO [main] (ClassPathScanningCandidateComponentProvider.java:211) - JSR-330 'javax.inject.Named' annotation found and supported for component scanning
 INFO [main] (AbstractApplicationContext.java:503) - Refreshing org.springframework.web.context.support.GenericWebApplicationContext@1cc41b77: startup date [Thu Oct 10 19:33:02 UTC 2019]; root of context hierarchy
 INFO [main] (AutowiredAnnotationBeanPostProcessor.java:139) - JSR-330 'javax.inject.Inject' annotation found and supported for autowiring
 INFO [main] (DefaultListableBeanFactory.java:577) - Pre-instantiating singletons in org.springframework.beans.factory.support.DefaultListableBeanFactory@4a9869a8: defining beans [test,log,log4jInitialization,testAdminGroup,identityServiceV1,dataoneX509CertificateGenerator,ciLogonX509CertificateGenerator,org.springframework.context.annotation.internalConfigurationAnnotationProcessor,org.springframework.context.annotation.internalAutowiredAnnotationProcessor,org.springframework.context.annotation.internalRequiredAnnotationProcessor,org.springframework.context.annotation.internalCommonAnnotationProcessor,org.springframework.context.annotation.internalPersistenceAnnotationProcessor,identityController,org.springframework.context.annotation.ConfigurationClassPostProcessor.importAwareProcessor]; root of factory hierarchy
 INFO [main] (SuiteTestUnit4Identity.java:140) - Test getSubjectInfo
 INFO [main] (CNIdentityLDAPImpl.java:1031) - The start index is 0
 INFO [main] (CNIdentityLDAPImpl.java:1033) - The count is null or equal or less than 0===================
 INFO [main] (CNIdentityLDAPImpl.java:1035) - the count value is ===============100
 INFO [main] (CNIdentityLDAPImpl.java:1123) - 11 returning DirContext
 INFO [main] (SuiteTestUnit4Identity.java:116) - Test listSubjects
 INFO [main] (CNIdentityLDAPImpl.java:1031) - The start index is 0
 INFO [main] (CNIdentityLDAPImpl.java:1037) - The count is not null or a positive number===================
 INFO [main] (CNIdentityLDAPImpl.java:1038) - the count value is ===============10
 INFO [main] (CNIdentityLDAPImpl.java:1123) - 11 returning DirContext
 INFO [main] (SuiteTestUnit4Identity.java:131) - ListSubject: CN=Chen Lan,O=Test,C=US,DC=cilogon,DC=org
 INFO [main] (SuiteTestUnit4Identity.java:131) - ListSubject: CN=TestONE,O=Test,C=US,DC=cilogon,DC=org
 INFO [main] (SuiteTestUnit4Identity.java:131) - ListSubject: CN=Lan Chen,O=Test,C=US,DC=cilogon,DC=org
 INFO [main] (SuiteTestUnit4Identity.java:131) - ListSubject: CN=Victor Salas,O=Test,C=US,DC=cilogon,DC=org
 INFO [main] (SuiteTestUnit4Identity.java:158) - Test registerAccount of subject
 WARN [main] (LDAPService.java:105) - Problem checking attribute: CN
javax.naming.NameNotFoundException: [LDAP: error code 32 - NO_SUCH_OBJECT: failed for MessageType : COMPARE_REQUEST
Message ID : 528
    Compare request
        Entry : 'CN=TestFIVE,O=Test,C=US,DC=cilogon,DC=org'
        Attribute description : 'CN'
        Attribute value : 'TestFIVEorg.apache.directory.api.ldap.model.message.CompareRequestImpl@846931e7    ManageDsaITImpl Control
        Type OID    : '2.16.840.1.113730.3.4.2'
        Criticality : 'false'
'
: Attempt to lookup non-existant entry: CN=TestFIVE,O=Test,C=US,DC=cilogon,DC=org]; remaining name 'CN=TestFIVE,O=Test,C=US,DC=cilogon,DC=org'
	at com.sun.jndi.ldap.LdapCtx.mapErrorCode(LdapCtx.java:3179)
	at com.sun.jndi.ldap.LdapCtx.processReturnCode(LdapCtx.java:3100)
	at com.sun.jndi.ldap.LdapCtx.processReturnCode(LdapCtx.java:2891)
	at com.sun.jndi.ldap.LdapCtx.searchAux(LdapCtx.java:1841)
	at com.sun.jndi.ldap.LdapCtx.c_search(LdapCtx.java:1769)
	at com.sun.jndi.toolkit.ctx.ComponentDirContext.p_search(ComponentDirContext.java:392)
	at com.sun.jndi.toolkit.ctx.PartialCompositeDirContext.search(PartialCompositeDirContext.java:358)
	at javax.naming.directory.InitialDirContext.search(InitialDirContext.java:276)
	at org.dataone.cn.ldap.LDAPService.checkAttribute(LDAPService.java:95)
	at org.dataone.cn.ldap.LDAPService.constructTree(LDAPService.java:213)
	at org.dataone.service.cn.impl.v2.CNIdentityLDAPImpl.registerAccount(CNIdentityLDAPImpl.java:828)
	at org.dataone.service.cn.impl.v1.CNIdentityLDAPImpl.registerAccount(CNIdentityLDAPImpl.java:131)
	at org.dataone.cn.rest.v1.IdentityController.registerAccount(IdentityController.java:461)
	at org.dataone.cn.rest.v1.suite.SuiteTestUnit4Identity.registerAccount(SuiteTestUnit4Identity.java:180)
	at sun.reflect.NativeMethodAccessorImpl.invoke0(Native Method)
	at sun.reflect.NativeMethodAccessorImpl.invoke(NativeMethodAccessorImpl.java:62)
	at sun.reflect.DelegatingMethodAccessorImpl.invoke(DelegatingMethodAccessorImpl.java:43)
	at java.lang.reflect.Method.invoke(Method.java:498)
	at org.junit.runners.model.FrameworkMethod$1.runReflectiveCall(FrameworkMethod.java:44)
	at org.junit.internal.runners.model.ReflectiveCallable.run(ReflectiveCallable.java:15)
	at org.junit.runners.model.FrameworkMethod.invokeExplosively(FrameworkMethod.java:41)
	at org.junit.internal.runners.statements.InvokeMethod.evaluate(InvokeMethod.java:20)
	at org.springframework.test.context.junit4.statements.RunBeforeTestMethodCallbacks.evaluate(RunBeforeTestMethodCallbacks.java:74)
	at org.springframework.test.context.junit4.statements.RunAfterTestMethodCallbacks.evaluate(RunAfterTestMethodCallbacks.java:83)
	at org.springframework.test.context.junit4.statements.SpringRepeat.evaluate(SpringRepeat.java:72)
	at org.springframework.test.context.junit4.SpringJUnit4ClassRunner.runChild(SpringJUnit4ClassRunner.java:231)
	at org.junit.runners.BlockJUnit4ClassRunner.runChild(BlockJUnit4ClassRunner.java:50)
	at org.junit.runners.ParentRunner$3.run(ParentRunner.java:193)
	at org.junit.runners.ParentRunner$1.schedule(ParentRunner.java:52)
	at org.junit.runners.ParentRunner.runChildren(ParentRunner.java:191)
	at org.junit.runners.ParentRunner.access$000(ParentRunner.java:42)
	at org.junit.runners.ParentRunner$2.evaluate(ParentRunner.java:184)
	at org.springframework.test.context.junit4.statements.RunBeforeTestClassCallbacks.evaluate(RunBeforeTestClassCallbacks.java:61)
	at org.springframework.test.context.junit4.statements.RunAfterTestClassCallbacks.evaluate(RunAfterTestClassCallbacks.java:71)
	at org.junit.runners.ParentRunner.run(ParentRunner.java:236)
	at org.springframework.test.context.junit4.SpringJUnit4ClassRunner.run(SpringJUnit4ClassRunner.java:174)
	at org.junit.runners.Suite.runChild(Suite.java:128)
	at org.junit.runners.Suite.runChild(Suite.java:24)
	at org.junit.runners.ParentRunner$3.run(ParentRunner.java:193)
	at org.junit.runners.ParentRunner$1.schedule(ParentRunner.java:52)
	at org.junit.runners.ParentRunner.runChildren(ParentRunner.java:191)
	at org.junit.runners.ParentRunner.access$000(ParentRunner.java:42)
	at org.junit.runners.ParentRunner$2.evaluate(ParentRunner.java:184)
	at org.junit.runners.ParentRunner.run(ParentRunner.java:236)
	at org.dataone.test.apache.directory.server.integ.ApacheDSSuiteRunner.run(ApacheDSSuiteRunner.java:208)
	at org.apache.maven.surefire.junit4.JUnit4Provider.execute(JUnit4Provider.java:252)
	at org.apache.maven.surefire.junit4.JUnit4Provider.executeTestSet(JUnit4Provider.java:141)
	at org.apache.maven.surefire.junit4.JUnit4Provider.invoke(JUnit4Provider.java:112)
	at sun.reflect.NativeMethodAccessorImpl.invoke0(Native Method)
	at sun.reflect.NativeMethodAccessorImpl.invoke(NativeMethodAccessorImpl.java:62)
	at sun.reflect.DelegatingMethodAccessorImpl.invoke(DelegatingMethodAccessorImpl.java:43)
	at java.lang.reflect.Method.invoke(Method.java:498)
	at org.apache.maven.surefire.util.ReflectionUtils.invokeMethodWithArray(ReflectionUtils.java:189)
	at org.apache.maven.surefire.booter.ProviderFactory$ProviderProxy.invoke(ProviderFactory.java:165)
	at org.apache.maven.surefire.booter.ProviderFactory.invokeProvider(ProviderFactory.java:85)
	at org.apache.maven.surefire.booter.ForkedBooter.runSuitesInProcess(ForkedBooter.java:115)
	at org.apache.maven.surefire.booter.ForkedBooter.main(ForkedBooter.java:75)
 INFO [main] (CNIdentityLDAPImpl.java:891) - 8 returning DirContext
 INFO [main] (SuiteTestUnit4Identity.java:193) - Test registerAccountFromCertificate
 WARN [main] (LDAPService.java:105) - Problem checking attribute: CN
javax.naming.NameNotFoundException: [LDAP: error code 32 - NO_SUCH_OBJECT: failed for MessageType : COMPARE_REQUEST
Message ID : 535
    Compare request
        Entry : 'CN=TestThree,O=Test,C=US,DC=cilogon,DC=org'
        Attribute description : 'CN'
        Attribute value : 'TestThreeorg.apache.directory.api.ldap.model.message.CompareRequestImpl@e5bfd916    ManageDsaITImpl Control
        Type OID    : '2.16.840.1.113730.3.4.2'
        Criticality : 'false'
'
: Attempt to lookup non-existant entry: CN=TestThree,O=Test,C=US,DC=cilogon,DC=org]; remaining name 'CN=TestThree,O=Test,C=US,DC=cilogon,DC=org'
	at com.sun.jndi.ldap.LdapCtx.mapErrorCode(LdapCtx.java:3179)
	at com.sun.jndi.ldap.LdapCtx.processReturnCode(LdapCtx.java:3100)
	at com.sun.jndi.ldap.LdapCtx.processReturnCode(LdapCtx.java:2891)
	at com.sun.jndi.ldap.LdapCtx.searchAux(LdapCtx.java:1841)
	at com.sun.jndi.ldap.LdapCtx.c_search(LdapCtx.java:1769)
	at com.sun.jndi.toolkit.ctx.ComponentDirContext.p_search(ComponentDirContext.java:392)
	at com.sun.jndi.toolkit.ctx.PartialCompositeDirContext.search(PartialCompositeDirContext.java:358)
	at javax.naming.directory.InitialDirContext.search(InitialDirContext.java:276)
	at org.dataone.cn.ldap.LDAPService.checkAttribute(LDAPService.java:95)
	at org.dataone.cn.ldap.LDAPService.constructTree(LDAPService.java:213)
	at org.dataone.service.cn.impl.v2.CNIdentityLDAPImpl.registerAccount(CNIdentityLDAPImpl.java:828)
	at org.dataone.service.cn.impl.v1.CNIdentityLDAPImpl.registerAccount(CNIdentityLDAPImpl.java:131)
	at org.dataone.cn.rest.v1.IdentityController.registerAccount(IdentityController.java:461)
	at org.dataone.cn.rest.v1.suite.SuiteTestUnit4Identity.registerAccountFromCertificate(SuiteTestUnit4Identity.java:220)
	at sun.reflect.NativeMethodAccessorImpl.invoke0(Native Method)
	at sun.reflect.NativeMethodAccessorImpl.invoke(NativeMethodAccessorImpl.java:62)
	at sun.reflect.DelegatingMethodAccessorImpl.invoke(DelegatingMethodAccessorImpl.java:43)
	at java.lang.reflect.Method.invoke(Method.java:498)
	at org.junit.runners.model.FrameworkMethod$1.runReflectiveCall(FrameworkMethod.java:44)
	at org.junit.internal.runners.model.ReflectiveCallable.run(ReflectiveCallable.java:15)
	at org.junit.runners.model.FrameworkMethod.invokeExplosively(FrameworkMethod.java:41)
	at org.junit.internal.runners.statements.InvokeMethod.evaluate(InvokeMethod.java:20)
	at org.springframework.test.context.junit4.statements.RunBeforeTestMethodCallbacks.evaluate(RunBeforeTestMethodCallbacks.java:74)
	at org.springframework.test.context.junit4.statements.RunAfterTestMethodCallbacks.evaluate(RunAfterTestMethodCallbacks.java:83)
	at org.springframework.test.context.junit4.statements.SpringRepeat.evaluate(SpringRepeat.java:72)
	at org.springframework.test.context.junit4.SpringJUnit4ClassRunner.runChild(SpringJUnit4ClassRunner.java:231)
	at org.junit.runners.BlockJUnit4ClassRunner.runChild(BlockJUnit4ClassRunner.java:50)
	at org.junit.runners.ParentRunner$3.run(ParentRunner.java:193)
	at org.junit.runners.ParentRunner$1.schedule(ParentRunner.java:52)
	at org.junit.runners.ParentRunner.runChildren(ParentRunner.java:191)
	at org.junit.runners.ParentRunner.access$000(ParentRunner.java:42)
	at org.junit.runners.ParentRunner$2.evaluate(ParentRunner.java:184)
	at org.springframework.test.context.junit4.statements.RunBeforeTestClassCallbacks.evaluate(RunBeforeTestClassCallbacks.java:61)
	at org.springframework.test.context.junit4.statements.RunAfterTestClassCallbacks.evaluate(RunAfterTestClassCallbacks.java:71)
	at org.junit.runners.ParentRunner.run(ParentRunner.java:236)
	at org.springframework.test.context.junit4.SpringJUnit4ClassRunner.run(SpringJUnit4ClassRunner.java:174)
	at org.junit.runners.Suite.runChild(Suite.java:128)
	at org.junit.runners.Suite.runChild(Suite.java:24)
	at org.junit.runners.ParentRunner$3.run(ParentRunner.java:193)
	at org.junit.runners.ParentRunner$1.schedule(ParentRunner.java:52)
	at org.junit.runners.ParentRunner.runChildren(ParentRunner.java:191)
	at org.junit.runners.ParentRunner.access$000(ParentRunner.java:42)
	at org.junit.runners.ParentRunner$2.evaluate(ParentRunner.java:184)
	at org.junit.runners.ParentRunner.run(ParentRunner.java:236)
	at org.dataone.test.apache.directory.server.integ.ApacheDSSuiteRunner.run(ApacheDSSuiteRunner.java:208)
	at org.apache.maven.surefire.junit4.JUnit4Provider.execute(JUnit4Provider.java:252)
	at org.apache.maven.surefire.junit4.JUnit4Provider.executeTestSet(JUnit4Provider.java:141)
	at org.apache.maven.surefire.junit4.JUnit4Provider.invoke(JUnit4Provider.java:112)
	at sun.reflect.NativeMethodAccessorImpl.invoke0(Native Method)
	at sun.reflect.NativeMethodAccessorImpl.invoke(NativeMethodAccessorImpl.java:62)
	at sun.reflect.DelegatingMethodAccessorImpl.invoke(DelegatingMethodAccessorImpl.java:43)
	at java.lang.reflect.Method.invoke(Method.java:498)
	at org.apache.maven.surefire.util.ReflectionUtils.invokeMethodWithArray(ReflectionUtils.java:189)
	at org.apache.maven.surefire.booter.ProviderFactory$ProviderProxy.invoke(ProviderFactory.java:165)
	at org.apache.maven.surefire.booter.ProviderFactory.invokeProvider(ProviderFactory.java:85)
	at org.apache.maven.surefire.booter.ForkedBooter.runSuitesInProcess(ForkedBooter.java:115)
	at org.apache.maven.surefire.booter.ForkedBooter.main(ForkedBooter.java:75)
 INFO [main] (CNIdentityLDAPImpl.java:891) - 8 returning DirContext
 INFO [main] (SuiteTestUnit4Identity.java:232) - Test updateAccount
 INFO [main] (CNIdentityLDAPImpl.java:707) - 6 returning DirContext
 INFO [main] (SuiteTestUnit4Identity.java:270) - Test verifyAccount
 INFO [main] (CNIdentityLDAPImpl.java:772) - 7 returning DirContext
 INFO [main] (SuiteTestUnit4Identity.java:301) - Test mapAndDeleteIdentity
 WARN [main] (LDAPService.java:105) - Problem checking attribute: CN
javax.naming.NameNotFoundException: [LDAP: error code 32 - NO_SUCH_OBJECT: failed for MessageType : COMPARE_REQUEST
Message ID : 570
    Compare request
        Entry : 'CN=TestMappingONE,O=Test,C=US,DC=cilogon,DC=org'
        Attribute description : 'CN'
        Attribute value : 'TestMappingONEorg.apache.directory.api.ldap.model.message.CompareRequestImpl@ec364403    ManageDsaITImpl Control
        Type OID    : '2.16.840.1.113730.3.4.2'
        Criticality : 'false'
'
: Attempt to lookup non-existant entry: CN=TestMappingONE,O=Test,C=US,DC=cilogon,DC=org]; remaining name 'CN=TestMappingONE,O=Test,C=US,DC=cilogon,DC=org'
	at com.sun.jndi.ldap.LdapCtx.mapErrorCode(LdapCtx.java:3179)
	at com.sun.jndi.ldap.LdapCtx.processReturnCode(LdapCtx.java:3100)
	at com.sun.jndi.ldap.LdapCtx.processReturnCode(LdapCtx.java:2891)
	at com.sun.jndi.ldap.LdapCtx.searchAux(LdapCtx.java:1841)
	at com.sun.jndi.ldap.LdapCtx.c_search(LdapCtx.java:1769)
	at com.sun.jndi.toolkit.ctx.ComponentDirContext.p_search(ComponentDirContext.java:392)
	at com.sun.jndi.toolkit.ctx.PartialCompositeDirContext.search(PartialCompositeDirContext.java:358)
	at javax.naming.directory.InitialDirContext.search(InitialDirContext.java:276)
	at org.dataone.cn.ldap.LDAPService.checkAttribute(LDAPService.java:95)
	at org.dataone.cn.ldap.LDAPService.constructTree(LDAPService.java:213)
	at org.dataone.service.cn.impl.v2.CNIdentityLDAPImpl.registerAccount(CNIdentityLDAPImpl.java:828)
	at org.dataone.service.cn.impl.v1.CNIdentityLDAPImpl.registerAccount(CNIdentityLDAPImpl.java:131)
	at org.dataone.cn.rest.v1.suite.SuiteTestUnit4Identity.mapAndDeleteIdentity(SuiteTestUnit4Identity.java:314)
	at sun.reflect.NativeMethodAccessorImpl.invoke0(Native Method)
	at sun.reflect.NativeMethodAccessorImpl.invoke(NativeMethodAccessorImpl.java:62)
	at sun.reflect.DelegatingMethodAccessorImpl.invoke(DelegatingMethodAccessorImpl.java:43)
	at java.lang.reflect.Method.invoke(Method.java:498)
	at org.junit.runners.model.FrameworkMethod$1.runReflectiveCall(FrameworkMethod.java:44)
	at org.junit.internal.runners.model.ReflectiveCallable.run(ReflectiveCallable.java:15)
	at org.junit.runners.model.FrameworkMethod.invokeExplosively(FrameworkMethod.java:41)
	at org.junit.internal.runners.statements.InvokeMethod.evaluate(InvokeMethod.java:20)
	at org.springframework.test.context.junit4.statements.RunBeforeTestMethodCallbacks.evaluate(RunBeforeTestMethodCallbacks.java:74)
	at org.springframework.test.context.junit4.statements.RunAfterTestMethodCallbacks.evaluate(RunAfterTestMethodCallbacks.java:83)
	at org.springframework.test.context.junit4.statements.SpringRepeat.evaluate(SpringRepeat.java:72)
	at org.springframework.test.context.junit4.SpringJUnit4ClassRunner.runChild(SpringJUnit4ClassRunner.java:231)
	at org.junit.runners.BlockJUnit4ClassRunner.runChild(BlockJUnit4ClassRunner.java:50)
	at org.junit.runners.ParentRunner$3.run(ParentRunner.java:193)
	at org.junit.runners.ParentRunner$1.schedule(ParentRunner.java:52)
	at org.junit.runners.ParentRunner.runChildren(ParentRunner.java:191)
	at org.junit.runners.ParentRunner.access$000(ParentRunner.java:42)
	at org.junit.runners.ParentRunner$2.evaluate(ParentRunner.java:184)
	at org.springframework.test.context.junit4.statements.RunBeforeTestClassCallbacks.evaluate(RunBeforeTestClassCallbacks.java:61)
	at org.springframework.test.context.junit4.statements.RunAfterTestClassCallbacks.evaluate(RunAfterTestClassCallbacks.java:71)
	at org.junit.runners.ParentRunner.run(ParentRunner.java:236)
	at org.springframework.test.context.junit4.SpringJUnit4ClassRunner.run(SpringJUnit4ClassRunner.java:174)
	at org.junit.runners.Suite.runChild(Suite.java:128)
	at org.junit.runners.Suite.runChild(Suite.java:24)
	at org.junit.runners.ParentRunner$3.run(ParentRunner.java:193)
	at org.junit.runners.ParentRunner$1.schedule(ParentRunner.java:52)
	at org.junit.runners.ParentRunner.runChildren(ParentRunner.java:191)
	at org.junit.runners.ParentRunner.access$000(ParentRunner.java:42)
	at org.junit.runners.ParentRunner$2.evaluate(ParentRunner.java:184)
	at org.junit.runners.ParentRunner.run(ParentRunner.java:236)
	at org.dataone.test.apache.directory.server.integ.ApacheDSSuiteRunner.run(ApacheDSSuiteRunner.java:208)
	at org.apache.maven.surefire.junit4.JUnit4Provider.execute(JUnit4Provider.java:252)
	at org.apache.maven.surefire.junit4.JUnit4Provider.executeTestSet(JUnit4Provider.java:141)
	at org.apache.maven.surefire.junit4.JUnit4Provider.invoke(JUnit4Provider.java:112)
	at sun.reflect.NativeMethodAccessorImpl.invoke0(Native Method)
	at sun.reflect.NativeMethodAccessorImpl.invoke(NativeMethodAccessorImpl.java:62)
	at sun.reflect.DelegatingMethodAccessorImpl.invoke(DelegatingMethodAccessorImpl.java:43)
	at java.lang.reflect.Method.invoke(Method.java:498)
	at org.apache.maven.surefire.util.ReflectionUtils.invokeMethodWithArray(ReflectionUtils.java:189)
	at org.apache.maven.surefire.booter.ProviderFactory$ProviderProxy.invoke(ProviderFactory.java:165)
	at org.apache.maven.surefire.booter.ProviderFactory.invokeProvider(ProviderFactory.java:85)
	at org.apache.maven.surefire.booter.ForkedBooter.runSuitesInProcess(ForkedBooter.java:115)
	at org.apache.maven.surefire.booter.ForkedBooter.main(ForkedBooter.java:75)
 INFO [main] (CNIdentityLDAPImpl.java:891) - 8 returning DirContext
 WARN [main] (LDAPService.java:105) - Problem checking attribute: CN
javax.naming.NameNotFoundException: [LDAP: error code 32 - NO_SUCH_OBJECT: failed for MessageType : COMPARE_REQUEST
Message ID : 577
    Compare request
        Entry : 'CN=TestMappingTWO,O=Test,C=US,DC=cilogon,DC=org'
        Attribute description : 'CN'
        Attribute value : 'TestMappingTWOorg.apache.directory.api.ldap.model.message.CompareRequestImpl@720ec22c    ManageDsaITImpl Control
        Type OID    : '2.16.840.1.113730.3.4.2'
        Criticality : 'false'
'
: Attempt to lookup non-existant entry: CN=TestMappingTWO,O=Test,C=US,DC=cilogon,DC=org]; remaining name 'CN=TestMappingTWO,O=Test,C=US,DC=cilogon,DC=org'
	at com.sun.jndi.ldap.LdapCtx.mapErrorCode(LdapCtx.java:3179)
	at com.sun.jndi.ldap.LdapCtx.processReturnCode(LdapCtx.java:3100)
	at com.sun.jndi.ldap.LdapCtx.processReturnCode(LdapCtx.java:2891)
	at com.sun.jndi.ldap.LdapCtx.searchAux(LdapCtx.java:1841)
	at com.sun.jndi.ldap.LdapCtx.c_search(LdapCtx.java:1769)
	at com.sun.jndi.toolkit.ctx.ComponentDirContext.p_search(ComponentDirContext.java:392)
	at com.sun.jndi.toolkit.ctx.PartialCompositeDirContext.search(PartialCompositeDirContext.java:358)
	at javax.naming.directory.InitialDirContext.search(InitialDirContext.java:276)
	at org.dataone.cn.ldap.LDAPService.checkAttribute(LDAPService.java:95)
	at org.dataone.cn.ldap.LDAPService.constructTree(LDAPService.java:213)
	at org.dataone.service.cn.impl.v2.CNIdentityLDAPImpl.registerAccount(CNIdentityLDAPImpl.java:828)
	at org.dataone.service.cn.impl.v1.CNIdentityLDAPImpl.registerAccount(CNIdentityLDAPImpl.java:131)
	at org.dataone.cn.rest.v1.suite.SuiteTestUnit4Identity.mapAndDeleteIdentity(SuiteTestUnit4Identity.java:326)
	at sun.reflect.NativeMethodAccessorImpl.invoke0(Native Method)
	at sun.reflect.NativeMethodAccessorImpl.invoke(NativeMethodAccessorImpl.java:62)
	at sun.reflect.DelegatingMethodAccessorImpl.invoke(DelegatingMethodAccessorImpl.java:43)
	at java.lang.reflect.Method.invoke(Method.java:498)
	at org.junit.runners.model.FrameworkMethod$1.runReflectiveCall(FrameworkMethod.java:44)
	at org.junit.internal.runners.model.ReflectiveCallable.run(ReflectiveCallable.java:15)
	at org.junit.runners.model.FrameworkMethod.invokeExplosively(FrameworkMethod.java:41)
	at org.junit.internal.runners.statements.InvokeMethod.evaluate(InvokeMethod.java:20)
	at org.springframework.test.context.junit4.statements.RunBeforeTestMethodCallbacks.evaluate(RunBeforeTestMethodCallbacks.java:74)
	at org.springframework.test.context.junit4.statements.RunAfterTestMethodCallbacks.evaluate(RunAfterTestMethodCallbacks.java:83)
	at org.springframework.test.context.junit4.statements.SpringRepeat.evaluate(SpringRepeat.java:72)
	at org.springframework.test.context.junit4.SpringJUnit4ClassRunner.runChild(SpringJUnit4ClassRunner.java:231)
	at org.junit.runners.BlockJUnit4ClassRunner.runChild(BlockJUnit4ClassRunner.java:50)
	at org.junit.runners.ParentRunner$3.run(ParentRunner.java:193)
	at org.junit.runners.ParentRunner$1.schedule(ParentRunner.java:52)
	at org.junit.runners.ParentRunner.runChildren(ParentRunner.java:191)
	at org.junit.runners.ParentRunner.access$000(ParentRunner.java:42)
	at org.junit.runners.ParentRunner$2.evaluate(ParentRunner.java:184)
	at org.springframework.test.context.junit4.statements.RunBeforeTestClassCallbacks.evaluate(RunBeforeTestClassCallbacks.java:61)
	at org.springframework.test.context.junit4.statements.RunAfterTestClassCallbacks.evaluate(RunAfterTestClassCallbacks.java:71)
	at org.junit.runners.ParentRunner.run(ParentRunner.java:236)
	at org.springframework.test.context.junit4.SpringJUnit4ClassRunner.run(SpringJUnit4ClassRunner.java:174)
	at org.junit.runners.Suite.runChild(Suite.java:128)
	at org.junit.runners.Suite.runChild(Suite.java:24)
	at org.junit.runners.ParentRunner$3.run(ParentRunner.java:193)
	at org.junit.runners.ParentRunner$1.schedule(ParentRunner.java:52)
	at org.junit.runners.ParentRunner.runChildren(ParentRunner.java:191)
	at org.junit.runners.ParentRunner.access$000(ParentRunner.java:42)
	at org.junit.runners.ParentRunner$2.evaluate(ParentRunner.java:184)
	at org.junit.runners.ParentRunner.run(ParentRunner.java:236)
	at org.dataone.test.apache.directory.server.integ.ApacheDSSuiteRunner.run(ApacheDSSuiteRunner.java:208)
	at org.apache.maven.surefire.junit4.JUnit4Provider.execute(JUnit4Provider.java:252)
	at org.apache.maven.surefire.junit4.JUnit4Provider.executeTestSet(JUnit4Provider.java:141)
	at org.apache.maven.surefire.junit4.JUnit4Provider.invoke(JUnit4Provider.java:112)
	at sun.reflect.NativeMethodAccessorImpl.invoke0(Native Method)
	at sun.reflect.NativeMethodAccessorImpl.invoke(NativeMethodAccessorImpl.java:62)
	at sun.reflect.DelegatingMethodAccessorImpl.invoke(DelegatingMethodAccessorImpl.java:43)
	at java.lang.reflect.Method.invoke(Method.java:498)
	at org.apache.maven.surefire.util.ReflectionUtils.invokeMethodWithArray(ReflectionUtils.java:189)
	at org.apache.maven.surefire.booter.ProviderFactory$ProviderProxy.invoke(ProviderFactory.java:165)
	at org.apache.maven.surefire.booter.ProviderFactory.invokeProvider(ProviderFactory.java:85)
	at org.apache.maven.surefire.booter.ForkedBooter.runSuitesInProcess(ForkedBooter.java:115)
	at org.apache.maven.surefire.booter.ForkedBooter.main(ForkedBooter.java:75)
 INFO [main] (CNIdentityLDAPImpl.java:891) - 8 returning DirContext
 INFO [main] (NodeRegistryServiceImpl.java:352) -   nodelist refresh: new cached time: Oct 10, 2019 7:33:03 PM
 WARN [main] (LDAPService.java:101) - Did not find matching attribute: equivalentIdentity=CN=Victor Salas,O=Test,C=US,DC=cilogon,DC=org
 INFO [main] (CNIdentityLDAPImpl.java:490) - 3 returning DirContext
 INFO [main] (SuiteTestUnit4Identity.java:356) - Test removeMapIdentity
 INFO [main] (IdentityController.java:160) - Removing Identity CN=Victor Salas,O=Test,C=US,DC=cilogon,DC=org
 INFO [main] (CNIdentityLDAPImpl.java:1677) - 14 returning DirContext
 INFO [main] (SuiteTestUnit4Identity.java:378) - Test createGroup
 WARN [main] (LDAPService.java:134) - Could not find LDAP entry for DN: CN=New Test Group,DC=dataone,DC=org
 WARN [main] (CNIdentityLDAPImpl.java:183) - Could not check whether member subject is a group: null
 INFO [main] (CNIdentityLDAPImpl.java:217) - 1 returning DirContext
 INFO [main] (SuiteTestUnit4Identity.java:422) - Test updateGroupMembers
 INFO [main] (SuiteTestUnit4Identity.java:442) - <?xml version="1.0" encoding="UTF-8" standalone="yes"?>
<ns2:group xmlns:ns2="http://ns.dataone.org/service/types/v1">
    <subject>CN=Test Admin Group,DC=dataone,DC=org</subject>
    <groupName>Test Admin Group</groupName>
    <hasMember>CN=TestONE,O=Test,C=US,DC=cilogon,DC=org</hasMember>
    <hasMember>CN=Victor Salas,O=Test,C=US,DC=cilogon,DC=org</hasMember>
    <hasMember>CN=TestMappingTHREE,O=Test,C=US,DC=cilogon,DC=org</hasMember>
    <rightsHolder>CN=TestONE,O=Test,C=US,DC=cilogon,DC=org</rightsHolder>
</ns2:group>

 INFO [main] (CNIdentityLDAPImpl.java:919) - 9 returning DirContext
 INFO [main] (CNIdentityLDAPImpl.java:256) - 2 returning DirContext
 WARN [main] (LDAPService.java:134) - Could not find LDAP entry for DN: CN=TestMappingTHREE,O=Test,C=US,DC=cilogon,DC=org
 WARN [main] (CNIdentityLDAPImpl.java:183) - Could not check whether member subject is a group: null
 INFO [main] (CNIdentityLDAPImpl.java:217) - 1 returning DirContext
 INFO [main] (ResolveFilter.java:138) - init ResolveFilter
 INFO [main] (ResolveFilter.java:217) -   nodelist refresh: new cached time: Oct 10, 2019 7:33:03 PM
 INFO [main] (ResolveFilter.java:194) - NO SERVICES FOR urn:node:testMNv1
===== output =====
<?xml version="1.0" encoding="UTF-8" standalone="yes"?>
<ns2:objectLocationList xmlns:ns2="http://ns.dataone.org/service/types/v1">
    <identifier>aAbBcC12345</identifier>
    <objectLocation>
        <nodeIdentifier>urn:node:testmn</nodeIdentifier>
        <baseURL>https://mn-mock.nowhere.dataone.org/mn</baseURL>
        <version>v1</version>
        <url>https://mn-mock.nowhere.dataone.org/mn/v1/object/aAbBcC12345</url>
    </objectLocation>
    <objectLocation>
        <nodeIdentifier>urn:node:testcn</nodeIdentifier>
        <baseURL>https://cn-mock.nowhere.dataone.org/cn</baseURL>
        <version>v1</version>
        <url>https://cn-mock.nowhere.dataone.org/cn/v1/object/aAbBcC12345</url>
    </objectLocation>
</ns2:objectLocationList>
------------------
 INFO [main] (ResolveFilter.java:138) - init ResolveFilter
 INFO [main] (ResolveFilter.java:217) -   nodelist refresh: new cached time: Oct 10, 2019 7:33:03 PM
 INFO [main] (NodeRegistryServiceImpl.java:352) -   nodelist refresh: new cached time: Oct 10, 2019 7:33:03 PM
 INFO [main] (ResolveFilter.java:194) - NO SERVICES FOR urn:node:testMNv1
 INFO [main] (SuiteTestUnit6ResolveFilter.java:192) - <?xml version="1.0" encoding="UTF-8" standalone="yes"?>
<ns2:objectLocationList xmlns:ns2="http://ns.dataone.org/service/types/v1">
    <identifier>aAbBcC12345</identifier>
    <objectLocation>
        <nodeIdentifier>urn:node:testmn</nodeIdentifier>
        <baseURL>https://mn-mock.nowhere.dataone.org/mn</baseURL>
        <version>v1</version>
        <url>https://mn-mock.nowhere.dataone.org/mn/v1/object/aAbBcC12345</url>
    </objectLocation>
    <objectLocation>
        <nodeIdentifier>urn:node:testcn</nodeIdentifier>
        <baseURL>https://cn-mock.nowhere.dataone.org/cn</baseURL>
        <version>v1</version>
        <url>https://cn-mock.nowhere.dataone.org/cn/v1/object/aAbBcC12345</url>
    </objectLocation>
</ns2:objectLocationList>

 INFO [main] (ResolveFilter.java:138) - init ResolveFilter
 INFO [main] (ResolveFilter.java:217) -   nodelist refresh: new cached time: Oct 10, 2019 7:33:03 PM
 INFO [main] (ResolveFilter.java:194) - NO SERVICES FOR urn:node:testMNv1
 INFO [main] (SuiteTestUnit6ResolveFilter.java:169) - <?xml version="1.0" encoding="UTF-8" standalone="yes"?>
<ns2:objectLocationList xmlns:ns2="http://ns.dataone.org/service/types/v1">
    <identifier>aAbBcC12345</identifier>
    <objectLocation>
        <nodeIdentifier>urn:node:testmn</nodeIdentifier>
        <baseURL>https://mn-mock.nowhere.dataone.org/mn</baseURL>
        <version>v1</version>
        <url>https://mn-mock.nowhere.dataone.org/mn/v1/object/aAbBcC12345</url>
    </objectLocation>
    <objectLocation>
        <nodeIdentifier>urn:node:testcn</nodeIdentifier>
        <baseURL>https://cn-mock.nowhere.dataone.org/cn</baseURL>
        <version>v1</version>
        <url>https://cn-mock.nowhere.dataone.org/cn/v1/object/aAbBcC12345</url>
    </objectLocation>
</ns2:objectLocationList>

 INFO [main] (ResolveFilter.java:138) - init ResolveFilter
 INFO [main] (ResolveFilter.java:217) -   nodelist refresh: new cached time: Oct 10, 2019 7:33:03 PM
 INFO [main] (ResolveFilter.java:194) - NO SERVICES FOR urn:node:testMNv1
 INFO [main] (ResolveFilter.java:138) - init ResolveFilter
 INFO [main] (ResolveFilter.java:217) -   nodelist refresh: new cached time: Oct 10, 2019 7:33:03 PM
 INFO [main] (ResolveFilter.java:194) - NO SERVICES FOR urn:node:testMNv1
 INFO [main] (ResolveFilter.java:138) - init ResolveFilter
 INFO [main] (ResolveFilter.java:217) -   nodelist refresh: new cached time: Oct 10, 2019 7:33:03 PM
 INFO [main] (ResolveFilter.java:194) - NO SERVICES FOR urn:node:testMNv1
===== output =====
<?xml version="1.0" encoding="UTF-8"?>
<error detailCode="4150" errorCode="500" name="ServiceFailure">
    <description>getSystemMetadata failed: ServiceFailure - 987654: 404: A generic error from the /meta service to test forwarding capabilities of resolve.  The codes are bogus in this case.</description>
    <traceInformation>
        <value key="">
  </value>
    </traceInformation>
</error>
------------------
 INFO [main] (ResolveFilter.java:138) - init ResolveFilter
 INFO [main] (ResolveFilter.java:217) -   nodelist refresh: new cached time: Oct 10, 2019 7:33:03 PM
 INFO [main] (ResolveFilter.java:194) - NO SERVICES FOR urn:node:testMNv1
===== output =====
<?xml version="1.0" encoding="UTF-8"?>
<error detailCode="4150" errorCode="500" name="ServiceFailure">
    <description>getSystemMetadata failed: ServiceFailure - 987654: 404: A generic error from the /meta service to test forwarding capabilities of resolve.  The codes are bogus in this case.</description>
    <traceInformation>
        <value key="">
  </value>
    </traceInformation>
</error>
------------------
 INFO [main] (ResolveFilter.java:138) - init ResolveFilter
 INFO [main] (ResolveFilter.java:217) -   nodelist refresh: new cached time: Oct 10, 2019 7:33:03 PM
 INFO [main] (ResolveFilter.java:194) - NO SERVICES FOR urn:node:testMNv1
===== output =====
<?xml version="1.0" encoding="UTF-8"?>
<error detailCode="4140" errorCode="404" name="NotFound">
    <description>getSystemMetadata failed: NotFound - 1060: Document not found:THIS_ID_IS_BOGUS</description>
    <traceInformation>
        <value key="">
  </value>
    </traceInformation>
</error>
------------------
 INFO [main] (ResolveFilter.java:138) - init ResolveFilter
 INFO [main] (ResolveFilter.java:217) -   nodelist refresh: new cached time: Oct 10, 2019 7:33:03 PM
 INFO [main] (ResolveFilter.java:194) - NO SERVICES FOR urn:node:testMNv1
===== output =====
<?xml version="1.0" encoding="UTF-8"?>
<error detailCode="4150" errorCode="500" name="ServiceFailure">
    <description>Error parsing /meta output: null</description>
</error>
------------------
 INFO [main] (ResolveFilter.java:138) - init ResolveFilter
 INFO [main] (ResolveFilter.java:217) -   nodelist refresh: new cached time: Oct 10, 2019 7:33:03 PM
 INFO [main] (ResolveFilter.java:194) - NO SERVICES FOR urn:node:testMNv1
===== output =====
<?xml version="1.0" encoding="UTF-8"?>
<error detailCode="4150" errorCode="500" name="ServiceFailure">
    <description>Error parsing /meta output: null</description>
</error>
------------------
 INFO [main] (ResolveFilter.java:138) - init ResolveFilter
 INFO [main] (ResolveFilter.java:217) -   nodelist refresh: new cached time: Oct 10, 2019 7:33:03 PM
 INFO [main] (ResolveFilter.java:194) - NO SERVICES FOR urn:node:testMNv1
===== output =====
<?xml version="1.0" encoding="UTF-8"?>
<error detailCode="4140" errorCode="404" name="NotFound">
    <description>The requested object is not presently available: aAbBcC12345</description>
</error>
------------------
 INFO [main] (ResolveFilter.java:138) - init ResolveFilter
 INFO [main] (ResolveFilter.java:217) -   nodelist refresh: new cached time: Oct 10, 2019 7:33:03 PM
 INFO [main] (ResolveFilter.java:194) - NO SERVICES FOR urn:node:testMNv1
 INFO [main] (ResolveFilter.java:138) - init ResolveFilter
 INFO [main] (ResolveFilter.java:217) -   nodelist refresh: new cached time: Oct 10, 2019 7:33:03 PM
 INFO [main] (ResolveFilter.java:194) - NO SERVICES FOR urn:node:testMNv1
 INFO [main] (ResolveFilter.java:138) - init ResolveFilter
 INFO [main] (ResolveFilter.java:217) -   nodelist refresh: new cached time: Oct 10, 2019 7:33:03 PM
 INFO [main] (ResolveFilter.java:194) - NO SERVICES FOR urn:node:testMNv1
 INFO [main] (XmlBeanDefinitionReader.java:315) - Loading XML bean definitions from class path resource [org/dataone/cn/rest/mock-dispatcher.xml]
 INFO [main] (XmlBeanDefinitionReader.java:315) - Loading XML bean definitions from class path resource [org/dataone/cn/rest/v1/mockReadController-beans.xml]
 INFO [main] (AbstractApplicationContext.java:503) - Refreshing org.springframework.web.context.support.GenericWebApplicationContext@4403bff8: startup date [Thu Oct 10 19:33:03 UTC 2019]; root of context hierarchy
 INFO [main] (PropertiesLoaderSupport.java:177) - Loading properties file from class path resource [org/dataone/configuration/node.properties]
 INFO [main] (AutowiredAnnotationBeanPostProcessor.java:139) - JSR-330 'javax.inject.Inject' annotation found and supported for autowiring
 INFO [main] (DefaultListableBeanFactory.java:577) - Pre-instantiating singletons in org.springframework.beans.factory.support.DefaultListableBeanFactory@7645e64: defining beans [test,mylog,log4jInitialization,properties,org.springframework.context.annotation.internalConfigurationAnnotationProcessor,org.springframework.context.annotation.internalAutowiredAnnotationProcessor,org.springframework.context.annotation.internalRequiredAnnotationProcessor,org.springframework.context.annotation.internalCommonAnnotationProcessor,org.springframework.context.annotation.internalPersistenceAnnotationProcessor,suiteTestUnit5ReadController,cnReadControllerV1,org.springframework.context.annotation.ConfigurationClassPostProcessor.importAwareProcessor]; root of factory hierarchy
 INFO [main] (ResolveForwarder.java:79) - proxy resolve: /metacat/d1/cn/v1/meta/http%3A%2F%2Ffoo.com%2Fmeta%2F18
 INFO [main] (AbstractProxyForwarder.java:103) - CN Getting proxy...
 INFO [main] (AbstractProxyForwarder.java:106) - CN Dispatching: /d1/cn/v1/meta/http%3A%2F%2Ffoo.com%2Fmeta%2F18
 INFO [main] (AbstractProxyForwarder.java:111) - CN Dispatching proxy...
 INFO [main] (AbstractProxyForwarder.java:113) - CN Completed proxy...
 INFO [main] (SuiteTestUnit5ReadController.java:91) - Response is: /d1/cn/v1/meta/http%3A%2F%2Ffoo.com%2Fmeta%2F18
 INFO [main] (SuiteTestUnit5ReadController.java:106) - Response is: org.dataone.cn.rest.proxy.ResolveForwarder: unable to determine the beginning of the subpathresolve
 INFO [main] (XmlBeanDefinitionReader.java:315) - Loading XML bean definitions from class path resource [org/dataone/cn/rest/mock-dispatcher.xml]
 INFO [main] (XmlBeanDefinitionReader.java:315) - Loading XML bean definitions from class path resource [org/dataone/cn/rest/v2/mockCoreController-beans.xml]
 INFO [main] (ClassPathScanningCandidateComponentProvider.java:211) - JSR-330 'javax.inject.Named' annotation found and supported for component scanning
 INFO [main] (AbstractApplicationContext.java:503) - Refreshing org.springframework.web.context.support.GenericWebApplicationContext@29fcfc54: startup date [Thu Oct 10 19:33:03 UTC 2019]; root of context hierarchy
 INFO [main] (PropertiesLoaderSupport.java:177) - Loading properties file from class path resource [org/dataone/configuration/node.properties]
 INFO [main] (AutowiredAnnotationBeanPostProcessor.java:139) - JSR-330 'javax.inject.Inject' annotation found and supported for autowiring
 INFO [main] (DefaultListableBeanFactory.java:577) - Pre-instantiating singletons in org.springframework.beans.factory.support.DefaultListableBeanFactory@284d4885: defining beans [test,mylog,log4jInitialization,properties,hazelcastInstance,nodeRegistryServiceV1,nodeRegistryServiceV2,reserveIdentifierServiceV1,reserveIdentifierServiceV2,org.springframework.context.annotation.internalConfigurationAnnotationProcessor,org.springframework.context.annotation.internalAutowiredAnnotationProcessor,org.springframework.context.annotation.internalRequiredAnnotationProcessor,org.springframework.context.annotation.internalCommonAnnotationProcessor,org.springframework.context.annotation.internalPersistenceAnnotationProcessor,dataoneX509CertificateGenerator,ciLogonX509CertificateGenerator,coreControllerV2,org.springframework.context.annotation.ConfigurationClassPostProcessor.importAwareProcessor]; root of factory hierarchy
Oct 10, 2019 7:33:03 PM com.hazelcast.impl.AddressPicker
INFO: Interfaces is disabled, trying to pick one address from TCP-IP config addresses: [127.0.0.1]
Oct 10, 2019 7:33:03 PM com.hazelcast.impl.AddressPicker
INFO: Picked Address[127.0.0.1]:15328, using socket ServerSocket[addr=/0:0:0:0:0:0:0:0,localport=15328], bind any local is true
Oct 10, 2019 7:33:03 PM com.hazelcast.system
INFO: [127.0.0.1]:15328 [dev-unit-testing] Hazelcast Community Edition 2.4.1 (20121213) starting at Address[127.0.0.1]:15328
Oct 10, 2019 7:33:03 PM com.hazelcast.system
INFO: [127.0.0.1]:15328 [dev-unit-testing] Copyright (C) 2008-2012 Hazelcast.com
Oct 10, 2019 7:33:03 PM com.hazelcast.impl.LifecycleServiceImpl
INFO: [127.0.0.1]:15328 [dev-unit-testing] Address[127.0.0.1]:15328 is STARTING
Oct 10, 2019 7:33:03 PM com.hazelcast.impl.TcpIpJoiner
INFO: [127.0.0.1]:15328 [dev-unit-testing] 


Members [1] {
	Member [127.0.0.1]:15328 this
}

Oct 10, 2019 7:33:03 PM com.hazelcast.impl.LifecycleServiceImpl
INFO: [127.0.0.1]:15328 [dev-unit-testing] Address[127.0.0.1]:15328 is STARTED
 INFO [main] (CoreController.java:195) - SHA-1
 INFO [main] (CoreController.java:195) - MD5
 INFO [main] (SuiteTestUnit7Core.java:78) - SHA-1
 INFO [main] (SuiteTestUnit7Core.java:78) - MD5
 INFO [main] (SuiteTestUnit7Core.java:103) - solr
 INFO [main] (SuiteTestUnit7Core.java:103) - spambot
 INFO [main] (LdapServer.java:611) - Unbind of an LDAP service (10389) is complete.
 INFO [main] (LdapServer.java:612) - Sending notice of disconnect to existing clients sessions.
 INFO [main] (LdapServer.java:647) - Ldap service stopped.
 WARN [Thread-21] (DirContextUnsolicitedNotificationListener.java:37) - javax.naming.CommunicationException: localhost:10389 connection closed
 WARN [Thread-22] (DirContextUnsolicitedNotificationListener.java:37) - javax.naming.CommunicationException: localhost:10389 connection closed
 INFO [main] (CacheService.java:180) - clearing all the caches
Tests run: 46, Failures: 0, Errors: 0, Skipped: 0, Time elapsed: 7.567 sec
Running org.dataone.cn.rest.StylesheetTypeMarshallerTest
 WARN [main] (StylesheetTypeMarshallerTest.java:71) - <?xml version="1.0" encoding="UTF-8"?><?xml-stylesheet type="text/xsl" href="test.xsl" ?>
<ns2:person xmlns:ns2="http://ns.dataone.org/service/types/v1">
    <subject>test</subject>
    <givenName>test</givenName>
    <familyName>test</familyName>
    <email>test</email>
</ns2:person>
Tests run: 1, Failures: 0, Errors: 0, Skipped: 0, Time elapsed: 0.007 sec
 INFO [Thread-20] (AbstractApplicationContext.java:1032) - Closing org.springframework.web.context.support.GenericWebApplicationContext@29fcfc54: startup date [Thu Oct 10 19:33:03 UTC 2019]; root of context hierarchy
 INFO [Thread-18] (AbstractApplicationContext.java:1032) - Closing org.springframework.web.context.support.GenericWebApplicationContext@4403bff8: startup date [Thu Oct 10 19:33:03 UTC 2019]; root of context hierarchy
 INFO [Thread-0] (AbstractApplicationContext.java:1032) - Closing org.springframework.web.context.support.GenericWebApplicationContext@69b0fd6f: startup date [Thu Oct 10 19:32:55 UTC 2019]; root of context hierarchy
 INFO [Thread-17] (AbstractApplicationContext.java:1032) - Closing org.springframework.web.context.support.GenericWebApplicationContext@1cc41b77: startup date [Thu Oct 10 19:33:02 UTC 2019]; root of context hierarchy
 INFO [Thread-7] (AbstractApplicationContext.java:1032) - Closing org.springframework.web.context.support.GenericWebApplicationContext@8054fe2: startup date [Thu Oct 10 19:32:59 UTC 2019]; root of context hierarchy
 INFO [Thread-9] (AbstractApplicationContext.java:1032) - Closing org.springframework.web.context.support.GenericWebApplicationContext@7cff3f1d: startup date [Thu Oct 10 19:32:59 UTC 2019]; root of context hierarchy
 INFO [Thread-20] (DefaultSingletonBeanRegistry.java:434) - Destroying singletons in org.springframework.beans.factory.support.DefaultListableBeanFactory@284d4885: defining beans [test,mylog,log4jInitialization,properties,hazelcastInstance,nodeRegistryServiceV1,nodeRegistryServiceV2,reserveIdentifierServiceV1,reserveIdentifierServiceV2,org.springframework.context.annotation.internalConfigurationAnnotationProcessor,org.springframework.context.annotation.internalAutowiredAnnotationProcessor,org.springframework.context.annotation.internalRequiredAnnotationProcessor,org.springframework.context.annotation.internalCommonAnnotationProcessor,org.springframework.context.annotation.internalPersistenceAnnotationProcessor,dataoneX509CertificateGenerator,ciLogonX509CertificateGenerator,coreControllerV2,org.springframework.context.annotation.ConfigurationClassPostProcessor.importAwareProcessor]; root of factory hierarchy
 INFO [Thread-0] (DefaultSingletonBeanRegistry.java:434) - Destroying singletons in org.springframework.beans.factory.support.DefaultListableBeanFactory@366647c2: defining beans [test,mylog,log4jInitialization,properties,systemMetadata-valid,org.springframework.context.annotation.internalConfigurationAnnotationProcessor,org.springframework.context.annotation.internalAutowiredAnnotationProcessor,org.springframework.context.annotation.internalRequiredAnnotationProcessor,org.springframework.context.annotation.internalCommonAnnotationProcessor,org.springframework.context.annotation.internalPersistenceAnnotationProcessor,org.springframework.context.annotation.ConfigurationClassPostProcessor.importAwareProcessor]; root of factory hierarchy
 INFO [Thread-18] (DefaultSingletonBeanRegistry.java:434) - Destroying singletons in org.springframework.beans.factory.support.DefaultListableBeanFactory@7645e64: defining beans [test,mylog,log4jInitialization,properties,org.springframework.context.annotation.internalConfigurationAnnotationProcessor,org.springframework.context.annotation.internalAutowiredAnnotationProcessor,org.springframework.context.annotation.internalRequiredAnnotationProcessor,org.springframework.context.annotation.internalCommonAnnotationProcessor,org.springframework.context.annotation.internalPersistenceAnnotationProcessor,suiteTestUnit5ReadController,cnReadControllerV1,org.springframework.context.annotation.ConfigurationClassPostProcessor.importAwareProcessor]; root of factory hierarchy
 INFO [Thread-2] (AbstractApplicationContext.java:1032) - Closing org.springframework.web.context.support.GenericWebApplicationContext@4dd02341: startup date [Thu Oct 10 19:32:56 UTC 2019]; root of context hierarchy
 INFO [Thread-2] (DefaultSingletonBeanRegistry.java:434) - Destroying singletons in org.springframework.beans.factory.support.DefaultListableBeanFactory@6c45ee6e: defining beans [test,mylog,log4jInitialization,systemMetadata-valid,systemMetadata-invalid,solrQueryUri,solrIndexUri,httpComponentsClientHttpRequestFactory,httpService,org.springframework.context.annotation.internalConfigurationAnnotationProcessor,org.springframework.context.annotation.internalAutowiredAnnotationProcessor,org.springframework.context.annotation.internalRequiredAnnotationProcessor,org.springframework.context.annotation.internalCommonAnnotationProcessor,org.springframework.context.annotation.internalPersistenceAnnotationProcessor,mockSolrIndexService,subprocessorUtility,diagnosticControllerV2,org.springframework.context.annotation.ConfigurationClassPostProcessor.importAwareProcessor]; root of factory hierarchy
 INFO [Thread-16] (AbstractApplicationContext.java:1032) - Closing org.springframework.web.context.support.GenericWebApplicationContext@4c5da4f9: startup date [Thu Oct 10 19:33:01 UTC 2019]; root of context hierarchy
 INFO [Thread-9] (DefaultSingletonBeanRegistry.java:434) - Destroying singletons in org.springframework.beans.factory.support.DefaultListableBeanFactory@2ee39e73: defining beans [test,mylog,log4jInitialization,properties,nodeRegistryServiceV1,reserveIdentifierServiceV1,hzInstance,org.springframework.context.annotation.internalConfigurationAnnotationProcessor,org.springframework.context.annotation.internalAutowiredAnnotationProcessor,org.springframework.context.annotation.internalRequiredAnnotationProcessor,org.springframework.context.annotation.internalCommonAnnotationProcessor,org.springframework.context.annotation.internalPersistenceAnnotationProcessor,dataoneX509CertificateGenerator,ciLogonX509CertificateGenerator,coreControllerV1,org.springframework.context.annotation.ConfigurationClassPostProcessor.importAwareProcessor]; root of factory hierarchy
 INFO [Thread-7] (DefaultSingletonBeanRegistry.java:434) - Destroying singletons in org.springframework.beans.factory.support.DefaultListableBeanFactory@7fe07361: defining beans [test,mylog,log4jInitialization,properties,systemMetadata-valid,systemMetadata-valid-disallowed-ascii,systemMetadata-valid-nonAscii-id-utf8,metacat-error,metacat-error-docNotFound,systemMetadata-malformedXML,systemMetadata-noReplicasCompletedStatus,systemMetadata-unregisteredNode,systemMetadata-disabledReplicaNodeIdentifier,nodeRegistryServiceV1,org.springframework.context.annotation.internalConfigurationAnnotationProcessor,org.springframework.context.annotation.internalAutowiredAnnotationProcessor,org.springframework.context.annotation.internalRequiredAnnotationProcessor,org.springframework.context.annotation.internalCommonAnnotationProcessor,org.springframework.context.annotation.internalPersistenceAnnotationProcessor,org.springframework.context.annotation.ConfigurationClassPostProcessor.importAwareProcessor]; root of factory hierarchy
 INFO [Thread-17] (DefaultSingletonBeanRegistry.java:434) - Destroying singletons in org.springframework.beans.factory.support.DefaultListableBeanFactory@4a9869a8: defining beans [test,log,log4jInitialization,testAdminGroup,identityServiceV1,dataoneX509CertificateGenerator,ciLogonX509CertificateGenerator,org.springframework.context.annotation.internalConfigurationAnnotationProcessor,org.springframework.context.annotation.internalAutowiredAnnotationProcessor,org.springframework.context.annotation.internalRequiredAnnotationProcessor,org.springframework.context.annotation.internalCommonAnnotationProcessor,org.springframework.context.annotation.internalPersistenceAnnotationProcessor,identityController,org.springframework.context.annotation.ConfigurationClassPostProcessor.importAwareProcessor]; root of factory hierarchy
 INFO [Thread-16] (DefaultSingletonBeanRegistry.java:434) - Destroying singletons in org.springframework.beans.factory.support.DefaultListableBeanFactory@36463b09: defining beans [test,mylog,log4jInitialization,mnNodeResource,mnInvalidBaseUrlNodeResource,mnInvalidSubjectNodeResource,nodeRegistryServiceV1,identityServiceV1,dataoneX509CertificateGenerator,ciLogonX509CertificateGenerator,org.springframework.context.annotation.internalConfigurationAnnotationProcessor,org.springframework.context.annotation.internalAutowiredAnnotationProcessor,org.springframework.context.annotation.internalRequiredAnnotationProcessor,org.springframework.context.annotation.internalCommonAnnotationProcessor,org.springframework.context.annotation.internalPersistenceAnnotationProcessor,hazelcastInstance,nodeControllerV1,org.springframework.context.annotation.ConfigurationClassPostProcessor.importAwareProcessor]; root of factory hierarchy
 INFO [Thread-16] (FactoryImpl.java:534) - [127.0.0.1]:25802 [hzProcess] Address[127.0.0.1]:25802 is SHUTTING_DOWN
 INFO [Thread-9] (FactoryImpl.java:534) - [127.0.0.1]:15782 [hzTestingIdentifier] Address[127.0.0.1]:15782 is SHUTTING_DOWN
 INFO [Thread-16] (FactoryImpl.java:534) - [127.0.0.1]:25802 [hzProcess] Address[127.0.0.1]:25802 is SHUTDOWN
 INFO [Thread-9] (FactoryImpl.java:534) - [127.0.0.1]:15782 [hzTestingIdentifier] Address[127.0.0.1]:15782 is SHUTDOWN
 INFO [hz.ShutdownThread] (ConnectionManager.java:338) - [127.0.0.1]:15782 [hzTestingIdentifier] Connection [Address[127.0.0.1]:40410] lost. Reason: Explicit close
 INFO [hz.ShutdownThread] (?:?) - [127.0.0.1]:15782 [hzTestingIdentifier] Destroying node initializer.
 INFO [hz.ShutdownThread] (Node.java:502) - [127.0.0.1]:15782 [hzTestingIdentifier] Hazelcast Shutdown is completed in 686 ms.
 INFO [hz.ShutdownThread] (?:?) - [127.0.0.1]:25802 [hzProcess] Destroying node initializer.
 INFO [hz.ShutdownThread] (Node.java:502) - [127.0.0.1]:25802 [hzProcess] Hazelcast Shutdown is completed in 775 ms.

Results :

Tests run: 52, Failures: 0, Errors: 0, Skipped: 1

[JENKINS] Recording test results
[INFO] 
[INFO] --- maven-resources-plugin:2.4.3:copy-resources (include-src-resources-afterTests) @ d1_cn_rest ---
[INFO] Using 'UTF-8' encoding to copy filtered resources.
[INFO] Copying 5 resources
[INFO] 
[INFO] --- maven-war-plugin:2.2:war (default-war) @ d1_cn_rest ---
[INFO] Packaging webapp
[INFO] Assembling webapp [d1_cn_rest] in [/var/lib/jenkins/jobs/d1_cn_service/workspace/d1_cn_rest/target/cn]
[INFO] Processing war project
[INFO] Copying webapp resources [/var/lib/jenkins/jobs/d1_cn_service/workspace/d1_cn_rest/src/main/webapp]
[INFO] Processing overlay [ id edu.uiuc.ncsa.myproxy:oa4mp-client-oauth1]
[INFO] Webapp assembled in [584 msecs]
[INFO] Building war: /var/lib/jenkins/jobs/d1_cn_service/workspace/d1_cn_rest/target/cn.war
[INFO] WEB-INF/web.xml already added, skipping
[INFO] 
[INFO] --- maven-install-plugin:2.4:install (default-install) @ d1_cn_rest ---
[INFO] Installing /var/lib/jenkins/jobs/d1_cn_service/workspace/d1_cn_rest/target/cn.war to /var/lib/jenkins/.m2/repository/org/dataone/cn/d1_cn_rest/2.4.0-SNAPSHOT/d1_cn_rest-2.4.0-SNAPSHOT.war
[INFO] Installing /var/lib/jenkins/jobs/d1_cn_service/workspace/d1_cn_rest/pom.xml to /var/lib/jenkins/.m2/repository/org/dataone/cn/d1_cn_rest/2.4.0-SNAPSHOT/d1_cn_rest-2.4.0-SNAPSHOT.pom
Notifying upstream projects of job completion
Join notifier requires a CauseAction
[INFO] ------------------------------------------------------------------------
[INFO] BUILD SUCCESS
[INFO] ------------------------------------------------------------------------
[INFO] Total time:  23.077 s
[INFO] Finished at: 2019-10-10T19:33:11Z
[INFO] ------------------------------------------------------------------------
Waiting for Jenkins to finish collecting data