FailedConsole Output

Started by an SCM change
Building in workspace /var/lib/jenkins/jobs/MNWebTestManual/workspace
Cleaning local Directory d1_integration
Checking out https://repository.dataone.org/software/cicore/trunk/d1_integration at revision '2015-10-05T20:11:35.118 +0000'
A         GeneratingITCertificates.txt
A         cnTestMethodTemplate.pl
A         src
A         src/license-header.txt
A         src/test
A         src/test/resources
A         src/test/resources/nodes.json
A         src/test/resources/org
A         src/test/resources/org/dataone
A         src/test/resources/org/dataone/configuration
A         src/test/resources/org/dataone/configuration/overriding.properties
A         src/test/resources/d1_testdocs
A         src/test/resources/d1_testdocs/knb-lter-gce.114.11.xml
A         src/test/resources/d1_testdocs/eml200
A         src/test/resources/d1_testdocs/eml200/dpennington.195.2
A         src/test/resources/d1_testdocs/eml200/SystemMetadata
A         src/test/resources/d1_testdocs/eml200/SystemMetadata/dpennington.195.2
A         src/test/resources/d1_testdocs/eml200/SystemMetadata/dpennington.resourcemap
A         src/test/resources/d1_testdocs/eml200/SystemMetadata/IPCC.200802107062739.1
A         src/test/resources/d1_testdocs/eml200/SystemMetadata/README.txt
A         src/test/resources/d1_testdocs/eml200/dpennington.resourcemap
A         src/test/resources/d1_testdocs/eml200/IPCC.200802107062739.1
A         src/test/resources/d1_testdocs/eml201
A         src/test/resources/d1_testdocs/eml201/TPT001_018MHP2000R00_20110121.50.1.xml
A         src/test/resources/d1_testdocs/eml201/SystemMetadata
A         src/test/resources/d1_testdocs/eml201/SystemMetadata/msucci.24.1
A         src/test/resources/d1_testdocs/eml201/SystemMetadata/msucci.23.3
A         src/test/resources/d1_testdocs/eml201/SystemMetadata/msucci.resourcemap
A         src/test/resources/d1_testdocs/eml201/SystemMetadata/README.txt
A         src/test/resources/d1_testdocs/eml201/msucci.24.1
A         src/test/resources/d1_testdocs/eml201/msucci.23.3
A         src/test/resources/d1_testdocs/eml201/msucci.resourcemap
A         src/test/resources/d1_testdocs/eml201/TPT001_018MHP2000R00_20110121.40.1.csv
A         src/test/resources/d1_testdocs/eml210
A         src/test/resources/d1_testdocs/eml210/peggym.130.4
A         src/test/resources/d1_testdocs/eml210/peggym.resourcemap
A         src/test/resources/d1_testdocs/eml210/peggym.127.1
A         src/test/resources/d1_testdocs/eml210/peggym.128.1
A         src/test/resources/d1_testdocs/eml210/peggym.129.1
A         src/test/resources/d1_testdocs/eml210/SystemMetadata
A         src/test/resources/d1_testdocs/eml210/SystemMetadata/peggym.127.1
A         src/test/resources/d1_testdocs/eml210/SystemMetadata/peggym.128.1
A         src/test/resources/d1_testdocs/eml210/SystemMetadata/peggym.129.1
A         src/test/resources/d1_testdocs/eml210/SystemMetadata/README.txt
A         src/test/resources/d1_testdocs/eml210/SystemMetadata/peggym.130.4
A         src/test/resources/d1_testdocs/eml210/SystemMetadata/peggym.resourcemap
A         src/test/resources/d1_testdocs/encodingTestSet
AU        src/test/resources/d1_testdocs/encodingTestSet/testUnicodeStrings.utf8.txt
A         src/test/resources/d1_testdocs/encodingTestSet/testAsciiStrings.utf8.txt
AU        src/test/resources/d1_testdocs/encodingTestSet/IMPORTANT_README.txt
A         src/test/resources/d1_testdocs/encodingTestSet/singleAsciiCharacterTests.utf8.txt
A         src/test/resources/d1_testdocs/IT_contexts
A         src/test/resources/d1_testdocs/IT_contexts/default.LOCAL.test.properties
A         src/test/resources/d1_testdocs/IT_contexts/default.DEV.test.properties
A         src/test/resources/d1_testdocs/fgdc
A         src/test/resources/d1_testdocs/fgdc/README.txt
A         src/test/resources/d1_testdocs/fgdc/www.nbii.gov_metadata_mdata_NASA_nasa_d_FEDGPS1293.xml
A         src/test/resources/d1_testdocs/fgdc/www.nbii.gov_metadata_mdata_USGS_PIERC_brdpierc0020.xml
A         src/test/resources/d1_testdocs/fgdc/www.nbii.gov_metadata_mdata_CSIRO_csiro_d_abayadultprawns.xml
A         src/test/resources/d1_testdocs/fgdc/www.nbii.gov_metadata_mdata_NASA_nasa_d_FEDGPS1293.sysmeta.xml
A         src/test/resources/d1_testdocs/fgdc/www.nbii.gov_metadata_mdata_NPS_VegMap_nps_d_metawababdy.xml
A         src/test/resources/d1_testdocs/fgdc/www.nbii.gov_metadata_mdata_USGS_PIERC_brdpierc0020.sysmeta.xml
A         src/test/resources/d1_testdocs/fgdc/www.nbii.gov_metadata_mdata_CSIRO_csiro_d_abayadultprawns.sysmeta.xml
A         src/test/resources/d1_testdocs/fgdc/www.nbii.gov_metadata_mdata_NPS_VegMap_nps_d_metawababdy.sysmeta.xml
A         src/test/resources/d1_testdocs/knb-lter-cdr.329066.1.data
A         src/test/resources/d1_testdocs/knb-lter-gce.247.12.xml
A         src/test/resources/d1_testdocs/knb-lter-luq.76.2.xml
A         src/test/resources/d1_testdocs/checksumTestSet
A         src/test/resources/d1_testdocs/checksumTestSet/sciMD-eml-201-NoLastLForCR.xml
A         src/test/resources/d1_testdocs/BAYXXX_015ADCP015R00_20051215.50.9.xml
A         src/test/resources/d1_testdocs/nodelist
A         src/test/resources/d1_testdocs/nodelist/nodeRegistry.xml
A         src/test/resources/d1_testdocs/EXAMPLE_MANIFEST.MF
A         src/test/resources/d1_testdocs/BAYXXX_015ADCP015R00_20051215.50.9_SYSMETA.xml
A         src/test/resources/d1_testdocs/knb-lter-luq.76.2-broken.xml
A         src/test/resources/d1_testdocs/ore_example_from_openarchives.xml
A         src/test/resources/d1_testdocs/iso19115
A         src/test/resources/d1_testdocs/iso19115/ornldaac_iso_645.xml
A         src/test/resources/d1_testdocs/iso19115/README.txt
A         src/test/resources/d1_testdocs/iso19115/test.xml
A         src/test/resources/d1_testdocs/iso19115/ornldaac_iso_122.xml
A         src/test/resources/d1_testdocs/iso19115/ornldaac_iso_868.xml
A         src/test/java
A         src/test/java/org
A         src/test/java/org/dataone
A         src/test/java/org/dataone/integration
A         src/test/java/org/dataone/integration/ContextAwareTestCaseDataoneTest.java
A         src/test/java/org/dataone/integration/it
A         src/test/java/org/dataone/integration/it/CNodeTier1_identity_IT.java
A         src/test/java/org/dataone/integration/it/CNodeTier2_identity_IT.java
A         src/test/java/org/dataone/integration/it/MNodeTier0IT.java
A         src/test/java/org/dataone/integration/it/MNodeTier1IT.java
A         src/test/java/org/dataone/integration/it/ContextAwareAdapter.java
A         src/test/java/org/dataone/integration/it/MNodeTier2IT.java
A         src/test/java/org/dataone/integration/it/MNodeTier3IT.java
A         src/test/java/org/dataone/integration/it/MNodeTier4IT.java
A         src/test/java/org/dataone/integration/it/MNodeTier1SlowIT.java
A         src/test/java/org/dataone/integration/it/CNodeTier1_logAgg_IT.java
A         src/test/java/org/dataone/integration/it/CNodeTier2Auth_metacat_IT.java
A         src/test/java/org/dataone/integration/it/apiTests
A         src/test/java/org/dataone/integration/it/apiTests/CNReplicationV2IT.java
A         src/test/java/org/dataone/integration/it/apiTests/MNAuthorizationV2IT.java
A         src/test/java/org/dataone/integration/it/apiTests/CNViewV2IT.java
A         src/test/java/org/dataone/integration/it/apiTests/CNReadV2IT.java
A         src/test/java/org/dataone/integration/it/apiTests/MNQueryV1IT.java
A         src/test/java/org/dataone/integration/it/apiTests/MNStorageV2IT.java
A         src/test/java/org/dataone/integration/it/apiTests/CNContentIntegrityV1V2IT.java
A         src/test/java/org/dataone/integration/it/apiTests/CNRegisterV1IT.java
A         src/test/java/org/dataone/integration/it/apiTests/MNReplicationV2IT.java
A         src/test/java/org/dataone/integration/it/apiTests/MNViewV2IT.java
A         src/test/java/org/dataone/integration/it/apiTests/MNReadV2IT.java
A         src/test/java/org/dataone/integration/it/apiTests/CNAuthenticationV1V2IT.java
A         src/test/java/org/dataone/integration/it/apiTests/CNCoreV1IT.java
A         src/test/java/org/dataone/integration/it/apiTests/CNIdentityV1IT.java
A         src/test/java/org/dataone/integration/it/apiTests/MNContentIntegrityV1V2IT.java
A         src/test/java/org/dataone/integration/it/apiTests/CNv1TestSuite.java
A         src/test/java/org/dataone/integration/it/apiTests/CNv2TestSuite.java
A         src/test/java/org/dataone/integration/it/apiTests/CNAuthorizationV1IT.java
A         src/test/java/org/dataone/integration/it/apiTests/MNAuthenticationV1V2IT.java
A         src/test/java/org/dataone/integration/it/apiTests/MNCoreV1IT.java
A         src/test/java/org/dataone/integration/it/apiTests/MNv1TestSuite.java
A         src/test/java/org/dataone/integration/it/apiTests/CNQueryV2IT.java
A         src/test/java/org/dataone/integration/it/apiTests/MNCoreV1SlowIT.java
A         src/test/java/org/dataone/integration/it/apiTests/CNReplicationV1IT.java
A         src/test/java/org/dataone/integration/it/apiTests/MNAuthorizationV1IT.java
A         src/test/java/org/dataone/integration/it/apiTests/CNReadV1IT.java
A         src/test/java/org/dataone/integration/it/apiTests/MNStorageV1IT.java
A         src/test/java/org/dataone/integration/it/apiTests/MNQueryV2IT.java
A         src/test/java/org/dataone/integration/it/apiTests/MNReplicationV1IT.java
A         src/test/java/org/dataone/integration/it/apiTests/MNReadV1IT.java
A         src/test/java/org/dataone/integration/it/apiTests/CNDiagnosticV2IT.java
A         src/test/java/org/dataone/integration/it/apiTests/CNRegisterV2IT.java
A         src/test/java/org/dataone/integration/it/apiTests/CNCoreV2IT.java
A         src/test/java/org/dataone/integration/it/apiTests/CNIdentityV2IT.java
A         src/test/java/org/dataone/integration/it/apiTests/MNUpdateSystemMetadataIT.java
A         src/test/java/org/dataone/integration/it/apiTests/CNAuthorizationV2IT.java
A         src/test/java/org/dataone/integration/it/apiTests/MNCoreV2IT.java
A         src/test/java/org/dataone/integration/it/apiTests/CNQueryV1IT.java
A         src/test/java/org/dataone/integration/it/apiTests/MNPackageV2IT.java
A         src/test/java/org/dataone/integration/it/apiTests/MNCoreV2SlowIT.java
A         src/test/java/org/dataone/integration/it/CNodeTier1_search_IT.java
A         src/test/java/org/dataone/integration/it/functional
A         src/test/java/org/dataone/integration/it/functional/ClientAuthIT.java
A         src/test/java/org/dataone/integration/it/functional/SynchronizationIT.java
A         src/test/java/org/dataone/integration/it/functional/MNodeMiscFunctionalIT.java
A         src/test/java/org/dataone/integration/it/functional/ClientCertificateInstallationIT.java
A         src/test/java/org/dataone/integration/it/functional/D1ClientIT.java
A         src/test/java/org/dataone/integration/it/functional/DataReplicationIT.java
A         src/test/java/org/dataone/integration/it/functional/XNodeWebServerBasicIT.java
A         src/test/java/org/dataone/integration/it/functional/MNReplicationIT.java
A         src/test/java/org/dataone/integration/it/functional/ResourceMapXParsing.java
A         src/test/java/org/dataone/integration/it/functional/SysmetaChangeFuncIT.java
AU        src/test/java/org/dataone/integration/it/functional/MNodeObjectLifecycleIT.java
A         src/test/java/org/dataone/integration/it/functional/ChecksumAnalysis.java
A         src/test/java/org/dataone/integration/it/functional/MNCreateFuncIT.java
A         src/test/java/org/dataone/integration/it/functional/v2
A         src/test/java/org/dataone/integration/it/functional/v2/V1V2InteropFunctionalIT.java
A         src/test/java/org/dataone/integration/it/functional/v2/CNDiagnosticFunctionalIT.java
A         src/test/java/org/dataone/integration/it/functional/v2/CNRegisterFunctionalIT.java
A         src/test/java/org/dataone/integration/it/functional/v2/MNViewFunctionalIT.java
A         src/test/java/org/dataone/integration/it/functional/v2/MNPackageFunctionalIT.java
A         src/test/java/org/dataone/integration/it/functional/v2/CNViewFunctionalIT.java
A         src/test/java/org/dataone/integration/it/functional/CNCNReplicationIT.java
A         src/test/java/org/dataone/integration/it/functional/MNv2FunctionalTestSuite.java
A         src/test/java/org/dataone/integration/it/functional/PreRegNodeContentCheck.java
A         src/test/java/org/dataone/integration/it/functional/EnvironmentsCheck.java
A         src/test/java/org/dataone/integration/it/functional/SyncInventoryIT.java
A         src/test/java/org/dataone/integration/it/functional/WebTestConcurrency.java
A         src/test/java/org/dataone/integration/it/functional/D1ObjectIT.java
A         src/test/java/org/dataone/integration/it/functional/PackageIT.java
A         src/test/java/org/dataone/integration/it/CNodeTier1_metacat_IT.java
A         src/test/java/org/dataone/integration/it/CNodeTier1_nodeRegistry_IT.java
A         src/test/java/org/dataone/integration/it/testImplementations
A         src/test/java/org/dataone/integration/it/testImplementations/CNCoreTestImplementations.java
A         src/test/java/org/dataone/integration/it/testImplementations/CNUpdateSystemMetadataTestImplementations.java
A         src/test/java/org/dataone/integration/it/testImplementations/MNPackageFunctionalTestImplementations.java
A         src/test/java/org/dataone/integration/it/testImplementations/SidMNTestImplementations.java
A         src/test/java/org/dataone/integration/it/testImplementations/ReadTestImplementations.java
A         src/test/java/org/dataone/integration/it/testImplementations/CNAuthTestImplementations.java
A         src/test/java/org/dataone/integration/it/testImplementations/MNUpdateSystemMetadataTestImplementations.java
A         src/test/java/org/dataone/integration/it/testImplementations/AbstractAuthorizationTestImplementations.java
A         src/test/java/org/dataone/integration/it/testImplementations/SystemMetadataFunctionalTestImplementation.java
A         src/test/java/org/dataone/integration/it/testImplementations/UpdateSystemMetadataTestImplementations.java
A         src/test/java/org/dataone/integration/it/testImplementations/SidCommonTestImplementations.java
A         src/test/java/org/dataone/integration/it/testImplementations/CNDiagnosticFunctionalTestImplementations.java
A         src/test/java/org/dataone/integration/it/testImplementations/CoreTestImplementations.java
A         src/test/java/org/dataone/integration/it/testImplementations/AuthAPITestImplementations.java
A         src/test/java/org/dataone/integration/it/testImplementations/IsAuthorizedAuthorizationTestImplementations.java
A         src/test/java/org/dataone/integration/it/testImplementations/V1IsAuthorizedAuthorizationTestImpl.java
A         src/test/java/org/dataone/integration/it/testImplementations/V2IsAuthorizedAuthorizationTestImpl.java
A         src/test/java/org/dataone/integration/it/testImplementations/MNStorageTestImplementations.java
A         src/test/java/org/dataone/integration/it/testImplementations/SSLTestImplementations.java
A         src/test/java/org/dataone/integration/it/testImplementations/AuthTestImplementations.java
A         src/test/java/org/dataone/integration/it/testImplementations/ContentIntegrityTestImplementations.java
A         src/test/java/org/dataone/integration/it/testImplementations/ViewTestImplementations.java
A         src/test/java/org/dataone/integration/it/testImplementations/CNIdentityTestImplementations.java
A         src/test/java/org/dataone/integration/it/testImplementations/SynchronizeMetadataTestImplementations.java
A         src/test/java/org/dataone/integration/it/testImplementations/V1V2InteropFunctionalTestImplementations.java
A         src/test/java/org/dataone/integration/it/testImplementations/MNPackageTestImplementations.java
A         src/test/java/org/dataone/integration/it/testImplementations/CNReplicationTestImplementations.java
A         src/test/java/org/dataone/integration/it/testImplementations/MNSystemMetadataChangedMethodTestImplementations.java
A         src/test/java/org/dataone/integration/it/testImplementations/NodeRegistryExtensibilityTestImplementations.java
A         src/test/java/org/dataone/integration/it/testImplementations/CNReadTestImplementations.java
A         src/test/java/org/dataone/integration/it/testImplementations/ViewFunctionalTestImplementations.java
A         src/test/java/org/dataone/integration/it/testImplementations/SidCNTestImplementations.java
A         src/test/java/org/dataone/integration/it/testImplementations/MNReplicationTestImplementations.java
A         src/test/java/org/dataone/integration/it/testImplementations/CNRegisterTestImplementations.java
A         src/test/java/org/dataone/integration/it/testImplementations/CNDiagnosticTestImplementations.java
A         src/test/java/org/dataone/integration/it/testImplementations/QueryTestImplementations.java
A         src/test/java/org/dataone/integration/it/testImplementations/MNReadTestImplementations.java
A         src/test/java/org/dataone/integration/it/CNodeTier2_nodeRegistry_IT.java
A         src/test/java/org/dataone/integration/it/CNodeTier1_cnService_IT.java
A         src/test/java/org/dataone/integration/it/CNodeTier4_metacat_IT.java
A         src/test/java/org/dataone/integration/it/testDefinitions
A         src/test/java/org/dataone/integration/it/testDefinitions/MNAuthAPITestDefnitions.java
A         src/test/java/org/dataone/integration/it/testDefinitions/CNv2RegisterTestDefinitions.java
A         src/test/java/org/dataone/integration/it/testDefinitions/CNAuthorizationSidTestDefinitions.java
A         src/test/java/org/dataone/integration/it/testDefinitions/CNv2CoreTestDefinitions.java
A         src/test/java/org/dataone/integration/it/testDefinitions/MNPackageTestDefinitions.java
A         src/test/java/org/dataone/integration/it/testDefinitions/MNCoreSlowTestDefinitions.java
A         src/test/java/org/dataone/integration/it/testDefinitions/SynchronizeMetadataTestDefinition.java
A         src/test/java/org/dataone/integration/it/testDefinitions/CNReplicationSidTestDefinitions.java
A         src/test/java/org/dataone/integration/it/testDefinitions/CNReplicationTestDefinitions.java
A         src/test/java/org/dataone/integration/it/testDefinitions/MNAuthorizationSidTestDefinitions.java
A         src/test/java/org/dataone/integration/it/testDefinitions/NodeRegistryExtensibilityTestDefinitions.java
A         src/test/java/org/dataone/integration/it/testDefinitions/CNReadSidTestDefinitions.java
A         src/test/java/org/dataone/integration/it/testDefinitions/CNReadTestDefinitions.java
A         src/test/java/org/dataone/integration/it/testDefinitions/GeneralAuthorizationTestDefinitions.java
A         src/test/java/org/dataone/integration/it/testDefinitions/MNStorageSidTestDefinitions.java
A         src/test/java/org/dataone/integration/it/testDefinitions/MNv2SystemMetadataChangedTestDefinitions.java
A         src/test/java/org/dataone/integration/it/testDefinitions/MNReplicationTestDefinitions.java
A         src/test/java/org/dataone/integration/it/testDefinitions/QueryTestDefinitions.java
A         src/test/java/org/dataone/integration/it/testDefinitions/CNRegisterTestDefinitions.java
A         src/test/java/org/dataone/integration/it/testDefinitions/CNDiagnosticTestDefinitions.java
A         src/test/java/org/dataone/integration/it/testDefinitions/MNReadSidTestDefinitions.java
A         src/test/java/org/dataone/integration/it/testDefinitions/MNReadTestDefinitions.java
A         src/test/java/org/dataone/integration/it/testDefinitions/MNv2StorageTestDefinitions.java
A         src/test/java/org/dataone/integration/it/testDefinitions/V2AuthorizationTestDefinitions.java
A         src/test/java/org/dataone/integration/it/testDefinitions/CNUpdateSystemMetadataTestDefinitions.java
A         src/test/java/org/dataone/integration/it/testDefinitions/CNCoreTestDefinitions.java
A         src/test/java/org/dataone/integration/it/testDefinitions/ReadTestDefinitions.java
A         src/test/java/org/dataone/integration/it/testDefinitions/CNAuthTestDefinitions.java
A         src/test/java/org/dataone/integration/it/testDefinitions/MNCoreTestDefinitions.java
A         src/test/java/org/dataone/integration/it/testDefinitions/MNUpdateSystemMetadataTestDefinitions.java
A         src/test/java/org/dataone/integration/it/testDefinitions/SystemMetadataChangedMethodTestDefnitions.java
A         src/test/java/org/dataone/integration/it/testDefinitions/CoreTestDefinitions.java
A         src/test/java/org/dataone/integration/it/testDefinitions/MNSystemMetadataChangedTestDefinitions.java
A         src/test/java/org/dataone/integration/it/testDefinitions/AuthAPITestDefinitions.java
A         src/test/java/org/dataone/integration/it/testDefinitions/MNStorageTestDefinitions.java
A         src/test/java/org/dataone/integration/it/testDefinitions/MNQueryTestDefinitions.java
A         src/test/java/org/dataone/integration/it/testDefinitions/AuthTestDefinitions.java
A         src/test/java/org/dataone/integration/it/testDefinitions/SSLTestDefinitions.java
A         src/test/java/org/dataone/integration/it/testDefinitions/ContentIntegrityTestDefinitions.java
A         src/test/java/org/dataone/integration/it/testDefinitions/CNCoreSidTestDefinitions.java
A         src/test/java/org/dataone/integration/it/testDefinitions/CNIdentityTestDefinitions.java
A         src/test/java/org/dataone/integration/it/testDefinitions/ViewTestDefinitions.java
A         src/test/java/org/dataone/integration/webTest
A         src/test/java/org/dataone/integration/webTest/MockV1ITCase.java
A         src/test/java/org/dataone/integration/webTest/TestingTestRunnerServlet.java
A         src/test/java/org/dataone/integration/webTest/TestLauncher.java
A         src/test/java/org/dataone/integration/webTest/TestManifestAccess.java
A         src/test/java/org/dataone/integration/tools
A         src/test/java/org/dataone/integration/tools/RegisterNodeTools.java
A         src/test/java/org/dataone/integration/tools/ProductionContentCheckingTools.java
A         src/test/java/org/dataone/integration/tools/ProductionResourceMapParsingChecks.java
A         src/test/java/org/dataone/integration/CommonResourcesTest.java
A         src/test/java/org/dataone/integration/contextTests
A         src/test/java/org/dataone/integration/contextTests/TestDefaultSettings.java
A         src/test/java/org/dataone/configuration
A         src/test/java/org/dataone/configuration/TestSettingsTest.java
A         src/test/java/org/dataone/client
A         src/test/java/org/dataone/client/ClientArchitectureConformityIT.java
A         src/test/java/org/dataone/client/V1ClientArchitectureConformityIT.java
A         src/test/java/org/dataone/client/CNRestURLTest.java
A         src/test/java/org/dataone/client/PoolingHttpClientConnectionManagerTest.java
A         src/test/java/org/dataone/client/ArchitectureUtils.java
A         src/test/python
A         src/test/python/org
A         src/test/python/org/dataone
A         src/test/python/org/dataone/client
AU        src/test/python/org/dataone/client/test_client.py
A         src/test/python/org/dataone/client/d1_test_case.py
A         src/test/python/org/dataone/integration
A         src/test/python/org/dataone/integration/context.py
A         src/test/python/org/dataone/integration/tier_1_mn_core_getobjectstatistics.py
A         src/test/python/org/dataone/integration/tier_3_mn_storage_create.py
A         src/test/python/org/dataone/integration/tier_1_mn_core_getstatus.py
A         src/test/python/org/dataone/integration/tier_1_mn_read_getchecksum.py
A         src/test/python/org/dataone/integration/tier_1_mn_core_getcapabilities.py
A         src/test/python/org/dataone/integration/tier_1_mn_read_synchronizationfailed.py
A         src/test/python/org/dataone/integration/tier_1_mn_core_ping.py
A         src/test/python/org/dataone/integration/tier_3_mn_storage_update.py
AU        src/test/python/org/dataone/integration/test_all.py
A         src/test/python/org/dataone/integration/tier_1_mn_read_get.py
A         src/test/python/org/dataone/integration/tier_1_mn_core_getlogrecords.py
A         src/test/python/org/dataone/integration/tier_1_mn_read_describe.py
A         src/test/python/org/dataone/integration/test_utilities.py
A         src/test/python/org/dataone/integration/tier_1_mn_read_getsystemmetadata.py
A         src/test/python/org/dataone/integration/tier_1_mn_read_listobjects.py
A         src/test/python/org/dataone/integration/tier_1_mn_core_getoperationstatistics.py
A         src/main
A         src/main/resources
A         src/main/resources/results.html
A         src/main/resources/results_head.html
A         src/main/resources/org
A         src/main/resources/org/dataone
A         src/main/resources/org/dataone/configuration
A         src/main/resources/org/dataone/configuration/context.LOCAL.test.properties
A         src/main/resources/org/dataone/configuration/context.DEV.test.properties
A         src/main/resources/org/dataone/configuration/context.SANDBOX.test.properties
A         src/main/resources/org/dataone/configuration/customHudsonDevNodelist.xml
AU        src/main/resources/org/dataone/configuration/context.DEV2.test.properties
A         src/main/resources/org/dataone/configuration/context.STAGE-2.test.properties
A         src/main/resources/org/dataone/configuration/context.STAGE.test.properties
A         src/main/resources/org/dataone/configuration/context.LOCAL_METACAT.test.properties
A         src/main/resources/org/dataone/configuration/default.common.test.properties
A         src/main/resources/commons-logging.properties
AU        src/main/resources/log4j.properties
AU        src/main/resources/logback.xml
A         src/main/webapp
A         src/main/webapp/index.jsp
A         src/main/webapp/results.html
A         src/main/webapp/images
AU        src/main/webapp/images/sunny.gif
AU        src/main/webapp/images/grey.png
AU        src/main/webapp/images/blue.png
AU        src/main/webapp/images/help.png
AU        src/main/webapp/images/red.png
AU        src/main/webapp/images/yellow.png
A         src/main/webapp/results_head.html
A         src/main/webapp/WEB-INF
AU        src/main/webapp/WEB-INF/web.xml
A         src/main/webapp/resultsHelp.html
A         src/main/java
A         src/main/java/org
A         src/main/java/org/dataone
A         src/main/java/org/dataone/configuration
A         src/main/java/org/dataone/configuration/TestSettings.java
A         src/main/java/org/dataone/client
A         src/main/java/org/dataone/service
A         src/main/java/org/dataone/service/util
A         src/main/java/org/dataone/integration
A         src/main/java/org/dataone/integration/TestIterationEndingException.java
A         src/main/java/org/dataone/integration/adapters
A         src/main/java/org/dataone/integration/adapters/CommonCallAdapter.java
A         src/main/java/org/dataone/integration/adapters/MNCallAdapter.java
A         src/main/java/org/dataone/integration/adapters/CNCallAdapter.java
A         src/main/java/org/dataone/integration/EMLBuilderUtils.java
AU        src/main/java/org/dataone/integration/ExampleUtilities.java
A         src/main/java/org/dataone/integration/APITestUtils.java
A         src/main/java/org/dataone/integration/ContextAwareTestCaseDataone.java
A         src/main/java/org/dataone/integration/IntegrationTestContextParameters.java
A         src/main/java/org/dataone/integration/webTest
A         src/main/java/org/dataone/integration/webTest/Launcher.java
A         src/main/java/org/dataone/integration/webTest/WebTestDescription.java
A         src/main/java/org/dataone/integration/webTest/WebTestImplementation.java
A         src/main/java/org/dataone/integration/webTest/WebTestListener.java
A         src/main/java/org/dataone/integration/webTest/MavenTestRunnerHttpServlet.java
AU        src/main/java/org/dataone/integration/webTest/TestRunnerIndexServlet.java
A         src/main/java/org/dataone/integration/webTest/StreamableSerializer.java
A         src/main/java/org/dataone/integration/webTest/TestRunnerApp.java
A         src/main/java/org/dataone/integration/webTest/AtomicTest.java
A         src/main/java/org/dataone/integration/webTest/StreamingWebTestListener.java
A         src/main/java/org/dataone/integration/webTest/TestRunnerHttpServlet.java
A         src/main/java/org/dataone/integration/webTest/WebTestName.java
A         src/main/java/org/dataone/integration/hazelcast
A         pom.xml
A         tierTestingMethodTemplater.pl
A         README.txt
A         nbactions.xml
AU        LICENSE.txt
 U        .
At revision 16570
Parsing POMs
[d1_integration] $ /usr/lib/jvm/java-7-openjdk-amd64/bin/java -cp /var/lib/jenkins/plugins/maven-plugin/WEB-INF/lib/maven3-agent-1.6.jar:/usr/share/maven/boot/plexus-classworlds-2.x.jar org.jvnet.hudson.maven3.agent.Maven3Main /usr/share/maven /var/cache/jenkins/war/WEB-INF/lib/remoting-2.52.jar /var/lib/jenkins/plugins/maven-plugin/WEB-INF/lib/maven3-interceptor-1.6.jar /var/lib/jenkins/plugins/maven-plugin/WEB-INF/lib/maven3-interceptor-commons-1.6.jar 35653
<===[JENKINS REMOTING CAPACITY]===>channel started
Executing Maven:  -B -f /var/lib/jenkins/jobs/MNWebTestManual/workspace/d1_integration/pom.xml clean package
[INFO] Scanning for projects...
[WARNING] 
[WARNING] Some problems were encountered while building the effective model for org.dataone:d1_integration:war:2.0-SNAPSHOT
[WARNING] 'build.plugins.plugin.version' for org.apache.maven.plugins:maven-compiler-plugin is missing. @ line 197, column 15
[WARNING] 'build.plugins.plugin.version' for org.codehaus.mojo:buildnumber-maven-plugin is missing. @ line 221, column 15
[WARNING] 'build.plugins.plugin.version' for com.mycila.maven-license-plugin:maven-license-plugin is missing. @ line 214, column 15
[WARNING] 'build.plugins.plugin.version' for org.apache.maven.plugins:maven-war-plugin is missing. @ line 237, column 15
[WARNING] 
[WARNING] It is highly recommended to fix these problems because they threaten the stability of your build.
[WARNING] 
[WARNING] For this reason, future Maven versions might no longer support building such malformed projects.
[WARNING] 
[INFO]                                                                         
[INFO] ------------------------------------------------------------------------
[INFO] Building DataONE Integration Testing Package 2.0-SNAPSHOT
[INFO] ------------------------------------------------------------------------
[INFO] 
[INFO] --- maven-clean-plugin:2.3:clean (default-clean) @ d1_integration ---
[INFO] 
[INFO] --- buildnumber-maven-plugin:1.2:create (default) @ d1_integration ---
[INFO] Checking for local modifications: skipped.
[INFO] Updating project files from SCM: skipped.
[INFO] Executing: /bin/sh -c cd /var/lib/jenkins/jobs/MNWebTestManual/workspace/d1_integration && svn --non-interactive info
[INFO] Working directory: /var/lib/jenkins/jobs/MNWebTestManual/workspace/d1_integration
[INFO] Storing buildNumber: 16570 at timestamp: 1444075907325
[INFO] Executing: /bin/sh -c cd /var/lib/jenkins/jobs/MNWebTestManual/workspace/d1_integration && svn --non-interactive info
[INFO] Working directory: /var/lib/jenkins/jobs/MNWebTestManual/workspace/d1_integration
[INFO] Storing buildScmBranch: trunk
[INFO] 
[INFO] --- maven-resources-plugin:2.3:resources (default-resources) @ d1_integration ---
[WARNING] Using platform encoding (UTF-8 actually) to copy filtered resources, i.e. build is platform dependent!
[INFO] Copying 14 resources
[INFO] 
[INFO] --- maven-compiler-plugin:2.0.2:compile (default-compile) @ d1_integration ---
[INFO] Compiling 22 source files to /var/lib/jenkins/jobs/MNWebTestManual/workspace/d1_integration/target/classes
[INFO] 
[INFO] --- maven-resources-plugin:2.3:testResources (default-testResources) @ d1_integration ---
[WARNING] Using platform encoding (UTF-8 actually) to copy filtered resources, i.e. build is platform dependent!
[INFO] Copying 60 resources
[INFO] 
[INFO] --- maven-compiler-plugin:2.0.2:testCompile (default-testCompile) @ d1_integration ---
[INFO] Compiling 139 source files to /var/lib/jenkins/jobs/MNWebTestManual/workspace/d1_integration/target/test-classes
Notifying upstream projects of job completion
Join notifier requires a CauseAction
[INFO] ------------------------------------------------------------------------
[INFO] BUILD FAILURE
[INFO] ------------------------------------------------------------------------
[INFO] Total time: 12.926s
[INFO] Finished at: Mon Oct 05 20:11:56 UTC 2015
[INFO] Final Memory: 36M/247M
[INFO] ------------------------------------------------------------------------
Waiting for Jenkins to finish collecting data
[ERROR] Failed to execute goal org.apache.maven.plugins:maven-compiler-plugin:2.0.2:testCompile (default-testCompile) on project d1_integration: Compilation failure: Compilation failure:
[ERROR] /var/lib/jenkins/jobs/MNWebTestManual/workspace/d1_integration/src/test/java/org/dataone/integration/it/apiTests/MNStorageV2IT.java:[234,15] error: cannot find symbol
[ERROR] 
[ERROR] could not parse error message:   symbol:   method testArchive()
[ERROR] location: variable sidImpl of type SidMNTestImplementations
[ERROR] /var/lib/jenkins/jobs/MNWebTestManual/workspace/d1_integration/src/test/java/org/dataone/integration/it/apiTests/CNCoreV2IT.java:189: error: cannot find symbol
[ERROR] sidImpl.testArchive();
[ERROR] ^
[ERROR] -> [Help 1]
[ERROR] 
[ERROR] To see the full stack trace of the errors, re-run Maven with the -e switch.
[ERROR] Re-run Maven using the -X switch to enable full debug logging.
[ERROR] 
[ERROR] For more information about the errors and possible solutions, please read the following articles:
[JENKINS] Archiving /var/lib/jenkins/jobs/MNWebTestManual/workspace/d1_integration/pom.xml to org.dataone/d1_integration/2.0-SNAPSHOT/d1_integration-2.0-SNAPSHOT.pom
[ERROR] [Help 1] http://cwiki.apache.org/confluence/display/MAVEN/MojoFailureException
channel stopped
IRC notifier plugin: Sending notification to: #dataone-build
Notifying upstream projects of job completion
Sending e-mails to: rnahf@dataone.unm.edu dave.vieglais@gmail.com jones@nceas.ucsb.edu
ERROR: Invalid Addresses
javax.mail.SendFailedException: Invalid Addresses;
  nested exception is:
	com.sun.mail.smtp.SMTPAddressFailedException: 553 5.1.8 <rnahf@dataone.unm.edu>... Domain of sender address nobody@nowhere does not exist
;
  nested exception is:
	com.sun.mail.smtp.SMTPAddressFailedException: 553 5.1.8 <dave.vieglais@gmail.com>... Domain of sender address nobody@nowhere does not exist
;
  nested exception is:
	com.sun.mail.smtp.SMTPAddressFailedException: 553 5.1.8 <jones@nceas.ucsb.edu>... Domain of sender address nobody@nowhere does not exist

	at com.sun.mail.smtp.SMTPTransport.rcptTo(SMTPTransport.java:1835)
	at com.sun.mail.smtp.SMTPTransport.sendMessage(SMTPTransport.java:1098)
	at javax.mail.Transport.send0(Transport.java:195)
	at javax.mail.Transport.send(Transport.java:124)
	at hudson.tasks.MailSender.run(MailSender.java:129)
	at hudson.tasks.MailSender.execute(MailSender.java:104)
	at hudson.maven.MavenModuleSetBuild$MavenModuleSetBuildExecution.cleanUp(MavenModuleSetBuild.java:1064)
	at hudson.model.Run.execute(Run.java:1788)
	at hudson.maven.MavenModuleSetBuild.run(MavenModuleSetBuild.java:531)
	at hudson.model.ResourceController.execute(ResourceController.java:98)
	at hudson.model.Executor.run(Executor.java:408)
Caused by: com.sun.mail.smtp.SMTPAddressFailedException: 553 5.1.8 <rnahf@dataone.unm.edu>... Domain of sender address nobody@nowhere does not exist
;
  nested exception is:
	com.sun.mail.smtp.SMTPAddressFailedException: 553 5.1.8 <dave.vieglais@gmail.com>... Domain of sender address nobody@nowhere does not exist
;
  nested exception is:
	com.sun.mail.smtp.SMTPAddressFailedException: 553 5.1.8 <jones@nceas.ucsb.edu>... Domain of sender address nobody@nowhere does not exist

	at com.sun.mail.smtp.SMTPTransport.rcptTo(SMTPTransport.java:1686)
	... 10 more
Caused by: com.sun.mail.smtp.SMTPAddressFailedException: 553 5.1.8 <dave.vieglais@gmail.com>... Domain of sender address nobody@nowhere does not exist
;
  nested exception is:
	com.sun.mail.smtp.SMTPAddressFailedException: 553 5.1.8 <jones@nceas.ucsb.edu>... Domain of sender address nobody@nowhere does not exist

	... 11 more
Caused by: com.sun.mail.smtp.SMTPAddressFailedException: 553 5.1.8 <jones@nceas.ucsb.edu>... Domain of sender address nobody@nowhere does not exist

	... 11 more
Finished: FAILURE