UnstableConsole Output

Skipping 644 KB.. Full Log
pMultipartRestClient.doPostRequest(HttpMultipartRestClient.java:470)
	at org.dataone.client.v2.impl.MultipartMNode.create(MultipartMNode.java:495)
	at org.dataone.integration.adapters.CommonCallAdapter.create(CommonCallAdapter.java:505)
	at org.dataone.integration.ContextAwareTestCaseDataone.createTestObject(ContextAwareTestCaseDataone.java:1600)
	... 32 more
Caused by: org.dataone.client.exception.ClientSideException: /Read timed out
	... 36 more
Caused by: java.net.SocketTimeoutException: Read timed out
	at java.net.SocketInputStream.socketRead0(Native Method)
	at java.net.SocketInputStream.read(SocketInputStream.java:153)
	at java.net.SocketInputStream.read(SocketInputStream.java:122)
	at sun.security.ssl.InputRecord.readFully(InputRecord.java:442)
	at sun.security.ssl.InputRecord.read(InputRecord.java:480)
	at sun.security.ssl.SSLSocketImpl.readRecord(SSLSocketImpl.java:944)
	at sun.security.ssl.SSLSocketImpl.readDataRecord(SSLSocketImpl.java:901)
	at sun.security.ssl.AppInputStream.read(AppInputStream.java:102)
	at org.apache.http.impl.io.SessionInputBufferImpl.streamRead(SessionInputBufferImpl.java:136)
	at org.apache.http.impl.io.SessionInputBufferImpl.fillBuffer(SessionInputBufferImpl.java:152)
	at org.apache.http.impl.io.SessionInputBufferImpl.readLine(SessionInputBufferImpl.java:270)
	at org.apache.http.impl.conn.DefaultHttpResponseParser.parseHead(DefaultHttpResponseParser.java:140)
	at org.apache.http.impl.conn.DefaultHttpResponseParser.parseHead(DefaultHttpResponseParser.java:57)
	at org.apache.http.impl.io.AbstractMessageParser.parse(AbstractMessageParser.java:260)
	at org.apache.http.impl.DefaultBHttpClientConnection.receiveResponseHeader(DefaultBHttpClientConnection.java:161)
	at org.apache.http.impl.conn.CPoolProxy.receiveResponseHeader(CPoolProxy.java:153)
	at org.apache.http.protocol.HttpRequestExecutor.doReceiveResponse(HttpRequestExecutor.java:271)
	at org.apache.http.protocol.HttpRequestExecutor.execute(HttpRequestExecutor.java:123)
	at org.apache.http.impl.execchain.MainClientExec.execute(MainClientExec.java:254)
	at org.apache.http.impl.client.cache.CachingExec.callBackend(CachingExec.java:578)
	at org.apache.http.impl.client.cache.CachingExec.execute(CachingExec.java:259)
	at org.apache.http.impl.execchain.ProtocolExec.execute(ProtocolExec.java:195)
	at org.apache.http.impl.execchain.RetryExec.execute(RetryExec.java:86)
	at org.apache.http.impl.execchain.RedirectExec.execute(RedirectExec.java:108)
	at org.apache.http.impl.client.InternalHttpClient.doExecute(InternalHttpClient.java:184)
	at org.apache.http.impl.client.CloseableHttpClient.execute(CloseableHttpClient.java:82)
	at org.apache.http.impl.client.CloseableHttpClient.execute(CloseableHttpClient.java:106)
	at org.apache.http.impl.client.CloseableHttpClient.execute(CloseableHttpClient.java:57)
	at org.dataone.client.rest.RestClient.doRequest(RestClient.java:330)
	at org.dataone.client.rest.RestClient.doRequestMMBody(RestClient.java:306)
	at org.dataone.client.rest.RestClient.doPostRequest(RestClient.java:226)
	at org.dataone.client.rest.HttpMultipartRestClient.doPostRequest(HttpMultipartRestClient.java:463)
	... 35 more
20170423-06:26:27: [INFO]: **************************************************** [org.dataone.integration.ContextAwareTestCaseDataone]
20170423-06:26:27: [INFO]: ***  context label:   STAGE [org.dataone.integration.ContextAwareTestCaseDataone]
20170423-06:26:27: [INFO]: **************************************************** [org.dataone.integration.ContextAwareTestCaseDataone]
20170423-06:26:27: [INFO]: **************************************************** [org.dataone.integration.ContextAwareTestCaseDataone]
                          nodeId  key                       value
=============================================================================================================
20170423-06:26:27: [INFO]: SETUP: finding available nodes... [org.dataone.integration.ContextAwareTestCaseDataone]
20170423-06:26:27: [INFO]: created client for certificate file: cnStageUNM1 with subject: CN=urn:node:cnStageUNM1,DC=dataone,DC=org [org.dataone.integration.ContextAwareTestCaseDataone]
20170423-06:26:27: [INFO]: created client for certificate file: cnStageUNM1 with subject: CN=urn:node:cnStageUNM1,DC=dataone,DC=org [org.dataone.integration.ContextAwareTestCaseDataone]
20170423-06:26:28: [INFO]: RestClient.doRequestNoBody, thread(1) call Info: GET https://cn-stage-orc-1.test.dataone.org/cn/v2/node [org.dataone.client.rest.RestClient]
20170423-06:26:28: [INFO]: created client for certificate file: cnStageUNM1 with subject: CN=urn:node:cnStageUNM1,DC=dataone,DC=org [org.dataone.integration.ContextAwareTestCaseDataone]
20170423-06:26:28: [INFO]: created client for certificate file: cnStageUNM1 with subject: CN=urn:node:cnStageUNM1,DC=dataone,DC=org [org.dataone.integration.ContextAwareTestCaseDataone]
20170423-06:26:58: [INFO]: RestClient.doRequestNoBody, thread(1) call Info: GET https://mn-stage-unm-1.test.dataone.org/mn/v1/monitor/ping [org.dataone.client.rest.RestClient]
20170423-06:26:58: [INFO]: Unable to assess v1 capabilities for MN : https://mn-stage-unm-1.test.dataone.org/mn/v1 : ServiceFailure : class org.dataone.client.exception.ClientSideException: /Connect to mn-stage-unm-1.test.dataone.org:443 [mn-stage-unm-1.test.dataone.org/64.106.40.13] failed: connect timed out [org.dataone.integration.ContextAwareTestCaseDataone]
20170423-06:27:28: [INFO]: RestClient.doRequestNoBody, thread(1) call Info: GET https://mn-stage-unm-1.test.dataone.org/mn/v2/monitor/ping [org.dataone.client.rest.RestClient]
20170423-06:27:28: [INFO]: Unable to assess v2 capabilities for MN: https://mn-stage-unm-1.test.dataone.org/mn/v2 : ServiceFailure : class org.dataone.client.exception.ClientSideException: /Connect to mn-stage-unm-1.test.dataone.org:443 [mn-stage-unm-1.test.dataone.org/64.106.40.13] failed: connect timed out [org.dataone.integration.ContextAwareTestCaseDataone]
20170423-06:27:28: [INFO]: created client for certificate file: cnStageUNM1 with subject: CN=urn:node:cnStageUNM1,DC=dataone,DC=org [org.dataone.integration.ContextAwareTestCaseDataone]
20170423-06:27:28: [INFO]: created client for certificate file: cnStageUNM1 with subject: CN=urn:node:cnStageUNM1,DC=dataone,DC=org [org.dataone.integration.ContextAwareTestCaseDataone]
20170423-06:27:28: [INFO]: RestClient.doRequestNoBody, thread(1) call Info: GET https://mn-stage-ucsb-2.test.dataone.org/knb/d1/mn/v1/monitor/ping [org.dataone.client.rest.RestClient]
20170423-06:27:28: [INFO]: RestClient.doRequestNoBody, thread(1) call Info: GET https://mn-stage-ucsb-2.test.dataone.org/knb/d1/mn/v1/node [org.dataone.client.rest.RestClient]
20170423-06:27:29: [INFO]: RestClient.doRequestNoBody, thread(1) call Info: GET https://mn-stage-ucsb-2.test.dataone.org/knb/d1/mn/v2/monitor/ping [org.dataone.client.rest.RestClient]
20170423-06:27:29: [INFO]: RestClient.doRequestNoBody, thread(1) call Info: GET https://mn-stage-ucsb-2.test.dataone.org/knb/d1/mn/v2/node [org.dataone.client.rest.RestClient]
20170423-06:27:29: [INFO]: created client for certificate file: cnStageUNM1 with subject: CN=urn:node:cnStageUNM1,DC=dataone,DC=org [org.dataone.integration.ContextAwareTestCaseDataone]
20170423-06:27:29: [INFO]: created client for certificate file: cnStageUNM1 with subject: CN=urn:node:cnStageUNM1,DC=dataone,DC=org [org.dataone.integration.ContextAwareTestCaseDataone]
20170423-06:27:29: [INFO]: RestClient.doRequestNoBody, thread(1) call Info: GET http://test.piscoweb.org/catalog/d1/mn/v1/monitor/ping [org.dataone.client.rest.RestClient]
20170423-06:27:29: [INFO]: Unable to assess v1 capabilities for MN : http://test.piscoweb.org/catalog/d1/mn/v1 : ServiceFailure : class org.dataone.client.exception.ClientSideException: /sun.security.validator.ValidatorException: PKIX path building failed: sun.security.provider.certpath.SunCertPathBuilderException: unable to find valid certification path to requested target [org.dataone.integration.ContextAwareTestCaseDataone]
20170423-06:27:30: [INFO]: RestClient.doRequestNoBody, thread(1) call Info: GET http://test.piscoweb.org/catalog/d1/mn/v2/monitor/ping [org.dataone.client.rest.RestClient]
20170423-06:27:30: [INFO]: Unable to assess v2 capabilities for MN: http://test.piscoweb.org/catalog/d1/mn/v2 : ServiceFailure : class org.dataone.client.exception.ClientSideException: /sun.security.validator.ValidatorException: PKIX path building failed: sun.security.provider.certpath.SunCertPathBuilderException: unable to find valid certification path to requested target [org.dataone.integration.ContextAwareTestCaseDataone]
20170423-06:27:30: [INFO]: created client for certificate file: cnStageUNM1 with subject: CN=urn:node:cnStageUNM1,DC=dataone,DC=org [org.dataone.integration.ContextAwareTestCaseDataone]
20170423-06:27:30: [INFO]: created client for certificate file: cnStageUNM1 with subject: CN=urn:node:cnStageUNM1,DC=dataone,DC=org [org.dataone.integration.ContextAwareTestCaseDataone]
20170423-06:27:30: [INFO]: RestClient.doRequestNoBody, thread(1) call Info: GET http://seadva-test.d2i.indiana.edu/sead/rest/mn/v1/monitor/ping [org.dataone.client.rest.RestClient]
20170423-06:27:30: [INFO]: RestClient.doRequestNoBody, thread(1) call Info: GET http://seadva-test.d2i.indiana.edu/sead/rest/mn/v1/node [org.dataone.client.rest.RestClient]
20170423-06:27:30: [INFO]: RestClient.doRequestNoBody, thread(1) call Info: GET http://seadva-test.d2i.indiana.edu/sead/rest/mn/v2/monitor/ping [org.dataone.client.rest.RestClient]
20170423-06:27:30: [INFO]: Unable to assess v2 capabilities for MN: http://seadva-test.d2i.indiana.edu/sead/rest/mn/v2 : ServiceFailure : 404: Not Found: parser for deserializing HTML not written yet.  Providing message body:
<html><head><title>Apache Tomcat/7.0.57 - Error report</title><style><!--H1 {font-family:Tahoma,Arial,sans-serif;color:white;background-color:#525D76;font-size:22px;} H2 {font-family:Tahoma,Arial,sans-serif;color:white;background-color:#525D76;font-size:16px;} H3 {font-family:Tahoma,Arial,sans-serif;color:white;background-color:#525D76;font-size:14px;} BODY {font-family:Tahoma,Arial,sans-serif;color:black;background-color:white;} B {font-family:Tahoma,Arial,sans-serif;color:white;background-color:#525D76;} P {font-family:Tahoma,Arial,sans-serif;background:white;color:black;font-size:12px;}A {color : black;}A.name {color : black;}HR {color : #525D76;}--></style> </head><body><h1>HTTP Status 404 - Not Found</h1><HR size="1" noshade="noshade"><p><b>type</b> Status report</p><p><b>message</b> <u>Not Found</u></p><p><b>description</b> <u>The requested resource is not available.</u></p><HR size="1" noshade="noshade"><h3>Apache Tomcat/7.0.57</h3></body></html> [org.dataone.integration.ContextAwareTestCaseDataone]
20170423-06:27:30: [INFO]: created client for certificate file: cnStageUNM1 with subject: CN=urn:node:cnStageUNM1,DC=dataone,DC=org [org.dataone.integration.ContextAwareTestCaseDataone]
20170423-06:27:30: [INFO]: created client for certificate file: cnStageUNM1 with subject: CN=urn:node:cnStageUNM1,DC=dataone,DC=org [org.dataone.integration.ContextAwareTestCaseDataone]
20170423-06:27:31: [INFO]: RestClient.doRequestNoBody, thread(1) call Info: GET https://mn-demo-11.test.dataone.org/knb/d1/mn/v1/monitor/ping [org.dataone.client.rest.RestClient]
20170423-06:27:31: [INFO]: RestClient.doRequestNoBody, thread(1) call Info: GET https://mn-demo-11.test.dataone.org/knb/d1/mn/v1/node [org.dataone.client.rest.RestClient]
20170423-06:27:31: [INFO]: RestClient.doRequestNoBody, thread(1) call Info: GET https://mn-demo-11.test.dataone.org/knb/d1/mn/v2/monitor/ping [org.dataone.client.rest.RestClient]
20170423-06:27:31: [INFO]: RestClient.doRequestNoBody, thread(1) call Info: GET https://mn-demo-11.test.dataone.org/knb/d1/mn/v2/node [org.dataone.client.rest.RestClient]
20170423-06:27:31: [INFO]: created client for certificate file: cnStageUNM1 with subject: CN=urn:node:cnStageUNM1,DC=dataone,DC=org [org.dataone.integration.ContextAwareTestCaseDataone]
20170423-06:27:31: [INFO]: created client for certificate file: cnStageUNM1 with subject: CN=urn:node:cnStageUNM1,DC=dataone,DC=org [org.dataone.integration.ContextAwareTestCaseDataone]
20170423-06:27:32: [INFO]: RestClient.doRequestNoBody, thread(1) call Info: GET https://gmn-s.lternet.edu/mn/v1/monitor/ping [org.dataone.client.rest.RestClient]
20170423-06:27:32: [INFO]: RestClient.doRequestNoBody, thread(1) call Info: GET https://gmn-s.lternet.edu/mn/v1/node [org.dataone.client.rest.RestClient]
20170423-06:27:32: [INFO]: RestClient.doRequestNoBody, thread(1) call Info: GET https://gmn-s.lternet.edu/mn/v2/monitor/ping [org.dataone.client.rest.RestClient]
20170423-06:27:32: [INFO]: RestClient.doRequestNoBody, thread(1) call Info: GET https://gmn-s.lternet.edu/mn/v2/node [org.dataone.client.rest.RestClient]
20170423-06:27:32: [INFO]: created client for certificate file: cnStageUNM1 with subject: CN=urn:node:cnStageUNM1,DC=dataone,DC=org [org.dataone.integration.ContextAwareTestCaseDataone]
20170423-06:27:32: [INFO]: created client for certificate file: cnStageUNM1 with subject: CN=urn:node:cnStageUNM1,DC=dataone,DC=org [org.dataone.integration.ContextAwareTestCaseDataone]
20170423-06:28:02: [INFO]: RestClient.doRequestNoBody, thread(1) call Info: GET https://dataone-test.pop.umn.edu/mn/v1/monitor/ping [org.dataone.client.rest.RestClient]
20170423-06:28:02: [INFO]: Unable to assess v1 capabilities for MN : https://dataone-test.pop.umn.edu/mn/v1 : ServiceFailure : class org.dataone.client.exception.ClientSideException: /Connect to dataone-test.pop.umn.edu:443 [dataone-test.pop.umn.edu/134.84.88.240] failed: connect timed out [org.dataone.integration.ContextAwareTestCaseDataone]
20170423-06:28:32: [INFO]: RestClient.doRequestNoBody, thread(1) call Info: GET https://dataone-test.pop.umn.edu/mn/v2/monitor/ping [org.dataone.client.rest.RestClient]
20170423-06:28:32: [INFO]: Unable to assess v2 capabilities for MN: https://dataone-test.pop.umn.edu/mn/v2 : ServiceFailure : class org.dataone.client.exception.ClientSideException: /Connect to dataone-test.pop.umn.edu:443 [dataone-test.pop.umn.edu/134.84.88.240] failed: connect timed out [org.dataone.integration.ContextAwareTestCaseDataone]
20170423-06:28:32: [INFO]: created client for certificate file: cnStageUNM1 with subject: CN=urn:node:cnStageUNM1,DC=dataone,DC=org [org.dataone.integration.ContextAwareTestCaseDataone]
20170423-06:28:32: [INFO]: created client for certificate file: cnStageUNM1 with subject: CN=urn:node:cnStageUNM1,DC=dataone,DC=org [org.dataone.integration.ContextAwareTestCaseDataone]
20170423-06:28:33: [INFO]: RestClient.doRequestNoBody, thread(1) call Info: GET https://dataone-dev.ecoinformatics.org.au/mn/v1/monitor/ping [org.dataone.client.rest.RestClient]
20170423-06:28:34: [INFO]: RestClient.doRequestNoBody, thread(1) call Info: GET https://dataone-dev.ecoinformatics.org.au/mn/v1/node [org.dataone.client.rest.RestClient]
20170423-06:28:35: [INFO]: RestClient.doRequestNoBody, thread(1) call Info: GET https://dataone-dev.ecoinformatics.org.au/mn/v2/monitor/ping [org.dataone.client.rest.RestClient]
20170423-06:28:35: [INFO]: Unable to assess v2 capabilities for MN: https://dataone-dev.ecoinformatics.org.au/mn/v2 : ServiceFailure : 404: NOT FOUND: parser for deserializing HTML not written yet.  Providing message body:
<?xml version="1.0" encoding="UTF-8"?>
<!DOCTYPE html 
     PUBLIC "-//W3C//DTD XHTML 1.0 Strict//EN"
    "http://www.w3.org/TR/xhtml1/DTD/xhtml1-strict.dtd">
<html xmlns="http://www.w3.org/1999/xhtml" xml:lang="en" lang="en">
  <head>
    <title>404 Not Found</title>
  </head>
  <body>
    <p>
      <h3><font style="color:red">404 Not Found</font></h3>
    </p>
    <p>
      <a href="/">Home</a>
    </p>
  </body>
</html>

 [org.dataone.integration.ContextAwareTestCaseDataone]
20170423-06:28:35: [INFO]: created client for certificate file: cnStageUNM1 with subject: CN=urn:node:cnStageUNM1,DC=dataone,DC=org [org.dataone.integration.ContextAwareTestCaseDataone]
20170423-06:28:35: [INFO]: created client for certificate file: cnStageUNM1 with subject: CN=urn:node:cnStageUNM1,DC=dataone,DC=org [org.dataone.integration.ContextAwareTestCaseDataone]
20170423-06:28:35: [INFO]: RestClient.doRequestNoBody, thread(1) call Info: GET https://dataonetest.tamucc.edu/mn/v1/monitor/ping [org.dataone.client.rest.RestClient]
20170423-06:28:35: [INFO]: Unable to assess v1 capabilities for MN : https://dataonetest.tamucc.edu/mn/v1 : ServiceFailure : class org.dataone.client.exception.ClientSideException: /dataonetest.tamucc.edu: Name or service not known [org.dataone.integration.ContextAwareTestCaseDataone]
20170423-06:28:35: [INFO]: RestClient.doRequestNoBody, thread(1) call Info: GET https://dataonetest.tamucc.edu/mn/v2/monitor/ping [org.dataone.client.rest.RestClient]
20170423-06:28:35: [INFO]: Unable to assess v2 capabilities for MN: https://dataonetest.tamucc.edu/mn/v2 : ServiceFailure : class org.dataone.client.exception.ClientSideException: /dataonetest.tamucc.edu [org.dataone.integration.ContextAwareTestCaseDataone]
20170423-06:28:35: [INFO]: created client for certificate file: cnStageUNM1 with subject: CN=urn:node:cnStageUNM1,DC=dataone,DC=org [org.dataone.integration.ContextAwareTestCaseDataone]
20170423-06:28:35: [INFO]: created client for certificate file: cnStageUNM1 with subject: CN=urn:node:cnStageUNM1,DC=dataone,DC=org [org.dataone.integration.ContextAwareTestCaseDataone]
20170423-06:28:35: [INFO]: RestClient.doRequestNoBody, thread(1) call Info: GET http://dataone.neonscience.org/metacat/d1/mn/v1/monitor/ping [org.dataone.client.rest.RestClient]
20170423-06:28:35: [INFO]: RestClient.doRequestNoBody, thread(1) call Info: GET http://dataone.neonscience.org/metacat/d1/mn/v1/node [org.dataone.client.rest.RestClient]
20170423-06:28:35: [INFO]: RestClient.doRequestNoBody, thread(1) call Info: GET http://dataone.neonscience.org/metacat/d1/mn/v2/monitor/ping [org.dataone.client.rest.RestClient]
20170423-06:28:35: [INFO]: RestClient.doRequestNoBody, thread(1) call Info: GET http://dataone.neonscience.org/metacat/d1/mn/v2/node [org.dataone.client.rest.RestClient]
20170423-06:28:35: [INFO]: created client for certificate file: cnStageUNM1 with subject: CN=urn:node:cnStageUNM1,DC=dataone,DC=org [org.dataone.integration.ContextAwareTestCaseDataone]
20170423-06:28:35: [INFO]: created client for certificate file: cnStageUNM1 with subject: CN=urn:node:cnStageUNM1,DC=dataone,DC=org [org.dataone.integration.ContextAwareTestCaseDataone]
20170423-06:28:36: [INFO]: RestClient.doRequestNoBody, thread(1) call Info: GET https://test.arcticdata.io/metacat/d1/mn/v1/monitor/ping [org.dataone.client.rest.RestClient]
20170423-06:28:36: [INFO]: RestClient.doRequestNoBody, thread(1) call Info: GET https://test.arcticdata.io/metacat/d1/mn/v1/node [org.dataone.client.rest.RestClient]
20170423-06:28:37: [INFO]: RestClient.doRequestNoBody, thread(1) call Info: GET https://test.arcticdata.io/metacat/d1/mn/v2/monitor/ping [org.dataone.client.rest.RestClient]
20170423-06:28:37: [INFO]: RestClient.doRequestNoBody, thread(1) call Info: GET https://test.arcticdata.io/metacat/d1/mn/v2/node [org.dataone.client.rest.RestClient]
20170423-06:28:37: [INFO]: created client for certificate file: cnStageUNM1 with subject: CN=urn:node:cnStageUNM1,DC=dataone,DC=org [org.dataone.integration.ContextAwareTestCaseDataone]
20170423-06:28:37: [INFO]: created client for certificate file: cnStageUNM1 with subject: CN=urn:node:cnStageUNM1,DC=dataone,DC=org [org.dataone.integration.ContextAwareTestCaseDataone]
20170423-06:28:37: [INFO]: RestClient.doRequestNoBody, thread(1) call Info: GET http://dataone.ornith.cornell.edu/metacat/d1/mn/v1/monitor/ping [org.dataone.client.rest.RestClient]
20170423-06:28:37: [INFO]: RestClient.doRequestNoBody, thread(1) call Info: GET http://dataone.ornith.cornell.edu/metacat/d1/mn/v1/node [org.dataone.client.rest.RestClient]
20170423-06:28:38: [INFO]: RestClient.doRequestNoBody, thread(1) call Info: GET http://dataone.ornith.cornell.edu/metacat/d1/mn/v2/monitor/ping [org.dataone.client.rest.RestClient]
20170423-06:28:38: [INFO]: RestClient.doRequestNoBody, thread(1) call Info: GET http://dataone.ornith.cornell.edu/metacat/d1/mn/v2/node [org.dataone.client.rest.RestClient]
20170423-06:28:38: [INFO]: created client for certificate file: cnStageUNM1 with subject: CN=urn:node:cnStageUNM1,DC=dataone,DC=org [org.dataone.integration.ContextAwareTestCaseDataone]
20170423-06:28:38: [INFO]: created client for certificate file: cnStageUNM1 with subject: CN=urn:node:cnStageUNM1,DC=dataone,DC=org [org.dataone.integration.ContextAwareTestCaseDataone]
20170423-06:28:38: [INFO]: RestClient.doRequestNoBody, thread(1) call Info: GET https://dataone-test.researchworkspace.com/mn/v1/monitor/ping [org.dataone.client.rest.RestClient]
20170423-06:28:38: [INFO]: RestClient.doRequestNoBody, thread(1) call Info: GET https://dataone-test.researchworkspace.com/mn/v1/node [org.dataone.client.rest.RestClient]
20170423-06:28:39: [INFO]: RestClient.doRequestNoBody, thread(1) call Info: GET https://dataone-test.researchworkspace.com/mn/v2/monitor/ping [org.dataone.client.rest.RestClient]
20170423-06:28:39: [INFO]: RestClient.doRequestNoBody, thread(1) call Info: GET https://dataone-test.researchworkspace.com/mn/v2/node [org.dataone.client.rest.RestClient]
20170423-06:28:39: [INFO]: created client for certificate file: cnStageUNM1 with subject: CN=urn:node:cnStageUNM1,DC=dataone,DC=org [org.dataone.integration.ContextAwareTestCaseDataone]
20170423-06:28:39: [INFO]: created client for certificate file: cnStageUNM1 with subject: CN=urn:node:cnStageUNM1,DC=dataone,DC=org [org.dataone.integration.ContextAwareTestCaseDataone]
20170423-06:28:39: [INFO]: RestClient.doRequestNoBody, thread(1) call Info: GET https://r2r-node.test.dataone.org/mn/v1/monitor/ping [org.dataone.client.rest.RestClient]
20170423-06:28:39: [INFO]: Unable to assess v1 capabilities for MN : https://r2r-node.test.dataone.org/mn/v1 : ServiceFailure : class org.dataone.client.exception.ClientSideException: /r2r-node.test.dataone.org: Name or service not known [org.dataone.integration.ContextAwareTestCaseDataone]
20170423-06:28:39: [INFO]: RestClient.doRequestNoBody, thread(1) call Info: GET https://r2r-node.test.dataone.org/mn/v2/monitor/ping [org.dataone.client.rest.RestClient]
20170423-06:28:39: [INFO]: Unable to assess v2 capabilities for MN: https://r2r-node.test.dataone.org/mn/v2 : ServiceFailure : class org.dataone.client.exception.ClientSideException: /r2r-node.test.dataone.org [org.dataone.integration.ContextAwareTestCaseDataone]
20170423-06:28:39: [INFO]: created client for certificate file: cnStageUNM1 with subject: CN=urn:node:cnStageUNM1,DC=dataone,DC=org [org.dataone.integration.ContextAwareTestCaseDataone]
20170423-06:28:39: [INFO]: created client for certificate file: cnStageUNM1 with subject: CN=urn:node:cnStageUNM1,DC=dataone,DC=org [org.dataone.integration.ContextAwareTestCaseDataone]
20170423-06:28:39: [INFO]: RestClient.doRequestNoBody, thread(1) call Info: GET https://dataone.lib.uic.edu/metacat/d1/mn/v1/monitor/ping [org.dataone.client.rest.RestClient]
20170423-06:28:39: [INFO]: Unable to assess v1 capabilities for MN : https://dataone.lib.uic.edu/metacat/d1/mn/v1 : ServiceFailure : class org.dataone.client.exception.ClientSideException: /Received fatal alert: unknown_ca [org.dataone.integration.ContextAwareTestCaseDataone]
20170423-06:28:40: [INFO]: RestClient.doRequestNoBody, thread(1) call Info: GET https://dataone.lib.uic.edu/metacat/d1/mn/v2/monitor/ping [org.dataone.client.rest.RestClient]
20170423-06:28:40: [INFO]: Unable to assess v2 capabilities for MN: https://dataone.lib.uic.edu/metacat/d1/mn/v2 : ServiceFailure : class org.dataone.client.exception.ClientSideException: /Received fatal alert: unknown_ca [org.dataone.integration.ContextAwareTestCaseDataone]
20170423-06:28:40: [INFO]: created client for certificate file: cnStageUNM1 with subject: CN=urn:node:cnStageUNM1,DC=dataone,DC=org [org.dataone.integration.ContextAwareTestCaseDataone]
20170423-06:28:40: [INFO]: created client for certificate file: cnStageUNM1 with subject: CN=urn:node:cnStageUNM1,DC=dataone,DC=org [org.dataone.integration.ContextAwareTestCaseDataone]
20170423-06:28:40: [INFO]: RestClient.doRequestNoBody, thread(1) call Info: GET https://gmn-s.edirepository.org/mn/v1/monitor/ping [org.dataone.client.rest.RestClient]
20170423-06:28:40: [INFO]: RestClient.doRequestNoBody, thread(1) call Info: GET https://gmn-s.edirepository.org/mn/v1/node [org.dataone.client.rest.RestClient]
20170423-06:28:40: [INFO]: RestClient.doRequestNoBody, thread(1) call Info: GET https://gmn-s.edirepository.org/mn/v2/monitor/ping [org.dataone.client.rest.RestClient]
20170423-06:28:40: [INFO]: RestClient.doRequestNoBody, thread(1) call Info: GET https://gmn-s.edirepository.org/mn/v2/node [org.dataone.client.rest.RestClient]
20170423-06:28:40: [INFO]: created client for certificate file: cnStageUNM1 with subject: CN=urn:node:cnStageUNM1,DC=dataone,DC=org [org.dataone.integration.ContextAwareTestCaseDataone]
20170423-06:28:40: [INFO]: created client for certificate file: cnStageUNM1 with subject: CN=urn:node:cnStageUNM1,DC=dataone,DC=org [org.dataone.integration.ContextAwareTestCaseDataone]
20170423-06:28:41: [INFO]: RestClient.doRequestNoBody, thread(1) call Info: GET https://ncei.nceas.ucsb.edu/mn/v1/monitor/ping [org.dataone.client.rest.RestClient]
20170423-06:28:41: [INFO]: Unable to assess v1 capabilities for MN : https://ncei.nceas.ucsb.edu/mn/v1 : ServiceFailure : class org.dataone.client.exception.ClientSideException: /Received fatal alert: unknown_ca [org.dataone.integration.ContextAwareTestCaseDataone]
20170423-06:28:41: [INFO]: RestClient.doRequestNoBody, thread(1) call Info: GET https://ncei.nceas.ucsb.edu/mn/v2/monitor/ping [org.dataone.client.rest.RestClient]
20170423-06:28:41: [INFO]: Unable to assess v2 capabilities for MN: https://ncei.nceas.ucsb.edu/mn/v2 : ServiceFailure : class org.dataone.client.exception.ClientSideException: /Received fatal alert: unknown_ca [org.dataone.integration.ContextAwareTestCaseDataone]
20170423-06:28:41: [INFO]: v1-ONLY MNs available:     0 [org.dataone.integration.ContextAwareTestCaseDataone]
20170423-06:28:41: [INFO]: v2 MNs available:          8 [org.dataone.integration.ContextAwareTestCaseDataone]
20170423-06:28:41: [INFO]: v1 & v2 MNs available:     7 [org.dataone.integration.ContextAwareTestCaseDataone]
20170423-06:28:41: [INFO]: available MNs:             8 [org.dataone.integration.ContextAwareTestCaseDataone]
20170423-06:28:41: [INFO]: v2 MN     :   https://mn-stage-ucsb-2.test.dataone.org/knb/d1/mn [org.dataone.integration.ContextAwareTestCaseDataone]
20170423-06:28:41: [INFO]: v2 MN     :   https://mn-demo-11.test.dataone.org/knb/d1/mn [org.dataone.integration.ContextAwareTestCaseDataone]
20170423-06:28:41: [INFO]: v2 MN     :   https://gmn-s.lternet.edu/mn [org.dataone.integration.ContextAwareTestCaseDataone]
20170423-06:28:41: [INFO]: v2 MN     :   http://dataone.neonscience.org/metacat/d1/mn [org.dataone.integration.ContextAwareTestCaseDataone]
20170423-06:28:41: [INFO]: v2 MN     :   https://test.arcticdata.io/metacat/d1/mn [org.dataone.integration.ContextAwareTestCaseDataone]
20170423-06:28:41: [INFO]: v2 MN     :   http://dataone.ornith.cornell.edu/metacat/d1/mn [org.dataone.integration.ContextAwareTestCaseDataone]
20170423-06:28:41: [INFO]: v2 MN     :   https://dataone-test.researchworkspace.com/mn [org.dataone.integration.ContextAwareTestCaseDataone]
20170423-06:28:41: [INFO]: v2 MN     :   https://gmn-s.edirepository.org/mn [org.dataone.integration.ContextAwareTestCaseDataone]
20170423-06:28:41: [INFO]: v1 & v2 MN:   https://mn-stage-ucsb-2.test.dataone.org/knb/d1/mn [org.dataone.integration.ContextAwareTestCaseDataone]
20170423-06:28:41: [INFO]: v1 & v2 MN:   https://mn-demo-11.test.dataone.org/knb/d1/mn [org.dataone.integration.ContextAwareTestCaseDataone]
20170423-06:28:41: [INFO]: v1 & v2 MN:   https://gmn-s.lternet.edu/mn [org.dataone.integration.ContextAwareTestCaseDataone]
20170423-06:28:41: [INFO]: v1 & v2 MN:   https://test.arcticdata.io/metacat/d1/mn [org.dataone.integration.ContextAwareTestCaseDataone]
20170423-06:28:41: [INFO]: v1 & v2 MN:   http://dataone.ornith.cornell.edu/metacat/d1/mn [org.dataone.integration.ContextAwareTestCaseDataone]
20170423-06:28:41: [INFO]: v1 & v2 MN:   https://dataone-test.researchworkspace.com/mn [org.dataone.integration.ContextAwareTestCaseDataone]
20170423-06:28:41: [INFO]: v1 & v2 MN:   https://gmn-s.edirepository.org/mn [org.dataone.integration.ContextAwareTestCaseDataone]
20170423-06:28:41: [INFO]: SETUP: creating test objects... [org.dataone.integration.ContextAwareTestCaseDataone]
20170423-06:28:41: [INFO]: created client for certificate file: testRightsHolder with subject: CN=testRightsHolder,DC=dataone,DC=org [org.dataone.integration.ContextAwareTestCaseDataone]
20170423-06:28:41: [INFO]: created client for certificate file: cnStageUNM1 with subject: CN=urn:node:cnStageUNM1,DC=dataone,DC=org [org.dataone.integration.ContextAwareTestCaseDataone]
20170423-06:28:41: [INFO]: certificate directory: /etc/dataone/client/testClientCerts/ [org.dataone.integration.ContextAwareTestCaseDataone]
20170423-06:28:41: [INFO]: certificate filename: testRightsHolder [org.dataone.integration.ContextAwareTestCaseDataone]
20170423-06:28:41: [INFO]: client setup as Subject: CN=testRightsHolder,DC=dataone,DC=org [org.dataone.integration.ContextAwareTestCaseDataone]
20170423-06:28:41: [INFO]: creating a test object.  pid = testV2CreateV1UpdateSameNode_pid_2017112232841370 on https://mn-stage-ucsb-2.test.dataone.org/knb/d1/mn/v2 [org.dataone.integration.ContextAwareTestCaseDataone]
20170423-06:28:41: [INFO]: SystemMetadata for pid: testV2CreateV1UpdateSameNode_pid_2017112232841370
<?xml version="1.0" encoding="UTF-8" standalone="yes"?>
<ns3:systemMetadata xmlns:ns2="http://ns.dataone.org/service/types/v1" xmlns:ns3="http://ns.dataone.org/service/types/v2.0">
    <serialVersion>1</serialVersion>
    <identifier>testV2CreateV1UpdateSameNode_pid_2017112232841370</identifier>
    <formatId>eml://ecoinformatics.org/eml-2.0.1</formatId>
    <size>17181</size>
    <checksum algorithm="MD5">03ce09c6b4c3efc1681f3023402998a2</checksum>
    <submitter>CN=testRightsHolder,DC=dataone,DC=org</submitter>
    <rightsHolder>testRightsHolder</rightsHolder>
    <accessPolicy>
        <allow>
            <subject>public</subject>
            <permission>changePermission</permission>
        </allow>
    </accessPolicy>
    <dateUploaded>2017-04-23T06:28:41.377+00:00</dateUploaded>
    <dateSysMetadataModified>2017-04-23T06:28:41.377+00:00</dateSysMetadataModified>
    <originMemberNode>urn:node:mnStageUCSB2</originMemberNode>
    <authoritativeMemberNode>urn:node:mnStageUCSB2</authoritativeMemberNode>
    <seriesId>testV2CreateV1UpdateSameNode_sid_2017112232841370</seriesId>
</ns3:systemMetadata>
 [org.dataone.integration.ContextAwareTestCaseDataone]
20170423-06:28:49: [INFO]: RestClient.doRequestMMPBody, thread(1) call Info: POST https://mn-stage-ucsb-2.test.dataone.org/knb/d1/mn/v2/object; MMP message has: ParamPart:pid = testV2CreateV1UpdateSameNode_pid_2017112232841370; FilePart:object = /tmp/mmp.output.6545377220580518506.tmp (17181 bytes); FilePart:sysmeta = /tmp/mmp.output.4294393674481266119.tmp (1118 bytes);  [org.dataone.client.rest.RestClient]
20170423-06:28:49: [INFO]: object created.  pid = testV2CreateV1UpdateSameNode_pid_2017112232841370 [org.dataone.integration.ContextAwareTestCaseDataone]
20170423-06:28:49: [INFO]: created client for certificate file: testRightsHolder with subject: CN=testRightsHolder,DC=dataone,DC=org [org.dataone.integration.ContextAwareTestCaseDataone]
20170423-06:28:49: [INFO]: created client for certificate file: cnStageUNM1 with subject: CN=urn:node:cnStageUNM1,DC=dataone,DC=org [org.dataone.integration.ContextAwareTestCaseDataone]
20170423-06:28:49: [INFO]: certificate directory: /etc/dataone/client/testClientCerts/ [org.dataone.integration.ContextAwareTestCaseDataone]
20170423-06:28:49: [INFO]: certificate filename: cnStageUNM1 [org.dataone.integration.ContextAwareTestCaseDataone]
20170423-06:28:49: [WARN]: registering ConnectionManager... [org.dataone.client.utils.HttpConnectionMonitorService]
20170423-06:28:49: [INFO]: client setup as Subject: CN=urn:node:cnStageUNM1,DC=dataone,DC=org [org.dataone.integration.ContextAwareTestCaseDataone]
20170423-06:28:49: [INFO]: creating a test object.  pid = testV1CreateV2UpdateSameNode_1_2017112232841370 on https://mn-stage-ucsb-2.test.dataone.org/knb/d1/mn/v1 [org.dataone.integration.ContextAwareTestCaseDataone]
20170423-06:28:49: [INFO]: SystemMetadata for pid: testV1CreateV2UpdateSameNode_1_2017112232841370
<?xml version="1.0" encoding="UTF-8" standalone="yes"?>
<ns3:systemMetadata xmlns:ns2="http://ns.dataone.org/service/types/v1" xmlns:ns3="http://ns.dataone.org/service/types/v2.0">
    <serialVersion>1</serialVersion>
    <identifier>testV1CreateV2UpdateSameNode_1_2017112232841370</identifier>
    <formatId>eml://ecoinformatics.org/eml-2.0.1</formatId>
    <size>17181</size>
    <checksum algorithm="MD5">03ce09c6b4c3efc1681f3023402998a2</checksum>
    <submitter>CN=urn:node:cnStageUNM1,DC=dataone,DC=org</submitter>
    <rightsHolder>CN=testRightsHolder,DC=dataone,DC=org</rightsHolder>
    <accessPolicy>
        <allow>
            <subject>public</subject>
            <permission>changePermission</permission>
        </allow>
    </accessPolicy>
    <dateUploaded>2017-04-23T06:28:49.701+00:00</dateUploaded>
    <dateSysMetadataModified>2017-04-23T06:28:49.701+00:00</dateSysMetadataModified>
    <originMemberNode>urn:node:mnStageUCSB2</originMemberNode>
    <authoritativeMemberNode>urn:node:mnStageUCSB2</authoritativeMemberNode>
</ns3:systemMetadata>
 [org.dataone.integration.ContextAwareTestCaseDataone]
20170423-06:28:55: [INFO]: RestClient.doRequestMMPBody, thread(1) call Info: POST https://mn-stage-ucsb-2.test.dataone.org/knb/d1/mn/v1/object; MMP message has: ParamPart:pid = testV1CreateV2UpdateSameNode_1_2017112232841370; FilePart:object = /tmp/mmp.output.5362149247421894983.tmp (17181 bytes); FilePart:sysmeta = /tmp/mmp.output.5909411531995669733.tmp (1013 bytes);  [org.dataone.client.rest.RestClient]
20170423-06:28:55: [INFO]: object created.  pid = testV1CreateV2UpdateSameNode_1_2017112232841370 [org.dataone.integration.ContextAwareTestCaseDataone]
20170423-06:28:55: [WARN]: registering ConnectionManager... [org.dataone.client.utils.HttpConnectionMonitorService]
20170423-06:28:55: [INFO]: **************************************************** [org.dataone.integration.ContextAwareTestCaseDataone]
20170423-06:28:55: [INFO]: ***  context label:   STAGE [org.dataone.integration.ContextAwareTestCaseDataone]
20170423-06:28:55: [INFO]: **************************************************** [org.dataone.integration.ContextAwareTestCaseDataone]
20170423-06:28:55: [INFO]: **************************************************** [org.dataone.integration.ContextAwareTestCaseDataone]
                          nodeId  key                       value
=============================================================================================================
20170423-06:28:55: [INFO]: SETUP: finding available nodes... [org.dataone.integration.ContextAwareTestCaseDataone]
20170423-06:28:55: [INFO]: created client for certificate file: cnStageUNM1 with subject: CN=urn:node:cnStageUNM1,DC=dataone,DC=org [org.dataone.integration.ContextAwareTestCaseDataone]
20170423-06:28:55: [INFO]: created client for certificate file: cnStageUNM1 with subject: CN=urn:node:cnStageUNM1,DC=dataone,DC=org [org.dataone.integration.ContextAwareTestCaseDataone]
20170423-06:28:56: [INFO]: RestClient.doRequestNoBody, thread(1) call Info: GET https://cn-stage-orc-1.test.dataone.org/cn/v2/node [org.dataone.client.rest.RestClient]
20170423-06:28:56: [INFO]: created client for certificate file: cnStageUNM1 with subject: CN=urn:node:cnStageUNM1,DC=dataone,DC=org [org.dataone.integration.ContextAwareTestCaseDataone]
20170423-06:28:56: [INFO]: created client for certificate file: cnStageUNM1 with subject: CN=urn:node:cnStageUNM1,DC=dataone,DC=org [org.dataone.integration.ContextAwareTestCaseDataone]
20170423-06:29:27: [INFO]: RestClient.doRequestNoBody, thread(1) call Info: GET https://mn-stage-unm-1.test.dataone.org/mn/v1/monitor/ping [org.dataone.client.rest.RestClient]
20170423-06:29:27: [INFO]: Unable to assess v1 capabilities for MN : https://mn-stage-unm-1.test.dataone.org/mn/v1 : ServiceFailure : class org.dataone.client.exception.ClientSideException: /Connect to mn-stage-unm-1.test.dataone.org:443 [mn-stage-unm-1.test.dataone.org/64.106.40.13] failed: connect timed out [org.dataone.integration.ContextAwareTestCaseDataone]
20170423-06:29:57: [INFO]: RestClient.doRequestNoBody, thread(1) call Info: GET https://mn-stage-unm-1.test.dataone.org/mn/v2/monitor/ping [org.dataone.client.rest.RestClient]
20170423-06:29:57: [INFO]: Unable to assess v2 capabilities for MN: https://mn-stage-unm-1.test.dataone.org/mn/v2 : ServiceFailure : class org.dataone.client.exception.ClientSideException: /Connect to mn-stage-unm-1.test.dataone.org:443 [mn-stage-unm-1.test.dataone.org/64.106.40.13] failed: connect timed out [org.dataone.integration.ContextAwareTestCaseDataone]
20170423-06:29:57: [INFO]: created client for certificate file: cnStageUNM1 with subject: CN=urn:node:cnStageUNM1,DC=dataone,DC=org [org.dataone.integration.ContextAwareTestCaseDataone]
20170423-06:29:57: [INFO]: created client for certificate file: cnStageUNM1 with subject: CN=urn:node:cnStageUNM1,DC=dataone,DC=org [org.dataone.integration.ContextAwareTestCaseDataone]
20170423-06:29:57: [INFO]: RestClient.doRequestNoBody, thread(1) call Info: GET https://mn-stage-ucsb-2.test.dataone.org/knb/d1/mn/v1/monitor/ping [org.dataone.client.rest.RestClient]
20170423-06:29:57: [INFO]: RestClient.doRequestNoBody, thread(1) call Info: GET https://mn-stage-ucsb-2.test.dataone.org/knb/d1/mn/v1/node [org.dataone.client.rest.RestClient]
20170423-06:29:57: [INFO]: RestClient.doRequestNoBody, thread(1) call Info: GET https://mn-stage-ucsb-2.test.dataone.org/knb/d1/mn/v2/monitor/ping [org.dataone.client.rest.RestClient]
20170423-06:29:57: [INFO]: RestClient.doRequestNoBody, thread(1) call Info: GET https://mn-stage-ucsb-2.test.dataone.org/knb/d1/mn/v2/node [org.dataone.client.rest.RestClient]
20170423-06:29:57: [INFO]: created client for certificate file: cnStageUNM1 with subject: CN=urn:node:cnStageUNM1,DC=dataone,DC=org [org.dataone.integration.ContextAwareTestCaseDataone]
20170423-06:29:57: [INFO]: created client for certificate file: cnStageUNM1 with subject: CN=urn:node:cnStageUNM1,DC=dataone,DC=org [org.dataone.integration.ContextAwareTestCaseDataone]
20170423-06:29:58: [INFO]: RestClient.doRequestNoBody, thread(1) call Info: GET http://test.piscoweb.org/catalog/d1/mn/v1/monitor/ping [org.dataone.client.rest.RestClient]
20170423-06:29:58: [INFO]: Unable to assess v1 capabilities for MN : http://test.piscoweb.org/catalog/d1/mn/v1 : ServiceFailure : class org.dataone.client.exception.ClientSideException: /sun.security.validator.ValidatorException: PKIX path building failed: sun.security.provider.certpath.SunCertPathBuilderException: unable to find valid certification path to requested target [org.dataone.integration.ContextAwareTestCaseDataone]
20170423-06:29:58: [INFO]: RestClient.doRequestNoBody, thread(1) call Info: GET http://test.piscoweb.org/catalog/d1/mn/v2/monitor/ping [org.dataone.client.rest.RestClient]
20170423-06:29:58: [INFO]: Unable to assess v2 capabilities for MN: http://test.piscoweb.org/catalog/d1/mn/v2 : ServiceFailure : class org.dataone.client.exception.ClientSideException: /sun.security.validator.ValidatorException: PKIX path building failed: sun.security.provider.certpath.SunCertPathBuilderException: unable to find valid certification path to requested target [org.dataone.integration.ContextAwareTestCaseDataone]
20170423-06:29:58: [INFO]: created client for certificate file: cnStageUNM1 with subject: CN=urn:node:cnStageUNM1,DC=dataone,DC=org [org.dataone.integration.ContextAwareTestCaseDataone]
20170423-06:29:58: [INFO]: created client for certificate file: cnStageUNM1 with subject: CN=urn:node:cnStageUNM1,DC=dataone,DC=org [org.dataone.integration.ContextAwareTestCaseDataone]
20170423-06:29:59: [INFO]: RestClient.doRequestNoBody, thread(1) call Info: GET http://seadva-test.d2i.indiana.edu/sead/rest/mn/v1/monitor/ping [org.dataone.client.rest.RestClient]
20170423-06:29:59: [INFO]: RestClient.doRequestNoBody, thread(1) call Info: GET http://seadva-test.d2i.indiana.edu/sead/rest/mn/v1/node [org.dataone.client.rest.RestClient]
20170423-06:29:59: [INFO]: RestClient.doRequestNoBody, thread(1) call Info: GET http://seadva-test.d2i.indiana.edu/sead/rest/mn/v2/monitor/ping [org.dataone.client.rest.RestClient]
20170423-06:29:59: [INFO]: Unable to assess v2 capabilities for MN: http://seadva-test.d2i.indiana.edu/sead/rest/mn/v2 : ServiceFailure : 404: Not Found: parser for deserializing HTML not written yet.  Providing message body:
<html><head><title>Apache Tomcat/7.0.57 - Error report</title><style><!--H1 {font-family:Tahoma,Arial,sans-serif;color:white;background-color:#525D76;font-size:22px;} H2 {font-family:Tahoma,Arial,sans-serif;color:white;background-color:#525D76;font-size:16px;} H3 {font-family:Tahoma,Arial,sans-serif;color:white;background-color:#525D76;font-size:14px;} BODY {font-family:Tahoma,Arial,sans-serif;color:black;background-color:white;} B {font-family:Tahoma,Arial,sans-serif;color:white;background-color:#525D76;} P {font-family:Tahoma,Arial,sans-serif;background:white;color:black;font-size:12px;}A {color : black;}A.name {color : black;}HR {color : #525D76;}--></style> </head><body><h1>HTTP Status 404 - Not Found</h1><HR size="1" noshade="noshade"><p><b>type</b> Status report</p><p><b>message</b> <u>Not Found</u></p><p><b>description</b> <u>The requested resource is not available.</u></p><HR size="1" noshade="noshade"><h3>Apache Tomcat/7.0.57</h3></body></html> [org.dataone.integration.ContextAwareTestCaseDataone]
20170423-06:29:59: [INFO]: created client for certificate file: cnStageUNM1 with subject: CN=urn:node:cnStageUNM1,DC=dataone,DC=org [org.dataone.integration.ContextAwareTestCaseDataone]
20170423-06:29:59: [INFO]: created client for certificate file: cnStageUNM1 with subject: CN=urn:node:cnStageUNM1,DC=dataone,DC=org [org.dataone.integration.ContextAwareTestCaseDataone]
20170423-06:29:59: [INFO]: RestClient.doRequestNoBody, thread(1) call Info: GET https://mn-demo-11.test.dataone.org/knb/d1/mn/v1/monitor/ping [org.dataone.client.rest.RestClient]
20170423-06:29:59: [INFO]: RestClient.doRequestNoBody, thread(1) call Info: GET https://mn-demo-11.test.dataone.org/knb/d1/mn/v1/node [org.dataone.client.rest.RestClient]
20170423-06:30:00: [INFO]: RestClient.doRequestNoBody, thread(1) call Info: GET https://mn-demo-11.test.dataone.org/knb/d1/mn/v2/monitor/ping [org.dataone.client.rest.RestClient]
20170423-06:30:00: [INFO]: RestClient.doRequestNoBody, thread(1) call Info: GET https://mn-demo-11.test.dataone.org/knb/d1/mn/v2/node [org.dataone.client.rest.RestClient]
20170423-06:30:00: [INFO]: created client for certificate file: cnStageUNM1 with subject: CN=urn:node:cnStageUNM1,DC=dataone,DC=org [org.dataone.integration.ContextAwareTestCaseDataone]
20170423-06:30:00: [INFO]: created client for certificate file: cnStageUNM1 with subject: CN=urn:node:cnStageUNM1,DC=dataone,DC=org [org.dataone.integration.ContextAwareTestCaseDataone]
20170423-06:30:00: [INFO]: RestClient.doRequestNoBody, thread(1) call Info: GET https://gmn-s.lternet.edu/mn/v1/monitor/ping [org.dataone.client.rest.RestClient]
20170423-06:30:00: [INFO]: RestClient.doRequestNoBody, thread(1) call Info: GET https://gmn-s.lternet.edu/mn/v1/node [org.dataone.client.rest.RestClient]
20170423-06:30:00: [INFO]: RestClient.doRequestNoBody, thread(1) call Info: GET https://gmn-s.lternet.edu/mn/v2/monitor/ping [org.dataone.client.rest.RestClient]
20170423-06:30:00: [INFO]: RestClient.doRequestNoBody, thread(1) call Info: GET https://gmn-s.lternet.edu/mn/v2/node [org.dataone.client.rest.RestClient]
20170423-06:30:00: [INFO]: created client for certificate file: cnStageUNM1 with subject: CN=urn:node:cnStageUNM1,DC=dataone,DC=org [org.dataone.integration.ContextAwareTestCaseDataone]
20170423-06:30:00: [INFO]: created client for certificate file: cnStageUNM1 with subject: CN=urn:node:cnStageUNM1,DC=dataone,DC=org [org.dataone.integration.ContextAwareTestCaseDataone]
20170423-06:30:30: [INFO]: RestClient.doRequestNoBody, thread(1) call Info: GET https://dataone-test.pop.umn.edu/mn/v1/monitor/ping [org.dataone.client.rest.RestClient]
20170423-06:30:30: [INFO]: Unable to assess v1 capabilities for MN : https://dataone-test.pop.umn.edu/mn/v1 : ServiceFailure : class org.dataone.client.exception.ClientSideException: /Connect to dataone-test.pop.umn.edu:443 [dataone-test.pop.umn.edu/134.84.88.240] failed: connect timed out [org.dataone.integration.ContextAwareTestCaseDataone]
20170423-06:31:00: [INFO]: RestClient.doRequestNoBody, thread(1) call Info: GET https://dataone-test.pop.umn.edu/mn/v2/monitor/ping [org.dataone.client.rest.RestClient]
20170423-06:31:00: [INFO]: Unable to assess v2 capabilities for MN: https://dataone-test.pop.umn.edu/mn/v2 : ServiceFailure : class org.dataone.client.exception.ClientSideException: /Connect to dataone-test.pop.umn.edu:443 [dataone-test.pop.umn.edu/134.84.88.240] failed: connect timed out [org.dataone.integration.ContextAwareTestCaseDataone]
20170423-06:31:00: [INFO]: created client for certificate file: cnStageUNM1 with subject: CN=urn:node:cnStageUNM1,DC=dataone,DC=org [org.dataone.integration.ContextAwareTestCaseDataone]
20170423-06:31:00: [INFO]: created client for certificate file: cnStageUNM1 with subject: CN=urn:node:cnStageUNM1,DC=dataone,DC=org [org.dataone.integration.ContextAwareTestCaseDataone]
20170423-06:31:02: [INFO]: RestClient.doRequestNoBody, thread(1) call Info: GET https://dataone-dev.ecoinformatics.org.au/mn/v1/monitor/ping [org.dataone.client.rest.RestClient]
20170423-06:31:03: [INFO]: RestClient.doRequestNoBody, thread(1) call Info: GET https://dataone-dev.ecoinformatics.org.au/mn/v1/node [org.dataone.client.rest.RestClient]
20170423-06:31:03: [INFO]: RestClient.doRequestNoBody, thread(1) call Info: GET https://dataone-dev.ecoinformatics.org.au/mn/v2/monitor/ping [org.dataone.client.rest.RestClient]
20170423-06:31:03: [INFO]: Unable to assess v2 capabilities for MN: https://dataone-dev.ecoinformatics.org.au/mn/v2 : ServiceFailure : 404: NOT FOUND: parser for deserializing HTML not written yet.  Providing message body:
<?xml version="1.0" encoding="UTF-8"?>
<!DOCTYPE html 
     PUBLIC "-//W3C//DTD XHTML 1.0 Strict//EN"
    "http://www.w3.org/TR/xhtml1/DTD/xhtml1-strict.dtd">
<html xmlns="http://www.w3.org/1999/xhtml" xml:lang="en" lang="en">
  <head>
    <title>404 Not Found</title>
  </head>
  <body>
    <p>
      <h3><font style="color:red">404 Not Found</font></h3>
    </p>
    <p>
      <a href="/">Home</a>
    </p>
  </body>
</html>

 [org.dataone.integration.ContextAwareTestCaseDataone]
20170423-06:31:03: [INFO]: created client for certificate file: cnStageUNM1 with subject: CN=urn:node:cnStageUNM1,DC=dataone,DC=org [org.dataone.integration.ContextAwareTestCaseDataone]
20170423-06:31:03: [INFO]: created client for certificate file: cnStageUNM1 with subject: CN=urn:node:cnStageUNM1,DC=dataone,DC=org [org.dataone.integration.ContextAwareTestCaseDataone]
20170423-06:31:04: [INFO]: RestClient.doRequestNoBody, thread(1) call Info: GET https://dataonetest.tamucc.edu/mn/v1/monitor/ping [org.dataone.client.rest.RestClient]
20170423-06:31:04: [INFO]: Unable to assess v1 capabilities for MN : https://dataonetest.tamucc.edu/mn/v1 : ServiceFailure : class org.dataone.client.exception.ClientSideException: /dataonetest.tamucc.edu: Name or service not known [org.dataone.integration.ContextAwareTestCaseDataone]
20170423-06:31:04: [INFO]: RestClient.doRequestNoBody, thread(1) call Info: GET https://dataonetest.tamucc.edu/mn/v2/monitor/ping [org.dataone.client.rest.RestClient]
20170423-06:31:04: [INFO]: Unable to assess v2 capabilities for MN: https://dataonetest.tamucc.edu/mn/v2 : ServiceFailure : class org.dataone.client.exception.ClientSideException: /dataonetest.tamucc.edu [org.dataone.integration.ContextAwareTestCaseDataone]
20170423-06:31:04: [INFO]: created client for certificate file: cnStageUNM1 with subject: CN=urn:node:cnStageUNM1,DC=dataone,DC=org [org.dataone.integration.ContextAwareTestCaseDataone]
20170423-06:31:04: [INFO]: created client for certificate file: cnStageUNM1 with subject: CN=urn:node:cnStageUNM1,DC=dataone,DC=org [org.dataone.integration.ContextAwareTestCaseDataone]
20170423-06:31:04: [INFO]: RestClient.doRequestNoBody, thread(1) call Info: GET http://dataone.neonscience.org/metacat/d1/mn/v1/monitor/ping [org.dataone.client.rest.RestClient]
20170423-06:31:04: [INFO]: RestClient.doRequestNoBody, thread(1) call Info: GET http://dataone.neonscience.org/metacat/d1/mn/v1/node [org.dataone.client.rest.RestClient]
20170423-06:31:04: [INFO]: RestClient.doRequestNoBody, thread(1) call Info: GET http://dataone.neonscience.org/metacat/d1/mn/v2/monitor/ping [org.dataone.client.rest.RestClient]
20170423-06:31:04: [INFO]: RestClient.doRequestNoBody, thread(1) call Info: GET http://dataone.neonscience.org/metacat/d1/mn/v2/node [org.dataone.client.rest.RestClient]
20170423-06:31:04: [INFO]: created client for certificate file: cnStageUNM1 with subject: CN=urn:node:cnStageUNM1,DC=dataone,DC=org [org.dataone.integration.ContextAwareTestCaseDataone]
20170423-06:31:04: [INFO]: created client for certificate file: cnStageUNM1 with subject: CN=urn:node:cnStageUNM1,DC=dataone,DC=org [org.dataone.integration.ContextAwareTestCaseDataone]
20170423-06:31:05: [INFO]: RestClient.doRequestNoBody, thread(1) call Info: GET https://test.arcticdata.io/metacat/d1/mn/v1/monitor/ping [org.dataone.client.rest.RestClient]
20170423-06:31:05: [INFO]: RestClient.doRequestNoBody, thread(1) call Info: GET https://test.arcticdata.io/metacat/d1/mn/v1/node [org.dataone.client.rest.RestClient]
20170423-06:31:05: [INFO]: RestClient.doRequestNoBody, thread(1) call Info: GET https://test.arcticdata.io/metacat/d1/mn/v2/monitor/ping [org.dataone.client.rest.RestClient]
20170423-06:31:06: [INFO]: RestClient.doRequestNoBody, thread(1) call Info: GET https://test.arcticdata.io/metacat/d1/mn/v2/node [org.dataone.client.rest.RestClient]
20170423-06:31:06: [INFO]: created client for certificate file: cnStageUNM1 with subject: CN=urn:node:cnStageUNM1,DC=dataone,DC=org [org.dataone.integration.ContextAwareTestCaseDataone]
20170423-06:31:06: [INFO]: created client for certificate file: cnStageUNM1 with subject: CN=urn:node:cnStageUNM1,DC=dataone,DC=org [org.dataone.integration.ContextAwareTestCaseDataone]
20170423-06:31:06: [INFO]: RestClient.doRequestNoBody, thread(1) call Info: GET http://dataone.ornith.cornell.edu/metacat/d1/mn/v1/monitor/ping [org.dataone.client.rest.RestClient]
20170423-06:31:06: [INFO]: RestClient.doRequestNoBody, thread(1) call Info: GET http://dataone.ornith.cornell.edu/metacat/d1/mn/v1/node [org.dataone.client.rest.RestClient]
20170423-06:31:06: [INFO]: RestClient.doRequestNoBody, thread(1) call Info: GET http://dataone.ornith.cornell.edu/metacat/d1/mn/v2/monitor/ping [org.dataone.client.rest.RestClient]
20170423-06:31:07: [INFO]: RestClient.doRequestNoBody, thread(1) call Info: GET http://dataone.ornith.cornell.edu/metacat/d1/mn/v2/node [org.dataone.client.rest.RestClient]
20170423-06:31:07: [INFO]: created client for certificate file: cnStageUNM1 with subject: CN=urn:node:cnStageUNM1,DC=dataone,DC=org [org.dataone.integration.ContextAwareTestCaseDataone]
20170423-06:31:07: [INFO]: created client for certificate file: cnStageUNM1 with subject: CN=urn:node:cnStageUNM1,DC=dataone,DC=org [org.dataone.integration.ContextAwareTestCaseDataone]
20170423-06:31:07: [INFO]: RestClient.doRequestNoBody, thread(1) call Info: GET https://dataone-test.researchworkspace.com/mn/v1/monitor/ping [org.dataone.client.rest.RestClient]
20170423-06:31:07: [INFO]: RestClient.doRequestNoBody, thread(1) call Info: GET https://dataone-test.researchworkspace.com/mn/v1/node [org.dataone.client.rest.RestClient]
20170423-06:31:07: [INFO]: RestClient.doRequestNoBody, thread(1) call Info: GET https://dataone-test.researchworkspace.com/mn/v2/monitor/ping [org.dataone.client.rest.RestClient]
20170423-06:31:08: [INFO]: RestClient.doRequestNoBody, thread(1) call Info: GET https://dataone-test.researchworkspace.com/mn/v2/node [org.dataone.client.rest.RestClient]
20170423-06:31:08: [INFO]: created client for certificate file: cnStageUNM1 with subject: CN=urn:node:cnStageUNM1,DC=dataone,DC=org [org.dataone.integration.ContextAwareTestCaseDataone]
20170423-06:31:08: [INFO]: created client for certificate file: cnStageUNM1 with subject: CN=urn:node:cnStageUNM1,DC=dataone,DC=org [org.dataone.integration.ContextAwareTestCaseDataone]
20170423-06:31:08: [INFO]: RestClient.doRequestNoBody, thread(1) call Info: GET https://r2r-node.test.dataone.org/mn/v1/monitor/ping [org.dataone.client.rest.RestClient]
20170423-06:31:08: [INFO]: Unable to assess v1 capabilities for MN : https://r2r-node.test.dataone.org/mn/v1 : ServiceFailure : class org.dataone.client.exception.ClientSideException: /r2r-node.test.dataone.org: Name or service not known [org.dataone.integration.ContextAwareTestCaseDataone]
20170423-06:31:08: [INFO]: RestClient.doRequestNoBody, thread(1) call Info: GET https://r2r-node.test.dataone.org/mn/v2/monitor/ping [org.dataone.client.rest.RestClient]
20170423-06:31:08: [INFO]: Unable to assess v2 capabilities for MN: https://r2r-node.test.dataone.org/mn/v2 : ServiceFailure : class org.dataone.client.exception.ClientSideException: /r2r-node.test.dataone.org [org.dataone.integration.ContextAwareTestCaseDataone]
20170423-06:31:08: [INFO]: created client for certificate file: cnStageUNM1 with subject: CN=urn:node:cnStageUNM1,DC=dataone,DC=org [org.dataone.integration.ContextAwareTestCaseDataone]
20170423-06:31:08: [INFO]: created client for certificate file: cnStageUNM1 with subject: CN=urn:node:cnStageUNM1,DC=dataone,DC=org [org.dataone.integration.ContextAwareTestCaseDataone]
20170423-06:31:08: [INFO]: RestClient.doRequestNoBody, thread(1) call Info: GET https://dataone.lib.uic.edu/metacat/d1/mn/v1/monitor/ping [org.dataone.client.rest.RestClient]
20170423-06:31:08: [INFO]: Unable to assess v1 capabilities for MN : https://dataone.lib.uic.edu/metacat/d1/mn/v1 : ServiceFailure : class org.dataone.client.exception.ClientSideException: /Received fatal alert: unknown_ca [org.dataone.integration.ContextAwareTestCaseDataone]
20170423-06:31:09: [INFO]: RestClient.doRequestNoBody, thread(1) call Info: GET https://dataone.lib.uic.edu/metacat/d1/mn/v2/monitor/ping [org.dataone.client.rest.RestClient]
20170423-06:31:09: [INFO]: Unable to assess v2 capabilities for MN: https://dataone.lib.uic.edu/metacat/d1/mn/v2 : ServiceFailure : class org.dataone.client.exception.ClientSideException: /Received fatal alert: unknown_ca [org.dataone.integration.ContextAwareTestCaseDataone]
20170423-06:31:09: [INFO]: created client for certificate file: cnStageUNM1 with subject: CN=urn:node:cnStageUNM1,DC=dataone,DC=org [org.dataone.integration.ContextAwareTestCaseDataone]
20170423-06:31:09: [INFO]: created client for certificate file: cnStageUNM1 with subject: CN=urn:node:cnStageUNM1,DC=dataone,DC=org [org.dataone.integration.ContextAwareTestCaseDataone]
20170423-06:31:09: [INFO]: RestClient.doRequestNoBody, thread(1) call Info: GET https://gmn-s.edirepository.org/mn/v1/monitor/ping [org.dataone.client.rest.RestClient]
20170423-06:31:09: [INFO]: RestClient.doRequestNoBody, thread(1) call Info: GET https://gmn-s.edirepository.org/mn/v1/node [org.dataone.client.rest.RestClient]
20170423-06:31:09: [INFO]: RestClient.doRequestNoBody, thread(1) call Info: GET https://gmn-s.edirepository.org/mn/v2/monitor/ping [org.dataone.client.rest.RestClient]
20170423-06:31:09: [INFO]: RestClient.doRequestNoBody, thread(1) call Info: GET https://gmn-s.edirepository.org/mn/v2/node [org.dataone.client.rest.RestClient]
20170423-06:31:09: [INFO]: created client for certificate file: cnStageUNM1 with subject: CN=urn:node:cnStageUNM1,DC=dataone,DC=org [org.dataone.integration.ContextAwareTestCaseDataone]
20170423-06:31:09: [INFO]: created client for certificate file: cnStageUNM1 with subject: CN=urn:node:cnStageUNM1,DC=dataone,DC=org [org.dataone.integration.ContextAwareTestCaseDataone]
20170423-06:31:10: [INFO]: RestClient.doRequestNoBody, thread(1) call Info: GET https://ncei.nceas.ucsb.edu/mn/v1/monitor/ping [org.dataone.client.rest.RestClient]
20170423-06:31:10: [INFO]: Unable to assess v1 capabilities for MN : https://ncei.nceas.ucsb.edu/mn/v1 : ServiceFailure : class org.dataone.client.exception.ClientSideException: /Received fatal alert: unknown_ca [org.dataone.integration.ContextAwareTestCaseDataone]
20170423-06:31:10: [INFO]: RestClient.doRequestNoBody, thread(1) call Info: GET https://ncei.nceas.ucsb.edu/mn/v2/monitor/ping [org.dataone.client.rest.RestClient]
20170423-06:31:10: [INFO]: Unable to assess v2 capabilities for MN: https://ncei.nceas.ucsb.edu/mn/v2 : ServiceFailure : class org.dataone.client.exception.ClientSideException: /Received fatal alert: unknown_ca [org.dataone.integration.ContextAwareTestCaseDataone]
20170423-06:31:10: [INFO]: v1-ONLY MNs available:     0 [org.dataone.integration.ContextAwareTestCaseDataone]
20170423-06:31:10: [INFO]: v2 MNs available:          8 [org.dataone.integration.ContextAwareTestCaseDataone]
20170423-06:31:10: [INFO]: v1 & v2 MNs available:     7 [org.dataone.integration.ContextAwareTestCaseDataone]
20170423-06:31:10: [INFO]: available MNs:             8 [org.dataone.integration.ContextAwareTestCaseDataone]
20170423-06:31:10: [INFO]: v2 MN     :   https://mn-stage-ucsb-2.test.dataone.org/knb/d1/mn [org.dataone.integration.ContextAwareTestCaseDataone]
20170423-06:31:10: [INFO]: v2 MN     :   https://mn-demo-11.test.dataone.org/knb/d1/mn [org.dataone.integration.ContextAwareTestCaseDataone]
20170423-06:31:10: [INFO]: v2 MN     :   https://gmn-s.lternet.edu/mn [org.dataone.integration.ContextAwareTestCaseDataone]
20170423-06:31:10: [INFO]: v2 MN     :   http://dataone.neonscience.org/metacat/d1/mn [org.dataone.integration.ContextAwareTestCaseDataone]
20170423-06:31:10: [INFO]: v2 MN     :   https://test.arcticdata.io/metacat/d1/mn [org.dataone.integration.ContextAwareTestCaseDataone]
20170423-06:31:10: [INFO]: v2 MN     :   http://dataone.ornith.cornell.edu/metacat/d1/mn [org.dataone.integration.ContextAwareTestCaseDataone]
20170423-06:31:10: [INFO]: v2 MN     :   https://dataone-test.researchworkspace.com/mn [org.dataone.integration.ContextAwareTestCaseDataone]
20170423-06:31:10: [INFO]: v2 MN     :   https://gmn-s.edirepository.org/mn [org.dataone.integration.ContextAwareTestCaseDataone]
20170423-06:31:10: [INFO]: v1 & v2 MN:   https://mn-stage-ucsb-2.test.dataone.org/knb/d1/mn [org.dataone.integration.ContextAwareTestCaseDataone]
20170423-06:31:10: [INFO]: v1 & v2 MN:   https://mn-demo-11.test.dataone.org/knb/d1/mn [org.dataone.integration.ContextAwareTestCaseDataone]
20170423-06:31:10: [INFO]: v1 & v2 MN:   https://gmn-s.lternet.edu/mn [org.dataone.integration.ContextAwareTestCaseDataone]
20170423-06:31:10: [INFO]: v1 & v2 MN:   https://test.arcticdata.io/metacat/d1/mn [org.dataone.integration.ContextAwareTestCaseDataone]
20170423-06:31:10: [INFO]: v1 & v2 MN:   http://dataone.ornith.cornell.edu/metacat/d1/mn [org.dataone.integration.ContextAwareTestCaseDataone]
20170423-06:31:10: [INFO]: v1 & v2 MN:   https://dataone-test.researchworkspace.com/mn [org.dataone.integration.ContextAwareTestCaseDataone]
20170423-06:31:10: [INFO]: v1 & v2 MN:   https://gmn-s.edirepository.org/mn [org.dataone.integration.ContextAwareTestCaseDataone]
20170423-06:31:10: [INFO]: SETUP: creating test objects... [org.dataone.integration.ContextAwareTestCaseDataone]
20170423-06:31:10: [INFO]: created client for certificate file: testRightsHolder with subject: CN=testRightsHolder,DC=dataone,DC=org [org.dataone.integration.ContextAwareTestCaseDataone]
20170423-06:31:10: [INFO]: created client for certificate file: cnStageUNM1 with subject: CN=urn:node:cnStageUNM1,DC=dataone,DC=org [org.dataone.integration.ContextAwareTestCaseDataone]
20170423-06:31:10: [INFO]: certificate directory: /etc/dataone/client/testClientCerts/ [org.dataone.integration.ContextAwareTestCaseDataone]
20170423-06:31:10: [INFO]: certificate filename: testRightsHolder [org.dataone.integration.ContextAwareTestCaseDataone]
20170423-06:31:10: [INFO]: client setup as Subject: CN=testRightsHolder,DC=dataone,DC=org [org.dataone.integration.ContextAwareTestCaseDataone]
20170423-06:31:10: [INFO]: creating a test object.  pid = testV2CreateV1UpdateSameNode_pid_2017112233110205 on https://mn-stage-ucsb-2.test.dataone.org/knb/d1/mn/v2 [org.dataone.integration.ContextAwareTestCaseDataone]
20170423-06:31:10: [INFO]: SystemMetadata for pid: testV2CreateV1UpdateSameNode_pid_2017112233110205
<?xml version="1.0" encoding="UTF-8" standalone="yes"?>
<ns3:systemMetadata xmlns:ns2="http://ns.dataone.org/service/types/v1" xmlns:ns3="http://ns.dataone.org/service/types/v2.0">
    <serialVersion>1</serialVersion>
    <identifier>testV2CreateV1UpdateSameNode_pid_2017112233110205</identifier>
    <formatId>eml://ecoinformatics.org/eml-2.0.1</formatId>
    <size>17181</size>
    <checksum algorithm="MD5">03ce09c6b4c3efc1681f3023402998a2</checksum>
    <submitter>CN=testRightsHolder,DC=dataone,DC=org</submitter>
    <rightsHolder>testRightsHolder</rightsHolder>
    <accessPolicy>
        <allow>
            <subject>public</subject>
            <permission>changePermission</permission>
        </allow>
    </accessPolicy>
    <dateUploaded>2017-04-23T06:31:10.211+00:00</dateUploaded>
    <dateSysMetadataModified>2017-04-23T06:31:10.211+00:00</dateSysMetadataModified>
    <originMemberNode>urn:node:mnStageUCSB2</originMemberNode>
    <authoritativeMemberNode>urn:node:mnStageUCSB2</authoritativeMemberNode>
    <seriesId>testV2CreateV1UpdateSameNode_sid_2017112233110205</seriesId>
</ns3:systemMetadata>
 [org.dataone.integration.ContextAwareTestCaseDataone]
20170423-06:31:36: [INFO]: RestClient.doRequestMMPBody, thread(1) call Info: POST https://mn-stage-ucsb-2.test.dataone.org/knb/d1/mn/v2/object; MMP message has: ParamPart:pid = testV2CreateV1UpdateSameNode_pid_2017112233110205; FilePart:object = /tmp/mmp.output.6948887944567745545.tmp (17181 bytes); FilePart:sysmeta = /tmp/mmp.output.5333458392809719216.tmp (1118 bytes);  [org.dataone.client.rest.RestClient]
20170423-06:31:36: [INFO]: object created.  pid = testV2CreateV1UpdateSameNode_pid_2017112233110205 [org.dataone.integration.ContextAwareTestCaseDataone]
20170423-06:31:36: [INFO]: created client for certificate file: testRightsHolder with subject: CN=testRightsHolder,DC=dataone,DC=org [org.dataone.integration.ContextAwareTestCaseDataone]
20170423-06:31:36: [INFO]: created client for certificate file: cnStageUNM1 with subject: CN=urn:node:cnStageUNM1,DC=dataone,DC=org [org.dataone.integration.ContextAwareTestCaseDataone]
20170423-06:31:36: [INFO]: certificate directory: /etc/dataone/client/testClientCerts/ [org.dataone.integration.ContextAwareTestCaseDataone]
20170423-06:31:36: [INFO]: certificate filename: cnStageUNM1 [org.dataone.integration.ContextAwareTestCaseDataone]
20170423-06:31:36: [WARN]: registering ConnectionManager... [org.dataone.client.utils.HttpConnectionMonitorService]
20170423-06:31:36: [INFO]: client setup as Subject: CN=urn:node:cnStageUNM1,DC=dataone,DC=org [org.dataone.integration.ContextAwareTestCaseDataone]
20170423-06:31:36: [INFO]: creating a test object.  pid = testV1CreateV2UpdateSameNode_1_2017112233110205 on https://mn-stage-ucsb-2.test.dataone.org/knb/d1/mn/v1 [org.dataone.integration.ContextAwareTestCaseDataone]
20170423-06:31:36: [INFO]: SystemMetadata for pid: testV1CreateV2UpdateSameNode_1_2017112233110205
<?xml version="1.0" encoding="UTF-8" standalone="yes"?>
<ns3:systemMetadata xmlns:ns2="http://ns.dataone.org/service/types/v1" xmlns:ns3="http://ns.dataone.org/service/types/v2.0">
    <serialVersion>1</serialVersion>
    <identifier>testV1CreateV2UpdateSameNode_1_2017112233110205</identifier>
    <formatId>eml://ecoinformatics.org/eml-2.0.1</formatId>
    <size>17181</size>
    <checksum algorithm="MD5">03ce09c6b4c3efc1681f3023402998a2</checksum>
    <submitter>CN=urn:node:cnStageUNM1,DC=dataone,DC=org</submitter>
    <rightsHolder>CN=testRightsHolder,DC=dataone,DC=org</rightsHolder>
    <accessPolicy>
        <allow>
            <subject>public</subject>
            <permission>changePermission</permission>
        </allow>
    </accessPolicy>
    <dateUploaded>2017-04-23T06:31:36.396+00:00</dateUploaded>
    <dateSysMetadataModified>2017-04-23T06:31:36.396+00:00</dateSysMetadataModified>
    <originMemberNode>urn:node:mnStageUCSB2</originMemberNode>
    <authoritativeMemberNode>urn:node:mnStageUCSB2</authoritativeMemberNode>
</ns3:systemMetadata>
 [org.dataone.integration.ContextAwareTestCaseDataone]
20170423-06:32:06: [INFO]: RestClient.doRequestMMPBody, thread(1) call Info: POST https://mn-stage-ucsb-2.test.dataone.org/knb/d1/mn/v1/object; MMP message has: ParamPart:pid = testV1CreateV2UpdateSameNode_1_2017112233110205; FilePart:object = /tmp/mmp.output.1810417624566034757.tmp (17181 bytes); FilePart:sysmeta = /tmp/mmp.output.678195406492486595.tmp (1013 bytes);  [org.dataone.client.rest.RestClient]
20170423-06:32:06: [INFO]: object created.  pid = testV1CreateV2UpdateSameNode_1_2017112233110205 [org.dataone.integration.ContextAwareTestCaseDataone]
20170423-06:32:06: [WARN]: registering ConnectionManager... [org.dataone.client.utils.HttpConnectionMonitorService]
20170423-06:32:06: [INFO]: **************************************************** [org.dataone.integration.ContextAwareTestCaseDataone]
20170423-06:32:06: [INFO]: ***  context label:   STAGE [org.dataone.integration.ContextAwareTestCaseDataone]
20170423-06:32:06: [INFO]: **************************************************** [org.dataone.integration.ContextAwareTestCaseDataone]
20170423-06:32:06: [INFO]: **************************************************** [org.dataone.integration.ContextAwareTestCaseDataone]
                          nodeId  key                       value
=============================================================================================================
20170423-06:32:06: [INFO]: SETUP: finding available nodes... [org.dataone.integration.ContextAwareTestCaseDataone]
20170423-06:32:06: [INFO]: created client for certificate file: cnStageUNM1 with subject: CN=urn:node:cnStageUNM1,DC=dataone,DC=org [org.dataone.integration.ContextAwareTestCaseDataone]
20170423-06:32:06: [INFO]: created client for certificate file: cnStageUNM1 with subject: CN=urn:node:cnStageUNM1,DC=dataone,DC=org [org.dataone.integration.ContextAwareTestCaseDataone]
20170423-06:32:07: [INFO]: RestClient.doRequestNoBody, thread(1) call Info: GET https://cn-stage-orc-1.test.dataone.org/cn/v2/node [org.dataone.client.rest.RestClient]
20170423-06:32:07: [INFO]: created client for certificate file: cnStageUNM1 with subject: CN=urn:node:cnStageUNM1,DC=dataone,DC=org [org.dataone.integration.ContextAwareTestCaseDataone]
20170423-06:32:07: [INFO]: created client for certificate file: cnStageUNM1 with subject: CN=urn:node:cnStageUNM1,DC=dataone,DC=org [org.dataone.integration.ContextAwareTestCaseDataone]
20170423-06:32:37: [INFO]: RestClient.doRequestNoBody, thread(1) call Info: GET https://mn-stage-unm-1.test.dataone.org/mn/v1/monitor/ping [org.dataone.client.rest.RestClient]
20170423-06:32:37: [INFO]: Unable to assess v1 capabilities for MN : https://mn-stage-unm-1.test.dataone.org/mn/v1 : ServiceFailure : class org.dataone.client.exception.ClientSideException: /Connect to mn-stage-unm-1.test.dataone.org:443 [mn-stage-unm-1.test.dataone.org/64.106.40.13] failed: connect timed out [org.dataone.integration.ContextAwareTestCaseDataone]
20170423-06:33:07: [INFO]: RestClient.doRequestNoBody, thread(1) call Info: GET https://mn-stage-unm-1.test.dataone.org/mn/v2/monitor/ping [org.dataone.client.rest.RestClient]
20170423-06:33:07: [INFO]: Unable to assess v2 capabilities for MN: https://mn-stage-unm-1.test.dataone.org/mn/v2 : ServiceFailure : class org.dataone.client.exception.ClientSideException: /Connect to mn-stage-unm-1.test.dataone.org:443 [mn-stage-unm-1.test.dataone.org/64.106.40.13] failed: connect timed out [org.dataone.integration.ContextAwareTestCaseDataone]
20170423-06:33:07: [INFO]: created client for certificate file: cnStageUNM1 with subject: CN=urn:node:cnStageUNM1,DC=dataone,DC=org [org.dataone.integration.ContextAwareTestCaseDataone]
20170423-06:33:07: [INFO]: created client for certificate file: cnStageUNM1 with subject: CN=urn:node:cnStageUNM1,DC=dataone,DC=org [org.dataone.integration.ContextAwareTestCaseDataone]
20170423-06:33:07: [INFO]: RestClient.doRequestNoBody, thread(1) call Info: GET https://mn-stage-ucsb-2.test.dataone.org/knb/d1/mn/v1/monitor/ping [org.dataone.client.rest.RestClient]
20170423-06:33:08: [INFO]: RestClient.doRequestNoBody, thread(1) call Info: GET https://mn-stage-ucsb-2.test.dataone.org/knb/d1/mn/v1/node [org.dataone.client.rest.RestClient]
20170423-06:33:08: [INFO]: RestClient.doRequestNoBody, thread(1) call Info: GET https://mn-stage-ucsb-2.test.dataone.org/knb/d1/mn/v2/monitor/ping [org.dataone.client.rest.RestClient]
20170423-06:33:08: [INFO]: RestClient.doRequestNoBody, thread(1) call Info: GET https://mn-stage-ucsb-2.test.dataone.org/knb/d1/mn/v2/node [org.dataone.client.rest.RestClient]
20170423-06:33:08: [INFO]: created client for certificate file: cnStageUNM1 with subject: CN=urn:node:cnStageUNM1,DC=dataone,DC=org [org.dataone.integration.ContextAwareTestCaseDataone]
20170423-06:33:08: [INFO]: created client for certificate file: cnStageUNM1 with subject: CN=urn:node:cnStageUNM1,DC=dataone,DC=org [org.dataone.integration.ContextAwareTestCaseDataone]
20170423-06:33:09: [INFO]: RestClient.doRequestNoBody, thread(1) call Info: GET http://test.piscoweb.org/catalog/d1/mn/v1/monitor/ping [org.dataone.client.rest.RestClient]
20170423-06:33:09: [INFO]: Unable to assess v1 capabilities for MN : http://test.piscoweb.org/catalog/d1/mn/v1 : ServiceFailure : class org.dataone.client.exception.ClientSideException: /sun.security.validator.ValidatorException: PKIX path building failed: sun.security.provider.certpath.SunCertPathBuilderException: unable to find valid certification path to requested target [org.dataone.integration.ContextAwareTestCaseDataone]
20170423-06:33:09: [INFO]: RestClient.doRequestNoBody, thread(1) call Info: GET http://test.piscoweb.org/catalog/d1/mn/v2/monitor/ping [org.dataone.client.rest.RestClient]
20170423-06:33:09: [INFO]: Unable to assess v2 capabilities for MN: http://test.piscoweb.org/catalog/d1/mn/v2 : ServiceFailure : class org.dataone.client.exception.ClientSideException: /sun.security.validator.ValidatorException: PKIX path building failed: sun.security.provider.certpath.SunCertPathBuilderException: unable to find valid certification path to requested target [org.dataone.integration.ContextAwareTestCaseDataone]
20170423-06:33:09: [INFO]: created client for certificate file: cnStageUNM1 with subject: CN=urn:node:cnStageUNM1,DC=dataone,DC=org [org.dataone.integration.ContextAwareTestCaseDataone]
20170423-06:33:09: [INFO]: created client for certificate file: cnStageUNM1 with subject: CN=urn:node:cnStageUNM1,DC=dataone,DC=org [org.dataone.integration.ContextAwareTestCaseDataone]
20170423-06:33:09: [INFO]: RestClient.doRequestNoBody, thread(1) call Info: GET http://seadva-test.d2i.indiana.edu/sead/rest/mn/v1/monitor/ping [org.dataone.client.rest.RestClient]
20170423-06:33:09: [INFO]: RestClient.doRequestNoBody, thread(1) call Info: GET http://seadva-test.d2i.indiana.edu/sead/rest/mn/v1/node [org.dataone.client.rest.RestClient]
20170423-06:33:10: [INFO]: RestClient.doRequestNoBody, thread(1) call Info: GET http://seadva-test.d2i.indiana.edu/sead/rest/mn/v2/monitor/ping [org.dataone.client.rest.RestClient]
20170423-06:33:10: [INFO]: Unable to assess v2 capabilities for MN: http://seadva-test.d2i.indiana.edu/sead/rest/mn/v2 : ServiceFailure : 404: Not Found: parser for deserializing HTML not written yet.  Providing message body:
<html><head><title>Apache Tomcat/7.0.57 - Error report</title><style><!--H1 {font-family:Tahoma,Arial,sans-serif;color:white;background-color:#525D76;font-size:22px;} H2 {font-family:Tahoma,Arial,sans-serif;color:white;background-color:#525D76;font-size:16px;} H3 {font-family:Tahoma,Arial,sans-serif;color:white;background-color:#525D76;font-size:14px;} BODY {font-family:Tahoma,Arial,sans-serif;color:black;background-color:white;} B {font-family:Tahoma,Arial,sans-serif;color:white;background-color:#525D76;} P {font-family:Tahoma,Arial,sans-serif;background:white;color:black;font-size:12px;}A {color : black;}A.name {color : black;}HR {color : #525D76;}--></style> </head><body><h1>HTTP Status 404 - Not Found</h1><HR size="1" noshade="noshade"><p><b>type</b> Status report</p><p><b>message</b> <u>Not Found</u></p><p><b>description</b> <u>The requested resource is not available.</u></p><HR size="1" noshade="noshade"><h3>Apache Tomcat/7.0.57</h3></body></html> [org.dataone.integration.ContextAwareTestCaseDataone]
20170423-06:33:10: [INFO]: created client for certificate file: cnStageUNM1 with subject: CN=urn:node:cnStageUNM1,DC=dataone,DC=org [org.dataone.integration.ContextAwareTestCaseDataone]
20170423-06:33:10: [INFO]: created client for certificate file: cnStageUNM1 with subject: CN=urn:node:cnStageUNM1,DC=dataone,DC=org [org.dataone.integration.ContextAwareTestCaseDataone]
20170423-06:33:10: [INFO]: RestClient.doRequestNoBody, thread(1) call Info: GET https://mn-demo-11.test.dataone.org/knb/d1/mn/v1/monitor/ping [org.dataone.client.rest.RestClient]
20170423-06:33:10: [INFO]: RestClient.doRequestNoBody, thread(1) call Info: GET https://mn-demo-11.test.dataone.org/knb/d1/mn/v1/node [org.dataone.client.rest.RestClient]
20170423-06:33:10: [INFO]: RestClient.doRequestNoBody, thread(1) call Info: GET https://mn-demo-11.test.dataone.org/knb/d1/mn/v2/monitor/ping [org.dataone.client.rest.RestClient]
20170423-06:33:10: [INFO]: RestClient.doRequestNoBody, thread(1) call Info: GET https://mn-demo-11.test.dataone.org/knb/d1/mn/v2/node [org.dataone.client.rest.RestClient]
20170423-06:33:10: [INFO]: created client for certificate file: cnStageUNM1 with subject: CN=urn:node:cnStageUNM1,DC=dataone,DC=org [org.dataone.integration.ContextAwareTestCaseDataone]
20170423-06:33:10: [INFO]: created client for certificate file: cnStageUNM1 with subject: CN=urn:node:cnStageUNM1,DC=dataone,DC=org [org.dataone.integration.ContextAwareTestCaseDataone]
20170423-06:33:11: [INFO]: RestClient.doRequestNoBody, thread(1) call Info: GET https://gmn-s.lternet.edu/mn/v1/monitor/ping [org.dataone.client.rest.RestClient]
20170423-06:33:11: [INFO]: RestClient.doRequestNoBody, thread(1) call Info: GET https://gmn-s.lternet.edu/mn/v1/node [org.dataone.client.rest.RestClient]
20170423-06:33:11: [INFO]: RestClient.doRequestNoBody, thread(1) call Info: GET https://gmn-s.lternet.edu/mn/v2/monitor/ping [org.dataone.client.rest.RestClient]
20170423-06:33:11: [INFO]: RestClient.doRequestNoBody, thread(1) call Info: GET https://gmn-s.lternet.edu/mn/v2/node [org.dataone.client.rest.RestClient]
20170423-06:33:11: [INFO]: created client for certificate file: cnStageUNM1 with subject: CN=urn:node:cnStageUNM1,DC=dataone,DC=org [org.dataone.integration.ContextAwareTestCaseDataone]
20170423-06:33:11: [INFO]: created client for certificate file: cnStageUNM1 with subject: CN=urn:node:cnStageUNM1,DC=dataone,DC=org [org.dataone.integration.ContextAwareTestCaseDataone]
20170423-06:33:41: [INFO]: RestClient.doRequestNoBody, thread(1) call Info: GET https://dataone-test.pop.umn.edu/mn/v1/monitor/ping [org.dataone.client.rest.RestClient]
20170423-06:33:41: [INFO]: Unable to assess v1 capabilities for MN : https://dataone-test.pop.umn.edu/mn/v1 : ServiceFailure : class org.dataone.client.exception.ClientSideException: /Connect to dataone-test.pop.umn.edu:443 [dataone-test.pop.umn.edu/134.84.88.240] failed: connect timed out [org.dataone.integration.ContextAwareTestCaseDataone]
20170423-06:34:11: [INFO]: RestClient.doRequestNoBody, thread(1) call Info: GET https://dataone-test.pop.umn.edu/mn/v2/monitor/ping [org.dataone.client.rest.RestClient]
20170423-06:34:11: [INFO]: Unable to assess v2 capabilities for MN: https://dataone-test.pop.umn.edu/mn/v2 : ServiceFailure : class org.dataone.client.exception.ClientSideException: /Connect to dataone-test.pop.umn.edu:443 [dataone-test.pop.umn.edu/134.84.88.240] failed: connect timed out [org.dataone.integration.ContextAwareTestCaseDataone]
20170423-06:34:11: [INFO]: created client for certificate file: cnStageUNM1 with subject: CN=urn:node:cnStageUNM1,DC=dataone,DC=org [org.dataone.integration.ContextAwareTestCaseDataone]
20170423-06:34:11: [INFO]: created client for certificate file: cnStageUNM1 with subject: CN=urn:node:cnStageUNM1,DC=dataone,DC=org [org.dataone.integration.ContextAwareTestCaseDataone]
20170423-06:34:12: [INFO]: RestClient.doRequestNoBody, thread(1) call Info: GET https://dataone-dev.ecoinformatics.org.au/mn/v1/monitor/ping [org.dataone.client.rest.RestClient]
20170423-06:34:13: [INFO]: RestClient.doRequestNoBody, thread(1) call Info: GET https://dataone-dev.ecoinformatics.org.au/mn/v1/node [org.dataone.client.rest.RestClient]
20170423-06:34:14: [INFO]: RestClient.doRequestNoBody, thread(1) call Info: GET https://dataone-dev.ecoinformatics.org.au/mn/v2/monitor/ping [org.dataone.client.rest.RestClient]
20170423-06:34:14: [INFO]: Unable to assess v2 capabilities for MN: https://dataone-dev.ecoinformatics.org.au/mn/v2 : ServiceFailure : 404: NOT FOUND: parser for deserializing HTML not written yet.  Providing message body:
<?xml version="1.0" encoding="UTF-8"?>
<!DOCTYPE html 
     PUBLIC "-//W3C//DTD XHTML 1.0 Strict//EN"
    "http://www.w3.org/TR/xhtml1/DTD/xhtml1-strict.dtd">
<html xmlns="http://www.w3.org/1999/xhtml" xml:lang="en" lang="en">
  <head>
    <title>404 Not Found</title>
  </head>
  <body>
    <p>
      <h3><font style="color:red">404 Not Found</font></h3>
    </p>
    <p>
      <a href="/">Home</a>
    </p>
  </body>
</html>

 [org.dataone.integration.ContextAwareTestCaseDataone]
20170423-06:34:14: [INFO]: created client for certificate file: cnStageUNM1 with subject: CN=urn:node:cnStageUNM1,DC=dataone,DC=org [org.dataone.integration.ContextAwareTestCaseDataone]
20170423-06:34:14: [INFO]: created client for certificate file: cnStageUNM1 with subject: CN=urn:node:cnStageUNM1,DC=dataone,DC=org [org.dataone.integration.ContextAwareTestCaseDataone]
20170423-06:34:14: [INFO]: RestClient.doRequestNoBody, thread(1) call Info: GET https://dataonetest.tamucc.edu/mn/v1/monitor/ping [org.dataone.client.rest.RestClient]
20170423-06:34:14: [INFO]: Unable to assess v1 capabilities for MN : https://dataonetest.tamucc.edu/mn/v1 : ServiceFailure : class org.dataone.client.exception.ClientSideException: /dataonetest.tamucc.edu: Name or service not known [org.dataone.integration.ContextAwareTestCaseDataone]
20170423-06:34:14: [INFO]: RestClient.doRequestNoBody, thread(1) call Info: GET https://dataonetest.tamucc.edu/mn/v2/monitor/ping [org.dataone.client.rest.RestClient]
20170423-06:34:14: [INFO]: Unable to assess v2 capabilities for MN: https://dataonetest.tamucc.edu/mn/v2 : ServiceFailure : class org.dataone.client.exception.ClientSideException: /dataonetest.tamucc.edu [org.dataone.integration.ContextAwareTestCaseDataone]
20170423-06:34:14: [INFO]: created client for certificate file: cnStageUNM1 with subject: CN=urn:node:cnStageUNM1,DC=dataone,DC=org [org.dataone.integration.ContextAwareTestCaseDataone]
20170423-06:34:14: [INFO]: created client for certificate file: cnStageUNM1 with subject: CN=urn:node:cnStageUNM1,DC=dataone,DC=org [org.dataone.integration.ContextAwareTestCaseDataone]
20170423-06:34:14: [INFO]: RestClient.doRequestNoBody, thread(1) call Info: GET http://dataone.neonscience.org/metacat/d1/mn/v1/monitor/ping [org.dataone.client.rest.RestClient]
20170423-06:34:14: [INFO]: RestClient.doRequestNoBody, thread(1) call Info: GET http://dataone.neonscience.org/metacat/d1/mn/v1/node [org.dataone.client.rest.RestClient]
20170423-06:34:14: [INFO]: RestClient.doRequestNoBody, thread(1) call Info: GET http://dataone.neonscience.org/metacat/d1/mn/v2/monitor/ping [org.dataone.client.rest.RestClient]
20170423-06:34:15: [INFO]: RestClient.doRequestNoBody, thread(1) call Info: GET http://dataone.neonscience.org/metacat/d1/mn/v2/node [org.dataone.client.rest.RestClient]
20170423-06:34:15: [INFO]: created client for certificate file: cnStageUNM1 with subject: CN=urn:node:cnStageUNM1,DC=dataone,DC=org [org.dataone.integration.ContextAwareTestCaseDataone]
20170423-06:34:15: [INFO]: created client for certificate file: cnStageUNM1 with subject: CN=urn:node:cnStageUNM1,DC=dataone,DC=org [org.dataone.integration.ContextAwareTestCaseDataone]
20170423-06:34:15: [INFO]: RestClient.doRequestNoBody, thread(1) call Info: GET https://test.arcticdata.io/metacat/d1/mn/v1/monitor/ping [org.dataone.client.rest.RestClient]
20170423-06:34:15: [INFO]: RestClient.doRequestNoBody, thread(1) call Info: GET https://test.arcticdata.io/metacat/d1/mn/v1/node [org.dataone.client.rest.RestClient]
20170423-06:34:16: [INFO]: RestClient.doRequestNoBody, thread(1) call Info: GET https://test.arcticdata.io/metacat/d1/mn/v2/monitor/ping [org.dataone.client.rest.RestClient]
20170423-06:34:16: [INFO]: RestClient.doRequestNoBody, thread(1) call Info: GET https://test.arcticdata.io/metacat/d1/mn/v2/node [org.dataone.client.rest.RestClient]
20170423-06:34:16: [INFO]: created client for certificate file: cnStageUNM1 with subject: CN=urn:node:cnStageUNM1,DC=dataone,DC=org [org.dataone.integration.ContextAwareTestCaseDataone]
20170423-06:34:16: [INFO]: created client for certificate file: cnStageUNM1 with subject: CN=urn:node:cnStageUNM1,DC=dataone,DC=org [org.dataone.integration.ContextAwareTestCaseDataone]
20170423-06:34:16: [INFO]: RestClient.doRequestNoBody, thread(1) call Info: GET http://dataone.ornith.cornell.edu/metacat/d1/mn/v1/monitor/ping [org.dataone.client.rest.RestClient]
20170423-06:34:16: [INFO]: RestClient.doRequestNoBody, thread(1) call Info: GET http://dataone.ornith.cornell.edu/metacat/d1/mn/v1/node [org.dataone.client.rest.RestClient]
20170423-06:34:17: [INFO]: RestClient.doRequestNoBody, thread(1) call Info: GET http://dataone.ornith.cornell.edu/metacat/d1/mn/v2/monitor/ping [org.dataone.client.rest.RestClient]
20170423-06:34:17: [INFO]: RestClient.doRequestNoBody, thread(1) call Info: GET http://dataone.ornith.cornell.edu/metacat/d1/mn/v2/node [org.dataone.client.rest.RestClient]
20170423-06:34:17: [INFO]: created client for certificate file: cnStageUNM1 with subject: CN=urn:node:cnStageUNM1,DC=dataone,DC=org [org.dataone.integration.ContextAwareTestCaseDataone]
20170423-06:34:17: [INFO]: created client for certificate file: cnStageUNM1 with subject: CN=urn:node:cnStageUNM1,DC=dataone,DC=org [org.dataone.integration.ContextAwareTestCaseDataone]
20170423-06:34:17: [INFO]: RestClient.doRequestNoBody, thread(1) call Info: GET https://dataone-test.researchworkspace.com/mn/v1/monitor/ping [org.dataone.client.rest.RestClient]
20170423-06:34:17: [INFO]: RestClient.doRequestNoBody, thread(1) call Info: GET https://dataone-test.researchworkspace.com/mn/v1/node [org.dataone.client.rest.RestClient]
20170423-06:34:18: [INFO]: RestClient.doRequestNoBody, thread(1) call Info: GET https://dataone-test.researchworkspace.com/mn/v2/monitor/ping [org.dataone.client.rest.RestClient]
20170423-06:34:18: [INFO]: RestClient.doRequestNoBody, thread(1) call Info: GET https://dataone-test.researchworkspace.com/mn/v2/node [org.dataone.client.rest.RestClient]
20170423-06:34:18: [INFO]: created client for certificate file: cnStageUNM1 with subject: CN=urn:node:cnStageUNM1,DC=dataone,DC=org [org.dataone.integration.ContextAwareTestCaseDataone]
20170423-06:34:18: [INFO]: created client for certificate file: cnStageUNM1 with subject: CN=urn:node:cnStageUNM1,DC=dataone,DC=org [org.dataone.integration.ContextAwareTestCaseDataone]
20170423-06:34:18: [INFO]: RestClient.doRequestNoBody, thread(1) call Info: GET https://r2r-node.test.dataone.org/mn/v1/monitor/ping [org.dataone.client.rest.RestClient]
20170423-06:34:18: [INFO]: Unable to assess v1 capabilities for MN : https://r2r-node.test.dataone.org/mn/v1 : ServiceFailure : class org.dataone.client.exception.ClientSideException: /r2r-node.test.dataone.org: Name or service not known [org.dataone.integration.ContextAwareTestCaseDataone]
20170423-06:34:18: [INFO]: RestClient.doRequestNoBody, thread(1) call Info: GET https://r2r-node.test.dataone.org/mn/v2/monitor/ping [org.dataone.client.rest.RestClient]
20170423-06:34:18: [INFO]: Unable to assess v2 capabilities for MN: https://r2r-node.test.dataone.org/mn/v2 : ServiceFailure : class org.dataone.client.exception.ClientSideException: /r2r-node.test.dataone.org [org.dataone.integration.ContextAwareTestCaseDataone]
20170423-06:34:18: [INFO]: created client for certificate file: cnStageUNM1 with subject: CN=urn:node:cnStageUNM1,DC=dataone,DC=org [org.dataone.integration.ContextAwareTestCaseDataone]
20170423-06:34:18: [INFO]: created client for certificate file: cnStageUNM1 with subject: CN=urn:node:cnStageUNM1,DC=dataone,DC=org [org.dataone.integration.ContextAwareTestCaseDataone]
20170423-06:34:19: [INFO]: RestClient.doRequestNoBody, thread(1) call Info: GET https://dataone.lib.uic.edu/metacat/d1/mn/v1/monitor/ping [org.dataone.client.rest.RestClient]
20170423-06:34:19: [INFO]: Unable to assess v1 capabilities for MN : https://dataone.lib.uic.edu/metacat/d1/mn/v1 : ServiceFailure : class org.dataone.client.exception.ClientSideException: /Received fatal alert: unknown_ca [org.dataone.integration.ContextAwareTestCaseDataone]
20170423-06:34:19: [INFO]: RestClient.doRequestNoBody, thread(1) call Info: GET https://dataone.lib.uic.edu/metacat/d1/mn/v2/monitor/ping [org.dataone.client.rest.RestClient]
20170423-06:34:19: [INFO]: Unable to assess v2 capabilities for MN: https://dataone.lib.uic.edu/metacat/d1/mn/v2 : ServiceFailure : class org.dataone.client.exception.ClientSideException: /Received fatal alert: unknown_ca [org.dataone.integration.ContextAwareTestCaseDataone]
20170423-06:34:19: [INFO]: created client for certificate file: cnStageUNM1 with subject: CN=urn:node:cnStageUNM1,DC=dataone,DC=org [org.dataone.integration.ContextAwareTestCaseDataone]
20170423-06:34:19: [INFO]: created client for certificate file: cnStageUNM1 with subject: CN=urn:node:cnStageUNM1,DC=dataone,DC=org [org.dataone.integration.ContextAwareTestCaseDataone]
20170423-06:34:19: [INFO]: RestClient.doRequestNoBody, thread(1) call Info: GET https://gmn-s.edirepository.org/mn/v1/monitor/ping [org.dataone.client.rest.RestClient]
20170423-06:34:19: [INFO]: RestClient.doRequestNoBody, thread(1) call Info: GET https://gmn-s.edirepository.org/mn/v1/node [org.dataone.client.rest.RestClient]
20170423-06:34:19: [INFO]: RestClient.doRequestNoBody, thread(1) call Info: GET https://gmn-s.edirepository.org/mn/v2/monitor/ping [org.dataone.client.rest.RestClient]
20170423-06:34:19: [INFO]: RestClient.doRequestNoBody, thread(1) call Info: GET https://gmn-s.edirepository.org/mn/v2/node [org.dataone.client.rest.RestClient]
20170423-06:34:19: [INFO]: created client for certificate file: cnStageUNM1 with subject: CN=urn:node:cnStageUNM1,DC=dataone,DC=org [org.dataone.integration.ContextAwareTestCaseDataone]
20170423-06:34:19: [INFO]: created client for certificate file: cnStageUNM1 with subject: CN=urn:node:cnStageUNM1,DC=dataone,DC=org [org.dataone.integration.ContextAwareTestCaseDataone]
20170423-06:34:19: [INFO]: RestClient.doRequestNoBody, thread(1) call Info: GET https://ncei.nceas.ucsb.edu/mn/v1/monitor/ping [org.dataone.client.rest.RestClient]
20170423-06:34:19: [INFO]: Unable to assess v1 capabilities for MN : https://ncei.nceas.ucsb.edu/mn/v1 : ServiceFailure : class org.dataone.client.exception.ClientSideException: /Received fatal alert: unknown_ca [org.dataone.integration.ContextAwareTestCaseDataone]
20170423-06:34:20: [INFO]: RestClient.doRequestNoBody, thread(1) call Info: GET https://ncei.nceas.ucsb.edu/mn/v2/monitor/ping [org.dataone.client.rest.RestClient]
20170423-06:34:20: [INFO]: Unable to assess v2 capabilities for MN: https://ncei.nceas.ucsb.edu/mn/v2 : ServiceFailure : class org.dataone.client.exception.ClientSideException: /Received fatal alert: unknown_ca [org.dataone.integration.ContextAwareTestCaseDataone]
20170423-06:34:20: [INFO]: v1-ONLY MNs available:     0 [org.dataone.integration.ContextAwareTestCaseDataone]
20170423-06:34:20: [INFO]: v2 MNs available:          8 [org.dataone.integration.ContextAwareTestCaseDataone]
20170423-06:34:20: [INFO]: v1 & v2 MNs available:     7 [org.dataone.integration.ContextAwareTestCaseDataone]
20170423-06:34:20: [INFO]: available MNs:             8 [org.dataone.integration.ContextAwareTestCaseDataone]
20170423-06:34:20: [INFO]: v2 MN     :   https://mn-stage-ucsb-2.test.dataone.org/knb/d1/mn [org.dataone.integration.ContextAwareTestCaseDataone]
20170423-06:34:20: [INFO]: v2 MN     :   https://mn-demo-11.test.dataone.org/knb/d1/mn [org.dataone.integration.ContextAwareTestCaseDataone]
20170423-06:34:20: [INFO]: v2 MN     :   https://gmn-s.lternet.edu/mn [org.dataone.integration.ContextAwareTestCaseDataone]
20170423-06:34:20: [INFO]: v2 MN     :   http://dataone.neonscience.org/metacat/d1/mn [org.dataone.integration.ContextAwareTestCaseDataone]
20170423-06:34:20: [INFO]: v2 MN     :   https://test.arcticdata.io/metacat/d1/mn [org.dataone.integration.ContextAwareTestCaseDataone]
20170423-06:34:20: [INFO]: v2 MN     :   http://dataone.ornith.cornell.edu/metacat/d1/mn [org.dataone.integration.ContextAwareTestCaseDataone]
20170423-06:34:20: [INFO]: v2 MN     :   https://dataone-test.researchworkspace.com/mn [org.dataone.integration.ContextAwareTestCaseDataone]
20170423-06:34:20: [INFO]: v2 MN     :   https://gmn-s.edirepository.org/mn [org.dataone.integration.ContextAwareTestCaseDataone]
20170423-06:34:20: [INFO]: v1 & v2 MN:   https://mn-stage-ucsb-2.test.dataone.org/knb/d1/mn [org.dataone.integration.ContextAwareTestCaseDataone]
20170423-06:34:20: [INFO]: v1 & v2 MN:   https://mn-demo-11.test.dataone.org/knb/d1/mn [org.dataone.integration.ContextAwareTestCaseDataone]
20170423-06:34:20: [INFO]: v1 & v2 MN:   https://gmn-s.lternet.edu/mn [org.dataone.integration.ContextAwareTestCaseDataone]
20170423-06:34:20: [INFO]: v1 & v2 MN:   https://test.arcticdata.io/metacat/d1/mn [org.dataone.integration.ContextAwareTestCaseDataone]
20170423-06:34:20: [INFO]: v1 & v2 MN:   http://dataone.ornith.cornell.edu/metacat/d1/mn [org.dataone.integration.ContextAwareTestCaseDataone]
20170423-06:34:20: [INFO]: v1 & v2 MN:   https://dataone-test.researchworkspace.com/mn [org.dataone.integration.ContextAwareTestCaseDataone]
20170423-06:34:20: [INFO]: v1 & v2 MN:   https://gmn-s.edirepository.org/mn [org.dataone.integration.ContextAwareTestCaseDataone]
20170423-06:34:20: [INFO]: SETUP: creating test objects... [org.dataone.integration.ContextAwareTestCaseDataone]
20170423-06:34:20: [INFO]: created client for certificate file: testRightsHolder with subject: CN=testRightsHolder,DC=dataone,DC=org [org.dataone.integration.ContextAwareTestCaseDataone]
20170423-06:34:20: [INFO]: created client for certificate file: cnStageUNM1 with subject: CN=urn:node:cnStageUNM1,DC=dataone,DC=org [org.dataone.integration.ContextAwareTestCaseDataone]
20170423-06:34:20: [INFO]: certificate directory: /etc/dataone/client/testClientCerts/ [org.dataone.integration.ContextAwareTestCaseDataone]
20170423-06:34:20: [INFO]: certificate filename: testRightsHolder [org.dataone.integration.ContextAwareTestCaseDataone]
20170423-06:34:20: [INFO]: client setup as Subject: CN=testRightsHolder,DC=dataone,DC=org [org.dataone.integration.ContextAwareTestCaseDataone]
20170423-06:34:20: [INFO]: creating a test object.  pid = testV2CreateV1UpdateSameNode_pid_2017112233420116 on https://mn-stage-ucsb-2.test.dataone.org/knb/d1/mn/v2 [org.dataone.integration.ContextAwareTestCaseDataone]
20170423-06:34:20: [INFO]: SystemMetadata for pid: testV2CreateV1UpdateSameNode_pid_2017112233420116
<?xml version="1.0" encoding="UTF-8" standalone="yes"?>
<ns3:systemMetadata xmlns:ns2="http://ns.dataone.org/service/types/v1" xmlns:ns3="http://ns.dataone.org/service/types/v2.0">
    <serialVersion>1</serialVersion>
    <identifier>testV2CreateV1UpdateSameNode_pid_2017112233420116</identifier>
    <formatId>eml://ecoinformatics.org/eml-2.0.1</formatId>
    <size>17181</size>
    <checksum algorithm="MD5">03ce09c6b4c3efc1681f3023402998a2</checksum>
    <submitter>CN=testRightsHolder,DC=dataone,DC=org</submitter>
    <rightsHolder>testRightsHolder</rightsHolder>
    <accessPolicy>
        <allow>
            <subject>public</subject>
            <permission>changePermission</permission>
        </allow>
    </accessPolicy>
    <dateUploaded>2017-04-23T06:34:20.123+00:00</dateUploaded>
    <dateSysMetadataModified>2017-04-23T06:34:20.123+00:00</dateSysMetadataModified>
    <originMemberNode>urn:node:mnStageUCSB2</originMemberNode>
    <authoritativeMemberNode>urn:node:mnStageUCSB2</authoritativeMemberNode>
    <seriesId>testV2CreateV1UpdateSameNode_sid_2017112233420116</seriesId>
</ns3:systemMetadata>
 [org.dataone.integration.ContextAwareTestCaseDataone]
20170423-06:34:50: [INFO]: RestClient.doRequestMMPBody, thread(1) call Info: POST https://mn-stage-ucsb-2.test.dataone.org/knb/d1/mn/v2/object; MMP message has: ParamPart:pid = testV2CreateV1UpdateSameNode_pid_2017112233420116; FilePart:object = /tmp/mmp.output.4670901141801029102.tmp (17181 bytes); FilePart:sysmeta = /tmp/mmp.output.3015405370677501991.tmp (1118 bytes);  [org.dataone.client.rest.RestClient]
20170423-06:34:50: [INFO]: object created.  pid = testV2CreateV1UpdateSameNode_pid_2017112233420116 [org.dataone.integration.ContextAwareTestCaseDataone]
20170423-06:34:50: [INFO]: created client for certificate file: testRightsHolder with subject: CN=testRightsHolder,DC=dataone,DC=org [org.dataone.integration.ContextAwareTestCaseDataone]
20170423-06:34:50: [INFO]: created client for certificate file: cnStageUNM1 with subject: CN=urn:node:cnStageUNM1,DC=dataone,DC=org [org.dataone.integration.ContextAwareTestCaseDataone]
20170423-06:34:50: [INFO]: certificate directory: /etc/dataone/client/testClientCerts/ [org.dataone.integration.ContextAwareTestCaseDataone]
20170423-06:34:50: [INFO]: certificate filename: cnStageUNM1 [org.dataone.integration.ContextAwareTestCaseDataone]
20170423-06:34:50: [WARN]: registering ConnectionManager... [org.dataone.client.utils.HttpConnectionMonitorService]
20170423-06:34:50: [INFO]: client setup as Subject: CN=urn:node:cnStageUNM1,DC=dataone,DC=org [org.dataone.integration.ContextAwareTestCaseDataone]
20170423-06:34:50: [INFO]: creating a test object.  pid = testV1CreateV2UpdateSameNode_1_2017112233420116 on https://mn-stage-ucsb-2.test.dataone.org/knb/d1/mn/v1 [org.dataone.integration.ContextAwareTestCaseDataone]
20170423-06:34:50: [INFO]: SystemMetadata for pid: testV1CreateV2UpdateSameNode_1_2017112233420116
<?xml version="1.0" encoding="UTF-8" standalone="yes"?>
<ns3:systemMetadata xmlns:ns2="http://ns.dataone.org/service/types/v1" xmlns:ns3="http://ns.dataone.org/service/types/v2.0">
    <serialVersion>1</serialVersion>
    <identifier>testV1CreateV2UpdateSameNode_1_2017112233420116</identifier>
    <formatId>eml://ecoinformatics.org/eml-2.0.1</formatId>
    <size>17181</size>
    <checksum algorithm="MD5">03ce09c6b4c3efc1681f3023402998a2</checksum>
    <submitter>CN=urn:node:cnStageUNM1,DC=dataone,DC=org</submitter>
    <rightsHolder>CN=testRightsHolder,DC=dataone,DC=org</rightsHolder>
    <accessPolicy>
        <allow>
            <subject>public</subject>
            <permission>changePermission</permission>
        </allow>
    </accessPolicy>
    <dateUploaded>2017-04-23T06:34:50.279+00:00</dateUploaded>
    <dateSysMetadataModified>2017-04-23T06:34:50.279+00:00</dateSysMetadataModified>
    <originMemberNode>urn:node:mnStageUCSB2</originMemberNode>
    <authoritativeMemberNode>urn:node:mnStageUCSB2</authoritativeMemberNode>
</ns3:systemMetadata>
 [org.dataone.integration.ContextAwareTestCaseDataone]
20170423-06:35:20: [INFO]: RestClient.doRequestMMPBody, thread(1) call Info: POST https://mn-stage-ucsb-2.test.dataone.org/knb/d1/mn/v1/object; MMP message has: ParamPart:pid = testV1CreateV2UpdateSameNode_1_2017112233420116; FilePart:object = /tmp/mmp.output.7316860672590588920.tmp (17181 bytes); FilePart:sysmeta = /tmp/mmp.output.2673137273816855190.tmp (1013 bytes);  [org.dataone.client.rest.RestClient]
20170423-06:35:20: [WARN]: registering ConnectionManager... [org.dataone.client.utils.HttpConnectionMonitorService]
org.dataone.client.exception.ClientSideException: Unable to create test object!/class org.dataone.client.exception.ClientSideException: /Read timed out
	at org.dataone.integration.ContextAwareTestCaseDataone.createTestObject(ContextAwareTestCaseDataone.java:1609)
	at org.dataone.integration.ContextAwareTestCaseDataone.createTestObject(ContextAwareTestCaseDataone.java:1430)
	at org.dataone.integration.ContextAwareTestCaseDataone.createTestObject(ContextAwareTestCaseDataone.java:1383)
	at org.dataone.integration.ContextAwareTestCaseDataone.createTestObject(ContextAwareTestCaseDataone.java:1342)
	at org.dataone.integration.ContextAwareTestCaseDataone.createTestObject(ContextAwareTestCaseDataone.java:1359)
	at org.dataone.integration.it.testImplementations.V1V2InteropFunctionalTestImplementations.setupV1CreateV2UpdateSameNode(V1V2InteropFunctionalTestImplementations.java:548)
	at org.dataone.integration.it.testImplementations.V1V2InteropFunctionalTestImplementations.setupTestObjects(V1V2InteropFunctionalTestImplementations.java:203)
	at org.dataone.integration.it.testImplementations.V1V2InteropFunctionalTestImplementations.setup(V1V2InteropFunctionalTestImplementations.java:92)
	at org.dataone.integration.it.functional.v2.V1V2InteropFunctionalIT.setup(V1V2InteropFunctionalIT.java:21)
	at sun.reflect.GeneratedMethodAccessor50.invoke(Unknown Source)
	at sun.reflect.DelegatingMethodAccessorImpl.invoke(DelegatingMethodAccessorImpl.java:43)
	at java.lang.reflect.Method.invoke(Method.java:606)
	at org.junit.runners.model.FrameworkMethod$1.runReflectiveCall(FrameworkMethod.java:44)
	at org.junit.internal.runners.model.ReflectiveCallable.run(ReflectiveCallable.java:15)
	at org.junit.runners.model.FrameworkMethod.invokeExplosively(FrameworkMethod.java:41)
	at org.junit.internal.runners.statements.RunBefores.evaluate(RunBefores.java:27)
	at org.junit.runners.BlockJUnit4ClassRunner.runChild(BlockJUnit4ClassRunner.java:76)
	at org.junit.runners.BlockJUnit4ClassRunner.runChild(BlockJUnit4ClassRunner.java:50)
	at org.junit.runners.ParentRunner$3.run(ParentRunner.java:193)
	at org.junit.runners.ParentRunner$1.schedule(ParentRunner.java:52)
	at org.junit.runners.ParentRunner.runChildren(ParentRunner.java:191)
	at org.junit.runners.ParentRunner.access$000(ParentRunner.java:42)
	at org.junit.runners.ParentRunner$2.evaluate(ParentRunner.java:184)
	at org.junit.runners.ParentRunner.run(ParentRunner.java:236)
	at org.apache.maven.surefire.junit4.JUnit4TestSet.execute(JUnit4TestSet.java:53)
	at org.apache.maven.surefire.junit4.JUnit4Provider.executeTestSet(JUnit4Provider.java:119)
	at org.apache.maven.surefire.junit4.JUnit4Provider.invoke(JUnit4Provider.java:101)
	at sun.reflect.NativeMethodAccessorImpl.invoke0(Native Method)
	at sun.reflect.NativeMethodAccessorImpl.invoke(NativeMethodAccessorImpl.java:57)
	at sun.reflect.DelegatingMethodAccessorImpl.invoke(DelegatingMethodAccessorImpl.java:43)
	at java.lang.reflect.Method.invoke(Method.java:606)
	at org.apache.maven.surefire.booter.ProviderFactory$ClassLoaderProxy.invoke(ProviderFactory.java:103)
	at com.sun.proxy.$Proxy0.invoke(Unknown Source)
	at org.apache.maven.surefire.booter.SurefireStarter.invokeProvider(SurefireStarter.java:150)
	at org.apache.maven.surefire.booter.SurefireStarter.runSuitesInProcess(SurefireStarter.java:91)
	at org.apache.maven.surefire.booter.ForkedBooter.main(ForkedBooter.java:69)
Caused by: org.dataone.service.exceptions.ServiceFailure: class org.dataone.client.exception.ClientSideException: /Read timed out
	at org.dataone.client.rest.HttpMultipartRestClient.doPostRequest(HttpMultipartRestClient.java:470)
	at org.dataone.client.v1.impl.MultipartMNode.create(MultipartMNode.java:566)
	at org.dataone.integration.adapters.CommonCallAdapter.create(CommonCallAdapter.java:500)
	at org.dataone.integration.ContextAwareTestCaseDataone.createTestObject(ContextAwareTestCaseDataone.java:1600)
	... 35 more
Caused by: org.dataone.client.exception.ClientSideException: /Read timed out
	... 39 more
Caused by: java.net.SocketTimeoutException: Read timed out
	at java.net.SocketInputStream.socketRead0(Native Method)
	at java.net.SocketInputStream.read(SocketInputStream.java:153)
	at java.net.SocketInputStream.read(SocketInputStream.java:122)
	at sun.security.ssl.InputRecord.readFully(InputRecord.java:442)
	at sun.security.ssl.InputRecord.read(InputRecord.java:480)
	at sun.security.ssl.SSLSocketImpl.readRecord(SSLSocketImpl.java:944)
	at sun.security.ssl.SSLSocketImpl.readDataRecord(SSLSocketImpl.java:901)
	at sun.security.ssl.AppInputStream.read(AppInputStream.java:102)
	at org.apache.http.impl.io.SessionInputBufferImpl.streamRead(SessionInputBufferImpl.java:136)
	at org.apache.http.impl.io.SessionInputBufferImpl.fillBuffer(SessionInputBufferImpl.java:152)
	at org.apache.http.impl.io.SessionInputBufferImpl.readLine(SessionInputBufferImpl.java:270)
	at org.apache.http.impl.conn.DefaultHttpResponseParser.parseHead(DefaultHttpResponseParser.java:140)
	at org.apache.http.impl.conn.DefaultHttpResponseParser.parseHead(DefaultHttpResponseParser.java:57)
	at org.apache.http.impl.io.AbstractMessageParser.parse(AbstractMessageParser.java:260)
	at org.apache.http.impl.DefaultBHttpClientConnection.receiveResponseHeader(DefaultBHttpClientConnection.java:161)
	at org.apache.http.impl.conn.CPoolProxy.receiveResponseHeader(CPoolProxy.java:153)
	at org.apache.http.protocol.HttpRequestExecutor.doReceiveResponse(HttpRequestExecutor.java:271)
	at org.apache.http.protocol.HttpRequestExecutor.execute(HttpRequestExecutor.java:123)
	at org.apache.http.impl.execchain.MainClientExec.execute(MainClientExec.java:254)
	at org.apache.http.impl.client.cache.CachingExec.callBackend(CachingExec.java:578)
	at org.apache.http.impl.client.cache.CachingExec.execute(CachingExec.java:259)
	at org.apache.http.impl.execchain.ProtocolExec.execute(ProtocolExec.java:195)
	at org.apache.http.impl.execchain.RetryExec.execute(RetryExec.java:86)
	at org.apache.http.impl.execchain.RedirectExec.execute(RedirectExec.java:108)
	at org.apache.http.impl.client.InternalHttpClient.doExecute(InternalHttpClient.java:184)
	at org.apache.http.impl.client.CloseableHttpClient.execute(CloseableHttpClient.java:82)
	at org.apache.http.impl.client.CloseableHttpClient.execute(CloseableHttpClient.java:106)
	at org.apache.http.impl.client.CloseableHttpClient.execute(CloseableHttpClient.java:57)
	at org.dataone.client.rest.RestClient.doRequest(RestClient.java:330)
	at org.dataone.client.rest.RestClient.doRequestMMBody(RestClient.java:306)
	at org.dataone.client.rest.RestClient.doPostRequest(RestClient.java:226)
	at org.dataone.client.rest.HttpMultipartRestClient.doPostRequest(HttpMultipartRestClient.java:463)
	... 38 more
20170423-06:35:20: [INFO]: **************************************************** [org.dataone.integration.ContextAwareTestCaseDataone]
20170423-06:35:20: [INFO]: ***  context label:   STAGE [org.dataone.integration.ContextAwareTestCaseDataone]
20170423-06:35:20: [INFO]: **************************************************** [org.dataone.integration.ContextAwareTestCaseDataone]
20170423-06:35:20: [INFO]: **************************************************** [org.dataone.integration.ContextAwareTestCaseDataone]
                          nodeId  key                       value
=============================================================================================================
20170423-06:35:20: [INFO]: SETUP: finding available nodes... [org.dataone.integration.ContextAwareTestCaseDataone]
20170423-06:35:20: [INFO]: created client for certificate file: cnStageUNM1 with subject: CN=urn:node:cnStageUNM1,DC=dataone,DC=org [org.dataone.integration.ContextAwareTestCaseDataone]
20170423-06:35:20: [INFO]: created client for certificate file: cnStageUNM1 with subject: CN=urn:node:cnStageUNM1,DC=dataone,DC=org [org.dataone.integration.ContextAwareTestCaseDataone]
20170423-06:35:21: [INFO]: RestClient.doRequestNoBody, thread(1) call Info: GET https://cn-stage-orc-1.test.dataone.org/cn/v2/node [org.dataone.client.rest.RestClient]
20170423-06:35:21: [INFO]: created client for certificate file: cnStageUNM1 with subject: CN=urn:node:cnStageUNM1,DC=dataone,DC=org [org.dataone.integration.ContextAwareTestCaseDataone]
20170423-06:35:21: [INFO]: created client for certificate file: cnStageUNM1 with subject: CN=urn:node:cnStageUNM1,DC=dataone,DC=org [org.dataone.integration.ContextAwareTestCaseDataone]
20170423-06:35:51: [INFO]: RestClient.doRequestNoBody, thread(1) call Info: GET https://mn-stage-unm-1.test.dataone.org/mn/v1/monitor/ping [org.dataone.client.rest.RestClient]
20170423-06:35:51: [INFO]: Unable to assess v1 capabilities for MN : https://mn-stage-unm-1.test.dataone.org/mn/v1 : ServiceFailure : class org.dataone.client.exception.ClientSideException: /Connect to mn-stage-unm-1.test.dataone.org:443 [mn-stage-unm-1.test.dataone.org/64.106.40.13] failed: connect timed out [org.dataone.integration.ContextAwareTestCaseDataone]
20170423-06:36:21: [INFO]: RestClient.doRequestNoBody, thread(1) call Info: GET https://mn-stage-unm-1.test.dataone.org/mn/v2/monitor/ping [org.dataone.client.rest.RestClient]
20170423-06:36:21: [INFO]: Unable to assess v2 capabilities for MN: https://mn-stage-unm-1.test.dataone.org/mn/v2 : ServiceFailure : class org.dataone.client.exception.ClientSideException: /Connect to mn-stage-unm-1.test.dataone.org:443 [mn-stage-unm-1.test.dataone.org/64.106.40.13] failed: connect timed out [org.dataone.integration.ContextAwareTestCaseDataone]
20170423-06:36:21: [INFO]: created client for certificate file: cnStageUNM1 with subject: CN=urn:node:cnStageUNM1,DC=dataone,DC=org [org.dataone.integration.ContextAwareTestCaseDataone]
20170423-06:36:21: [INFO]: created client for certificate file: cnStageUNM1 with subject: CN=urn:node:cnStageUNM1,DC=dataone,DC=org [org.dataone.integration.ContextAwareTestCaseDataone]
20170423-06:36:22: [INFO]: RestClient.doRequestNoBody, thread(1) call Info: GET https://mn-stage-ucsb-2.test.dataone.org/knb/d1/mn/v1/monitor/ping [org.dataone.client.rest.RestClient]
20170423-06:36:22: [INFO]: RestClient.doRequestNoBody, thread(1) call Info: GET https://mn-stage-ucsb-2.test.dataone.org/knb/d1/mn/v1/node [org.dataone.client.rest.RestClient]
20170423-06:36:22: [INFO]: RestClient.doRequestNoBody, thread(1) call Info: GET https://mn-stage-ucsb-2.test.dataone.org/knb/d1/mn/v2/monitor/ping [org.dataone.client.rest.RestClient]
20170423-06:36:22: [INFO]: RestClient.doRequestNoBody, thread(1) call Info: GET https://mn-stage-ucsb-2.test.dataone.org/knb/d1/mn/v2/node [org.dataone.client.rest.RestClient]
20170423-06:36:22: [INFO]: created client for certificate file: cnStageUNM1 with subject: CN=urn:node:cnStageUNM1,DC=dataone,DC=org [org.dataone.integration.ContextAwareTestCaseDataone]
20170423-06:36:22: [INFO]: created client for certificate file: cnStageUNM1 with subject: CN=urn:node:cnStageUNM1,DC=dataone,DC=org [org.dataone.integration.ContextAwareTestCaseDataone]
20170423-06:36:23: [INFO]: RestClient.doRequestNoBody, thread(1) call Info: GET http://test.piscoweb.org/catalog/d1/mn/v1/monitor/ping [org.dataone.client.rest.RestClient]
20170423-06:36:23: [INFO]: Unable to assess v1 capabilities for MN : http://test.piscoweb.org/catalog/d1/mn/v1 : ServiceFailure : class org.dataone.client.exception.ClientSideException: /sun.security.validator.ValidatorException: PKIX path building failed: sun.security.provider.certpath.SunCertPathBuilderException: unable to find valid certification path to requested target [org.dataone.integration.ContextAwareTestCaseDataone]
20170423-06:36:23: [INFO]: RestClient.doRequestNoBody, thread(1) call Info: GET http://test.piscoweb.org/catalog/d1/mn/v2/monitor/ping [org.dataone.client.rest.RestClient]
20170423-06:36:23: [INFO]: Unable to assess v2 capabilities for MN: http://test.piscoweb.org/catalog/d1/mn/v2 : ServiceFailure : class org.dataone.client.exception.ClientSideException: /sun.security.validator.ValidatorException: PKIX path building failed: sun.security.provider.certpath.SunCertPathBuilderException: unable to find valid certification path to requested target [org.dataone.integration.ContextAwareTestCaseDataone]
20170423-06:36:23: [INFO]: created client for certificate file: cnStageUNM1 with subject: CN=urn:node:cnStageUNM1,DC=dataone,DC=org [org.dataone.integration.ContextAwareTestCaseDataone]
20170423-06:36:23: [INFO]: created client for certificate file: cnStageUNM1 with subject: CN=urn:node:cnStageUNM1,DC=dataone,DC=org [org.dataone.integration.ContextAwareTestCaseDataone]
20170423-06:36:23: [INFO]: RestClient.doRequestNoBody, thread(1) call Info: GET http://seadva-test.d2i.indiana.edu/sead/rest/mn/v1/monitor/ping [org.dataone.client.rest.RestClient]
20170423-06:36:23: [INFO]: RestClient.doRequestNoBody, thread(1) call Info: GET http://seadva-test.d2i.indiana.edu/sead/rest/mn/v1/node [org.dataone.client.rest.RestClient]
20170423-06:36:24: [INFO]: RestClient.doRequestNoBody, thread(1) call Info: GET http://seadva-test.d2i.indiana.edu/sead/rest/mn/v2/monitor/ping [org.dataone.client.rest.RestClient]
20170423-06:36:24: [INFO]: Unable to assess v2 capabilities for MN: http://seadva-test.d2i.indiana.edu/sead/rest/mn/v2 : ServiceFailure : 404: Not Found: parser for deserializing HTML not written yet.  Providing message body:
<html><head><title>Apache Tomcat/7.0.57 - Error report</title><style><!--H1 {font-family:Tahoma,Arial,sans-serif;color:white;background-color:#525D76;font-size:22px;} H2 {font-family:Tahoma,Arial,sans-serif;color:white;background-color:#525D76;font-size:16px;} H3 {font-family:Tahoma,Arial,sans-serif;color:white;background-color:#525D76;font-size:14px;} BODY {font-family:Tahoma,Arial,sans-serif;color:black;background-color:white;} B {font-family:Tahoma,Arial,sans-serif;color:white;background-color:#525D76;} P {font-family:Tahoma,Arial,sans-serif;background:white;color:black;font-size:12px;}A {color : black;}A.name {color : black;}HR {color : #525D76;}--></style> </head><body><h1>HTTP Status 404 - Not Found</h1><HR size="1" noshade="noshade"><p><b>type</b> Status report</p><p><b>message</b> <u>Not Found</u></p><p><b>description</b> <u>The requested resource is not available.</u></p><HR size="1" noshade="noshade"><h3>Apache Tomcat/7.0.57</h3></body></html> [org.dataone.integration.ContextAwareTestCaseDataone]
20170423-06:36:24: [INFO]: created client for certificate file: cnStageUNM1 with subject: CN=urn:node:cnStageUNM1,DC=dataone,DC=org [org.dataone.integration.ContextAwareTestCaseDataone]
20170423-06:36:24: [INFO]: created client for certificate file: cnStageUNM1 with subject: CN=urn:node:cnStageUNM1,DC=dataone,DC=org [org.dataone.integration.ContextAwareTestCaseDataone]
20170423-06:36:24: [INFO]: RestClient.doRequestNoBody, thread(1) call Info: GET https://mn-demo-11.test.dataone.org/knb/d1/mn/v1/monitor/ping [org.dataone.client.rest.RestClient]
20170423-06:36:24: [INFO]: RestClient.doRequestNoBody, thread(1) call Info: GET https://mn-demo-11.test.dataone.org/knb/d1/mn/v1/node [org.dataone.client.rest.RestClient]
20170423-06:36:24: [INFO]: RestClient.doRequestNoBody, thread(1) call Info: GET https://mn-demo-11.test.dataone.org/knb/d1/mn/v2/monitor/ping [org.dataone.client.rest.RestClient]
20170423-06:36:24: [INFO]: RestClient.doRequestNoBody, thread(1) call Info: GET https://mn-demo-11.test.dataone.org/knb/d1/mn/v2/node [org.dataone.client.rest.RestClient]
20170423-06:36:24: [INFO]: created client for certificate file: cnStageUNM1 with subject: CN=urn:node:cnStageUNM1,DC=dataone,DC=org [org.dataone.integration.ContextAwareTestCaseDataone]
20170423-06:36:24: [INFO]: created client for certificate file: cnStageUNM1 with subject: CN=urn:node:cnStageUNM1,DC=dataone,DC=org [org.dataone.integration.ContextAwareTestCaseDataone]
20170423-06:36:24: [INFO]: RestClient.doRequestNoBody, thread(1) call Info: GET https://gmn-s.lternet.edu/mn/v1/monitor/ping [org.dataone.client.rest.RestClient]
20170423-06:36:24: [INFO]: RestClient.doRequestNoBody, thread(1) call Info: GET https://gmn-s.lternet.edu/mn/v1/node [org.dataone.client.rest.RestClient]
20170423-06:36:24: [INFO]: RestClient.doRequestNoBody, thread(1) call Info: GET https://gmn-s.lternet.edu/mn/v2/monitor/ping [org.dataone.client.rest.RestClient]
20170423-06:36:24: [INFO]: RestClient.doRequestNoBody, thread(1) call Info: GET https://gmn-s.lternet.edu/mn/v2/node [org.dataone.client.rest.RestClient]
20170423-06:36:25: [INFO]: created client for certificate file: cnStageUNM1 with subject: CN=urn:node:cnStageUNM1,DC=dataone,DC=org [org.dataone.integration.ContextAwareTestCaseDataone]
20170423-06:36:25: [INFO]: created client for certificate file: cnStageUNM1 with subject: CN=urn:node:cnStageUNM1,DC=dataone,DC=org [org.dataone.integration.ContextAwareTestCaseDataone]
20170423-06:36:55: [INFO]: RestClient.doRequestNoBody, thread(1) call Info: GET https://dataone-test.pop.umn.edu/mn/v1/monitor/ping [org.dataone.client.rest.RestClient]
20170423-06:36:55: [INFO]: Unable to assess v1 capabilities for MN : https://dataone-test.pop.umn.edu/mn/v1 : ServiceFailure : class org.dataone.client.exception.ClientSideException: /Connect to dataone-test.pop.umn.edu:443 [dataone-test.pop.umn.edu/134.84.88.240] failed: connect timed out [org.dataone.integration.ContextAwareTestCaseDataone]
20170423-06:37:25: [INFO]: RestClient.doRequestNoBody, thread(1) call Info: GET https://dataone-test.pop.umn.edu/mn/v2/monitor/ping [org.dataone.client.rest.RestClient]
20170423-06:37:25: [INFO]: Unable to assess v2 capabilities for MN: https://dataone-test.pop.umn.edu/mn/v2 : ServiceFailure : class org.dataone.client.exception.ClientSideException: /Connect to dataone-test.pop.umn.edu:443 [dataone-test.pop.umn.edu/134.84.88.240] failed: connect timed out [org.dataone.integration.ContextAwareTestCaseDataone]
20170423-06:37:25: [INFO]: created client for certificate file: cnStageUNM1 with subject: CN=urn:node:cnStageUNM1,DC=dataone,DC=org [org.dataone.integration.ContextAwareTestCaseDataone]
20170423-06:37:25: [INFO]: created client for certificate file: cnStageUNM1 with subject: CN=urn:node:cnStageUNM1,DC=dataone,DC=org [org.dataone.integration.ContextAwareTestCaseDataone]
20170423-06:37:26: [INFO]: RestClient.doRequestNoBody, thread(1) call Info: GET https://dataone-dev.ecoinformatics.org.au/mn/v1/monitor/ping [org.dataone.client.rest.RestClient]
20170423-06:37:27: [INFO]: RestClient.doRequestNoBody, thread(1) call Info: GET https://dataone-dev.ecoinformatics.org.au/mn/v1/node [org.dataone.client.rest.RestClient]
20170423-06:37:28: [INFO]: RestClient.doRequestNoBody, thread(1) call Info: GET https://dataone-dev.ecoinformatics.org.au/mn/v2/monitor/ping [org.dataone.client.rest.RestClient]
20170423-06:37:28: [INFO]: Unable to assess v2 capabilities for MN: https://dataone-dev.ecoinformatics.org.au/mn/v2 : ServiceFailure : 404: NOT FOUND: parser for deserializing HTML not written yet.  Providing message body:
<?xml version="1.0" encoding="UTF-8"?>
<!DOCTYPE html 
     PUBLIC "-//W3C//DTD XHTML 1.0 Strict//EN"
    "http://www.w3.org/TR/xhtml1/DTD/xhtml1-strict.dtd">
<html xmlns="http://www.w3.org/1999/xhtml" xml:lang="en" lang="en">
  <head>
    <title>404 Not Found</title>
  </head>
  <body>
    <p>
      <h3><font style="color:red">404 Not Found</font></h3>
    </p>
    <p>
      <a href="/">Home</a>
    </p>
  </body>
</html>

 [org.dataone.integration.ContextAwareTestCaseDataone]
20170423-06:37:28: [INFO]: created client for certificate file: cnStageUNM1 with subject: CN=urn:node:cnStageUNM1,DC=dataone,DC=org [org.dataone.integration.ContextAwareTestCaseDataone]
20170423-06:37:28: [INFO]: created client for certificate file: cnStageUNM1 with subject: CN=urn:node:cnStageUNM1,DC=dataone,DC=org [org.dataone.integration.ContextAwareTestCaseDataone]
20170423-06:37:28: [INFO]: RestClient.doRequestNoBody, thread(1) call Info: GET https://dataonetest.tamucc.edu/mn/v1/monitor/ping [org.dataone.client.rest.RestClient]
20170423-06:37:28: [INFO]: Unable to assess v1 capabilities for MN : https://dataonetest.tamucc.edu/mn/v1 : ServiceFailure : class org.dataone.client.exception.ClientSideException: /dataonetest.tamucc.edu: Name or service not known [org.dataone.integration.ContextAwareTestCaseDataone]
20170423-06:37:28: [INFO]: RestClient.doRequestNoBody, thread(1) call Info: GET https://dataonetest.tamucc.edu/mn/v2/monitor/ping [org.dataone.client.rest.RestClient]
20170423-06:37:28: [INFO]: Unable to assess v2 capabilities for MN: https://dataonetest.tamucc.edu/mn/v2 : ServiceFailure : class org.dataone.client.exception.ClientSideException: /dataonetest.tamucc.edu [org.dataone.integration.ContextAwareTestCaseDataone]
20170423-06:37:28: [INFO]: created client for certificate file: cnStageUNM1 with subject: CN=urn:node:cnStageUNM1,DC=dataone,DC=org [org.dataone.integration.ContextAwareTestCaseDataone]
20170423-06:37:28: [INFO]: created client for certificate file: cnStageUNM1 with subject: CN=urn:node:cnStageUNM1,DC=dataone,DC=org [org.dataone.integration.ContextAwareTestCaseDataone]
20170423-06:37:28: [INFO]: RestClient.doRequestNoBody, thread(1) call Info: GET http://dataone.neonscience.org/metacat/d1/mn/v1/monitor/ping [org.dataone.client.rest.RestClient]
20170423-06:37:29: [INFO]: RestClient.doRequestNoBody, thread(1) call Info: GET http://dataone.neonscience.org/metacat/d1/mn/v1/node [org.dataone.client.rest.RestClient]
20170423-06:37:29: [INFO]: RestClient.doRequestNoBody, thread(1) call Info: GET http://dataone.neonscience.org/metacat/d1/mn/v2/monitor/ping [org.dataone.client.rest.RestClient]
20170423-06:37:29: [INFO]: RestClient.doRequestNoBody, thread(1) call Info: GET http://dataone.neonscience.org/metacat/d1/mn/v2/node [org.dataone.client.rest.RestClient]
20170423-06:37:29: [INFO]: created client for certificate file: cnStageUNM1 with subject: CN=urn:node:cnStageUNM1,DC=dataone,DC=org [org.dataone.integration.ContextAwareTestCaseDataone]
20170423-06:37:29: [INFO]: created client for certificate file: cnStageUNM1 with subject: CN=urn:node:cnStageUNM1,DC=dataone,DC=org [org.dataone.integration.ContextAwareTestCaseDataone]
20170423-06:37:29: [INFO]: RestClient.doRequestNoBody, thread(1) call Info: GET https://test.arcticdata.io/metacat/d1/mn/v1/monitor/ping [org.dataone.client.rest.RestClient]
20170423-06:37:30: [INFO]: RestClient.doRequestNoBody, thread(1) call Info: GET https://test.arcticdata.io/metacat/d1/mn/v1/node [org.dataone.client.rest.RestClient]
20170423-06:37:30: [INFO]: RestClient.doRequestNoBody, thread(1) call Info: GET https://test.arcticdata.io/metacat/d1/mn/v2/monitor/ping [org.dataone.client.rest.RestClient]
20170423-06:37:31: [INFO]: RestClient.doRequestNoBody, thread(1) call Info: GET https://test.arcticdata.io/metacat/d1/mn/v2/node [org.dataone.client.rest.RestClient]
20170423-06:37:31: [INFO]: created client for certificate file: cnStageUNM1 with subject: CN=urn:node:cnStageUNM1,DC=dataone,DC=org [org.dataone.integration.ContextAwareTestCaseDataone]
20170423-06:37:31: [INFO]: created client for certificate file: cnStageUNM1 with subject: CN=urn:node:cnStageUNM1,DC=dataone,DC=org [org.dataone.integration.ContextAwareTestCaseDataone]
20170423-06:37:31: [INFO]: RestClient.doRequestNoBody, thread(1) call Info: GET http://dataone.ornith.cornell.edu/metacat/d1/mn/v1/monitor/ping [org.dataone.client.rest.RestClient]
20170423-06:37:31: [INFO]: RestClient.doRequestNoBody, thread(1) call Info: GET http://dataone.ornith.cornell.edu/metacat/d1/mn/v1/node [org.dataone.client.rest.RestClient]
20170423-06:37:31: [INFO]: RestClient.doRequestNoBody, thread(1) call Info: GET http://dataone.ornith.cornell.edu/metacat/d1/mn/v2/monitor/ping [org.dataone.client.rest.RestClient]
20170423-06:37:31: [INFO]: RestClient.doRequestNoBody, thread(1) call Info: GET http://dataone.ornith.cornell.edu/metacat/d1/mn/v2/node [org.dataone.client.rest.RestClient]
20170423-06:37:31: [INFO]: created client for certificate file: cnStageUNM1 with subject: CN=urn:node:cnStageUNM1,DC=dataone,DC=org [org.dataone.integration.ContextAwareTestCaseDataone]
20170423-06:37:31: [INFO]: created client for certificate file: cnStageUNM1 with subject: CN=urn:node:cnStageUNM1,DC=dataone,DC=org [org.dataone.integration.ContextAwareTestCaseDataone]
20170423-06:37:32: [INFO]: RestClient.doRequestNoBody, thread(1) call Info: GET https://dataone-test.researchworkspace.com/mn/v1/monitor/ping [org.dataone.client.rest.RestClient]
20170423-06:37:32: [INFO]: RestClient.doRequestNoBody, thread(1) call Info: GET https://dataone-test.researchworkspace.com/mn/v1/node [org.dataone.client.rest.RestClient]
20170423-06:37:32: [INFO]: RestClient.doRequestNoBody, thread(1) call Info: GET https://dataone-test.researchworkspace.com/mn/v2/monitor/ping [org.dataone.client.rest.RestClient]
20170423-06:37:32: [INFO]: RestClient.doRequestNoBody, thread(1) call Info: GET https://dataone-test.researchworkspace.com/mn/v2/node [org.dataone.client.rest.RestClient]
20170423-06:37:32: [INFO]: created client for certificate file: cnStageUNM1 with subject: CN=urn:node:cnStageUNM1,DC=dataone,DC=org [org.dataone.integration.ContextAwareTestCaseDataone]
20170423-06:37:32: [INFO]: created client for certificate file: cnStageUNM1 with subject: CN=urn:node:cnStageUNM1,DC=dataone,DC=org [org.dataone.integration.ContextAwareTestCaseDataone]
20170423-06:37:33: [INFO]: RestClient.doRequestNoBody, thread(1) call Info: GET https://r2r-node.test.dataone.org/mn/v1/monitor/ping [org.dataone.client.rest.RestClient]
20170423-06:37:33: [INFO]: Unable to assess v1 capabilities for MN : https://r2r-node.test.dataone.org/mn/v1 : ServiceFailure : class org.dataone.client.exception.ClientSideException: /r2r-node.test.dataone.org: Name or service not known [org.dataone.integration.ContextAwareTestCaseDataone]
20170423-06:37:33: [INFO]: RestClient.doRequestNoBody, thread(1) call Info: GET https://r2r-node.test.dataone.org/mn/v2/monitor/ping [org.dataone.client.rest.RestClient]
20170423-06:37:33: [INFO]: Unable to assess v2 capabilities for MN: https://r2r-node.test.dataone.org/mn/v2 : ServiceFailure : class org.dataone.client.exception.ClientSideException: /r2r-node.test.dataone.org [org.dataone.integration.ContextAwareTestCaseDataone]
20170423-06:37:33: [INFO]: created client for certificate file: cnStageUNM1 with subject: CN=urn:node:cnStageUNM1,DC=dataone,DC=org [org.dataone.integration.ContextAwareTestCaseDataone]
20170423-06:37:33: [INFO]: created client for certificate file: cnStageUNM1 with subject: CN=urn:node:cnStageUNM1,DC=dataone,DC=org [org.dataone.integration.ContextAwareTestCaseDataone]
20170423-06:37:33: [INFO]: RestClient.doRequestNoBody, thread(1) call Info: GET https://dataone.lib.uic.edu/metacat/d1/mn/v1/monitor/ping [org.dataone.client.rest.RestClient]
20170423-06:37:33: [INFO]: Unable to assess v1 capabilities for MN : https://dataone.lib.uic.edu/metacat/d1/mn/v1 : ServiceFailure : class org.dataone.client.exception.ClientSideException: /Received fatal alert: unknown_ca [org.dataone.integration.ContextAwareTestCaseDataone]
20170423-06:37:34: [INFO]: RestClient.doRequestNoBody, thread(1) call Info: GET https://dataone.lib.uic.edu/metacat/d1/mn/v2/monitor/ping [org.dataone.client.rest.RestClient]
20170423-06:37:34: [INFO]: Unable to assess v2 capabilities for MN: https://dataone.lib.uic.edu/metacat/d1/mn/v2 : ServiceFailure : class org.dataone.client.exception.ClientSideException: /Received fatal alert: unknown_ca [org.dataone.integration.ContextAwareTestCaseDataone]
20170423-06:37:34: [INFO]: created client for certificate file: cnStageUNM1 with subject: CN=urn:node:cnStageUNM1,DC=dataone,DC=org [org.dataone.integration.ContextAwareTestCaseDataone]
20170423-06:37:34: [INFO]: created client for certificate file: cnStageUNM1 with subject: CN=urn:node:cnStageUNM1,DC=dataone,DC=org [org.dataone.integration.ContextAwareTestCaseDataone]
20170423-06:37:34: [INFO]: RestClient.doRequestNoBody, thread(1) call Info: GET https://gmn-s.edirepository.org/mn/v1/monitor/ping [org.dataone.client.rest.RestClient]
20170423-06:37:34: [INFO]: RestClient.doRequestNoBody, thread(1) call Info: GET https://gmn-s.edirepository.org/mn/v1/node [org.dataone.client.rest.RestClient]
20170423-06:37:34: [INFO]: RestClient.doRequestNoBody, thread(1) call Info: GET https://gmn-s.edirepository.org/mn/v2/monitor/ping [org.dataone.client.rest.RestClient]
20170423-06:37:34: [INFO]: RestClient.doRequestNoBody, thread(1) call Info: GET https://gmn-s.edirepository.org/mn/v2/node [org.dataone.client.rest.RestClient]
20170423-06:37:34: [INFO]: created client for certificate file: cnStageUNM1 with subject: CN=urn:node:cnStageUNM1,DC=dataone,DC=org [org.dataone.integration.ContextAwareTestCaseDataone]
20170423-06:37:34: [INFO]: created client for certificate file: cnStageUNM1 with subject: CN=urn:node:cnStageUNM1,DC=dataone,DC=org [org.dataone.integration.ContextAwareTestCaseDataone]
20170423-06:37:34: [INFO]: RestClient.doRequestNoBody, thread(1) call Info: GET https://ncei.nceas.ucsb.edu/mn/v1/monitor/ping [org.dataone.client.rest.RestClient]
20170423-06:37:34: [INFO]: Unable to assess v1 capabilities for MN : https://ncei.nceas.ucsb.edu/mn/v1 : ServiceFailure : class org.dataone.client.exception.ClientSideException: /Received fatal alert: unknown_ca [org.dataone.integration.ContextAwareTestCaseDataone]
20170423-06:37:34: [INFO]: RestClient.doRequestNoBody, thread(1) call Info: GET https://ncei.nceas.ucsb.edu/mn/v2/monitor/ping [org.dataone.client.rest.RestClient]
20170423-06:37:34: [INFO]: Unable to assess v2 capabilities for MN: https://ncei.nceas.ucsb.edu/mn/v2 : ServiceFailure : class org.dataone.client.exception.ClientSideException: /Received fatal alert: unknown_ca [org.dataone.integration.ContextAwareTestCaseDataone]
20170423-06:37:34: [INFO]: v1-ONLY MNs available:     0 [org.dataone.integration.ContextAwareTestCaseDataone]
20170423-06:37:34: [INFO]: v2 MNs available:          8 [org.dataone.integration.ContextAwareTestCaseDataone]
20170423-06:37:34: [INFO]: v1 & v2 MNs available:     7 [org.dataone.integration.ContextAwareTestCaseDataone]
20170423-06:37:34: [INFO]: available MNs:             8 [org.dataone.integration.ContextAwareTestCaseDataone]
20170423-06:37:34: [INFO]: v2 MN     :   https://mn-stage-ucsb-2.test.dataone.org/knb/d1/mn [org.dataone.integration.ContextAwareTestCaseDataone]
20170423-06:37:34: [INFO]: v2 MN     :   https://mn-demo-11.test.dataone.org/knb/d1/mn [org.dataone.integration.ContextAwareTestCaseDataone]
20170423-06:37:34: [INFO]: v2 MN     :   https://gmn-s.lternet.edu/mn [org.dataone.integration.ContextAwareTestCaseDataone]
20170423-06:37:34: [INFO]: v2 MN     :   http://dataone.neonscience.org/metacat/d1/mn [org.dataone.integration.ContextAwareTestCaseDataone]
20170423-06:37:34: [INFO]: v2 MN     :   https://test.arcticdata.io/metacat/d1/mn [org.dataone.integration.ContextAwareTestCaseDataone]
20170423-06:37:34: [INFO]: v2 MN     :   http://dataone.ornith.cornell.edu/metacat/d1/mn [org.dataone.integration.ContextAwareTestCaseDataone]
20170423-06:37:34: [INFO]: v2 MN     :   https://dataone-test.researchworkspace.com/mn [org.dataone.integration.ContextAwareTestCaseDataone]
20170423-06:37:34: [INFO]: v2 MN     :   https://gmn-s.edirepository.org/mn [org.dataone.integration.ContextAwareTestCaseDataone]
20170423-06:37:34: [INFO]: v1 & v2 MN:   https://mn-stage-ucsb-2.test.dataone.org/knb/d1/mn [org.dataone.integration.ContextAwareTestCaseDataone]
20170423-06:37:34: [INFO]: v1 & v2 MN:   https://mn-demo-11.test.dataone.org/knb/d1/mn [org.dataone.integration.ContextAwareTestCaseDataone]
20170423-06:37:34: [INFO]: v1 & v2 MN:   https://gmn-s.lternet.edu/mn [org.dataone.integration.ContextAwareTestCaseDataone]
20170423-06:37:34: [INFO]: v1 & v2 MN:   https://test.arcticdata.io/metacat/d1/mn [org.dataone.integration.ContextAwareTestCaseDataone]
20170423-06:37:34: [INFO]: v1 & v2 MN:   http://dataone.ornith.cornell.edu/metacat/d1/mn [org.dataone.integration.ContextAwareTestCaseDataone]
20170423-06:37:34: [INFO]: v1 & v2 MN:   https://dataone-test.researchworkspace.com/mn [org.dataone.integration.ContextAwareTestCaseDataone]
20170423-06:37:34: [INFO]: v1 & v2 MN:   https://gmn-s.edirepository.org/mn [org.dataone.integration.ContextAwareTestCaseDataone]
20170423-06:37:34: [INFO]: SETUP: creating test objects... [org.dataone.integration.ContextAwareTestCaseDataone]
20170423-06:37:34: [INFO]: created client for certificate file: testRightsHolder with subject: CN=testRightsHolder,DC=dataone,DC=org [org.dataone.integration.ContextAwareTestCaseDataone]
20170423-06:37:34: [INFO]: created client for certificate file: cnStageUNM1 with subject: CN=urn:node:cnStageUNM1,DC=dataone,DC=org [org.dataone.integration.ContextAwareTestCaseDataone]
20170423-06:37:34: [INFO]: certificate directory: /etc/dataone/client/testClientCerts/ [org.dataone.integration.ContextAwareTestCaseDataone]
20170423-06:37:34: [INFO]: certificate filename: testRightsHolder [org.dataone.integration.ContextAwareTestCaseDataone]
20170423-06:37:34: [INFO]: client setup as Subject: CN=testRightsHolder,DC=dataone,DC=org [org.dataone.integration.ContextAwareTestCaseDataone]
20170423-06:37:34: [INFO]: creating a test object.  pid = testV2CreateV1UpdateSameNode_pid_2017112233734951 on https://mn-stage-ucsb-2.test.dataone.org/knb/d1/mn/v2 [org.dataone.integration.ContextAwareTestCaseDataone]
20170423-06:37:34: [INFO]: SystemMetadata for pid: testV2CreateV1UpdateSameNode_pid_2017112233734951
<?xml version="1.0" encoding="UTF-8" standalone="yes"?>
<ns3:systemMetadata xmlns:ns2="http://ns.dataone.org/service/types/v1" xmlns:ns3="http://ns.dataone.org/service/types/v2.0">
    <serialVersion>1</serialVersion>
    <identifier>testV2CreateV1UpdateSameNode_pid_2017112233734951</identifier>
    <formatId>eml://ecoinformatics.org/eml-2.0.1</formatId>
    <size>17181</size>
    <checksum algorithm="MD5">03ce09c6b4c3efc1681f3023402998a2</checksum>
    <submitter>CN=testRightsHolder,DC=dataone,DC=org</submitter>
    <rightsHolder>testRightsHolder</rightsHolder>
    <accessPolicy>
        <allow>
            <subject>public</subject>
            <permission>changePermission</permission>
        </allow>
    </accessPolicy>
    <dateUploaded>2017-04-23T06:37:34.958+00:00</dateUploaded>
    <dateSysMetadataModified>2017-04-23T06:37:34.958+00:00</dateSysMetadataModified>
    <originMemberNode>urn:node:mnStageUCSB2</originMemberNode>
    <authoritativeMemberNode>urn:node:mnStageUCSB2</authoritativeMemberNode>
    <seriesId>testV2CreateV1UpdateSameNode_sid_2017112233734951</seriesId>
</ns3:systemMetadata>
 [org.dataone.integration.ContextAwareTestCaseDataone]
20170423-06:38:05: [INFO]: RestClient.doRequestMMPBody, thread(1) call Info: POST https://mn-stage-ucsb-2.test.dataone.org/knb/d1/mn/v2/object; MMP message has: ParamPart:pid = testV2CreateV1UpdateSameNode_pid_2017112233734951; FilePart:object = /tmp/mmp.output.4569795677407630285.tmp (17181 bytes); FilePart:sysmeta = /tmp/mmp.output.1946236008813287381.tmp (1118 bytes);  [org.dataone.client.rest.RestClient]
20170423-06:38:05: [INFO]: object created.  pid = testV2CreateV1UpdateSameNode_pid_2017112233734951 [org.dataone.integration.ContextAwareTestCaseDataone]
20170423-06:38:05: [INFO]: created client for certificate file: testRightsHolder with subject: CN=testRightsHolder,DC=dataone,DC=org [org.dataone.integration.ContextAwareTestCaseDataone]
20170423-06:38:05: [INFO]: created client for certificate file: cnStageUNM1 with subject: CN=urn:node:cnStageUNM1,DC=dataone,DC=org [org.dataone.integration.ContextAwareTestCaseDataone]
20170423-06:38:05: [INFO]: certificate directory: /etc/dataone/client/testClientCerts/ [org.dataone.integration.ContextAwareTestCaseDataone]
20170423-06:38:05: [INFO]: certificate filename: cnStageUNM1 [org.dataone.integration.ContextAwareTestCaseDataone]
20170423-06:38:05: [WARN]: registering ConnectionManager... [org.dataone.client.utils.HttpConnectionMonitorService]
20170423-06:38:05: [INFO]: client setup as Subject: CN=urn:node:cnStageUNM1,DC=dataone,DC=org [org.dataone.integration.ContextAwareTestCaseDataone]
20170423-06:38:05: [INFO]: creating a test object.  pid = testV1CreateV2UpdateSameNode_1_2017112233734951 on https://mn-stage-ucsb-2.test.dataone.org/knb/d1/mn/v1 [org.dataone.integration.ContextAwareTestCaseDataone]
20170423-06:38:05: [INFO]: SystemMetadata for pid: testV1CreateV2UpdateSameNode_1_2017112233734951
<?xml version="1.0" encoding="UTF-8" standalone="yes"?>
<ns3:systemMetadata xmlns:ns2="http://ns.dataone.org/service/types/v1" xmlns:ns3="http://ns.dataone.org/service/types/v2.0">
    <serialVersion>1</serialVersion>
    <identifier>testV1CreateV2UpdateSameNode_1_2017112233734951</identifier>
    <formatId>eml://ecoinformatics.org/eml-2.0.1</formatId>
    <size>17181</size>
    <checksum algorithm="MD5">03ce09c6b4c3efc1681f3023402998a2</checksum>
    <submitter>CN=urn:node:cnStageUNM1,DC=dataone,DC=org</submitter>
    <rightsHolder>CN=testRightsHolder,DC=dataone,DC=org</rightsHolder>
    <accessPolicy>
        <allow>
            <subject>public</subject>
            <permission>changePermission</permission>
        </allow>
    </accessPolicy>
    <dateUploaded>2017-04-23T06:38:05.041+00:00</dateUploaded>
    <dateSysMetadataModified>2017-04-23T06:38:05.041+00:00</dateSysMetadataModified>
    <originMemberNode>urn:node:mnStageUCSB2</originMemberNode>
    <authoritativeMemberNode>urn:node:mnStageUCSB2</authoritativeMemberNode>
</ns3:systemMetadata>
 [org.dataone.integration.ContextAwareTestCaseDataone]
20170423-06:38:35: [INFO]: RestClient.doRequestMMPBody, thread(1) call Info: POST https://mn-stage-ucsb-2.test.dataone.org/knb/d1/mn/v1/object; MMP message has: ParamPart:pid = testV1CreateV2UpdateSameNode_1_2017112233734951; FilePart:object = /tmp/mmp.output.2490824260295702577.tmp (17181 bytes); FilePart:sysmeta = /tmp/mmp.output.616539687192414163.tmp (1013 bytes);  [org.dataone.client.rest.RestClient]
20170423-06:38:35: [WARN]: registering ConnectionManager... [org.dataone.client.utils.HttpConnectionMonitorService]
org.dataone.client.exception.ClientSideException: Unable to create test object!/class org.dataone.client.exception.ClientSideException: /Read timed out
	at org.dataone.integration.ContextAwareTestCaseDataone.createTestObject(ContextAwareTestCaseDataone.java:1609)
	at org.dataone.integration.ContextAwareTestCaseDataone.createTestObject(ContextAwareTestCaseDataone.java:1430)
	at org.dataone.integration.ContextAwareTestCaseDataone.createTestObject(ContextAwareTestCaseDataone.java:1383)
	at org.dataone.integration.ContextAwareTestCaseDataone.createTestObject(ContextAwareTestCaseDataone.java:1342)
	at org.dataone.integration.ContextAwareTestCaseDataone.createTestObject(ContextAwareTestCaseDataone.java:1359)
	at org.dataone.integration.it.testImplementations.V1V2InteropFunctionalTestImplementations.setupV1CreateV2UpdateSameNode(V1V2InteropFunctionalTestImplementations.java:548)
	at org.dataone.integration.it.testImplementations.V1V2InteropFunctionalTestImplementations.setupTestObjects(V1V2InteropFunctionalTestImplementations.java:203)
	at org.dataone.integration.it.testImplementations.V1V2InteropFunctionalTestImplementations.setup(V1V2InteropFunctionalTestImplementations.java:92)
	at org.dataone.integration.it.functional.v2.V1V2InteropFunctionalIT.setup(V1V2InteropFunctionalIT.java:21)
	at sun.reflect.GeneratedMethodAccessor50.invoke(Unknown Source)
	at sun.reflect.DelegatingMethodAccessorImpl.invoke(DelegatingMethodAccessorImpl.java:43)
	at java.lang.reflect.Method.invoke(Method.java:606)
	at org.junit.runners.model.FrameworkMethod$1.runReflectiveCall(FrameworkMethod.java:44)
	at org.junit.internal.runners.model.ReflectiveCallable.run(ReflectiveCallable.java:15)
	at org.junit.runners.model.FrameworkMethod.invokeExplosively(FrameworkMethod.java:41)
	at org.junit.internal.runners.statements.RunBefores.evaluate(RunBefores.java:27)
	at org.junit.runners.BlockJUnit4ClassRunner.runChild(BlockJUnit4ClassRunner.java:76)
	at org.junit.runners.BlockJUnit4ClassRunner.runChild(BlockJUnit4ClassRunner.java:50)
	at org.junit.runners.ParentRunner$3.run(ParentRunner.java:193)
	at org.junit.runners.ParentRunner$1.schedule(ParentRunner.java:52)
	at org.junit.runners.ParentRunner.runChildren(ParentRunner.java:191)
	at org.junit.runners.ParentRunner.access$000(ParentRunner.java:42)
	at org.junit.runners.ParentRunner$2.evaluate(ParentRunner.java:184)
	at org.junit.runners.ParentRunner.run(ParentRunner.java:236)
	at org.apache.maven.surefire.junit4.JUnit4TestSet.execute(JUnit4TestSet.java:53)
	at org.apache.maven.surefire.junit4.JUnit4Provider.executeTestSet(JUnit4Provider.java:119)
	at org.apache.maven.surefire.junit4.JUnit4Provider.invoke(JUnit4Provider.java:101)
	at sun.reflect.NativeMethodAccessorImpl.invoke0(Native Method)
	at sun.reflect.NativeMethodAccessorImpl.invoke(NativeMethodAccessorImpl.java:57)
	at sun.reflect.DelegatingMethodAccessorImpl.invoke(DelegatingMethodAccessorImpl.java:43)
	at java.lang.reflect.Method.invoke(Method.java:606)
	at org.apache.maven.surefire.booter.ProviderFactory$ClassLoaderProxy.invoke(ProviderFactory.java:103)
	at com.sun.proxy.$Proxy0.invoke(Unknown Source)
	at org.apache.maven.surefire.booter.SurefireStarter.invokeProvider(SurefireStarter.java:150)
	at org.apache.maven.surefire.booter.SurefireStarter.runSuitesInProcess(SurefireStarter.java:91)
	at org.apache.maven.surefire.booter.ForkedBooter.main(ForkedBooter.java:69)
Caused by: org.dataone.service.exceptions.ServiceFailure: class org.dataone.client.exception.ClientSideException: /Read timed out
	at org.dataone.client.rest.HttpMultipartRestClient.doPostRequest(HttpMultipartRestClient.java:470)
	at org.dataone.client.v1.impl.MultipartMNode.create(MultipartMNode.java:566)
	at org.dataone.integration.adapters.CommonCallAdapter.create(CommonCallAdapter.java:500)
	at org.dataone.integration.ContextAwareTestCaseDataone.createTestObject(ContextAwareTestCaseDataone.java:1600)
	... 35 more
Caused by: org.dataone.client.exception.ClientSideException: /Read timed out
	... 39 more
Caused by: java.net.SocketTimeoutException: Read timed out
	at java.net.SocketInputStream.socketRead0(Native Method)
	at java.net.SocketInputStream.read(SocketInputStream.java:153)
	at java.net.SocketInputStream.read(SocketInputStream.java:122)
	at sun.security.ssl.InputRecord.readFully(InputRecord.java:442)
	at sun.security.ssl.InputRecord.read(InputRecord.java:480)
	at sun.security.ssl.SSLSocketImpl.readRecord(SSLSocketImpl.java:944)
	at sun.security.ssl.SSLSocketImpl.readDataRecord(SSLSocketImpl.java:901)
	at sun.security.ssl.AppInputStream.read(AppInputStream.java:102)
	at org.apache.http.impl.io.SessionInputBufferImpl.streamRead(SessionInputBufferImpl.java:136)
	at org.apache.http.impl.io.SessionInputBufferImpl.fillBuffer(SessionInputBufferImpl.java:152)
	at org.apache.http.impl.io.SessionInputBufferImpl.readLine(SessionInputBufferImpl.java:270)
	at org.apache.http.impl.conn.DefaultHttpResponseParser.parseHead(DefaultHttpResponseParser.java:140)
	at org.apache.http.impl.conn.DefaultHttpResponseParser.parseHead(DefaultHttpResponseParser.java:57)
	at org.apache.http.impl.io.AbstractMessageParser.parse(AbstractMessageParser.java:260)
	at org.apache.http.impl.DefaultBHttpClientConnection.receiveResponseHeader(DefaultBHttpClientConnection.java:161)
	at org.apache.http.impl.conn.CPoolProxy.receiveResponseHeader(CPoolProxy.java:153)
	at org.apache.http.protocol.HttpRequestExecutor.doReceiveResponse(HttpRequestExecutor.java:271)
	at org.apache.http.protocol.HttpRequestExecutor.execute(HttpRequestExecutor.java:123)
	at org.apache.http.impl.execchain.MainClientExec.execute(MainClientExec.java:254)
	at org.apache.http.impl.client.cache.CachingExec.callBackend(CachingExec.java:578)
	at org.apache.http.impl.client.cache.CachingExec.execute(CachingExec.java:259)
	at org.apache.http.impl.execchain.ProtocolExec.execute(ProtocolExec.java:195)
	at org.apache.http.impl.execchain.RetryExec.execute(RetryExec.java:86)
	at org.apache.http.impl.execchain.RedirectExec.execute(RedirectExec.java:108)
	at org.apache.http.impl.client.InternalHttpClient.doExecute(InternalHttpClient.java:184)
	at org.apache.http.impl.client.CloseableHttpClient.execute(CloseableHttpClient.java:82)
	at org.apache.http.impl.client.CloseableHttpClient.execute(CloseableHttpClient.java:106)
	at org.apache.http.impl.client.CloseableHttpClient.execute(CloseableHttpClient.java:57)
	at org.dataone.client.rest.RestClient.doRequest(RestClient.java:330)
	at org.dataone.client.rest.RestClient.doRequestMMBody(RestClient.java:306)
	at org.dataone.client.rest.RestClient.doPostRequest(RestClient.java:226)
	at org.dataone.client.rest.HttpMultipartRestClient.doPostRequest(HttpMultipartRestClient.java:463)
	... 38 more
Tests run: 22, Failures: 22, Errors: 0, Skipped: 0, Time elapsed: 3,796.82 sec <<< FAILURE!

Results :

Failed tests: 
  testV2CreateCnSetAccessPolicy(org.dataone.integration.it.functional.v2.V1V2InteropFunctionalIT): POST https://mn-stage-ucsb-2.test.dataone.org/knb/d1/mn/v1/object; MMP message has: ParamPart:pid = testV1CreateV2UpdateSameNode_1_201711222385920; FilePart:object = /tmp/mmp.output.2869577804216053118.tmp (17181 bytes); FilePart:sysmeta = /tmp/mmp.output.7559562493170768861.tmp (1012 bytes);  testV1CreateV2UpdateSameNode() couldn't create test object: org.dataone.client.exception.ClientSideException: Unable to create test object!/class org.dataone.client.exception.ClientSideException: /Read timed out
  testV2CreateCnSetObsoletedBy(org.dataone.integration.it.functional.v2.V1V2InteropFunctionalIT): POST https://mn-stage-ucsb-2.test.dataone.org/knb/d1/mn/v1/object; MMP message has: ParamPart:pid = testV1CreateV2UpdateSameNode_1_2017112224114736; FilePart:object = /tmp/mmp.output.7777390418303076467.tmp (17181 bytes); FilePart:sysmeta = /tmp/mmp.output.3177226128411353266.tmp (1013 bytes);  testV1CreateV2UpdateSameNode() couldn't create test object: org.dataone.client.exception.ClientSideException: Unable to create test object!/class org.dataone.client.exception.ClientSideException: /Read timed out
  testV2CreateCnSetReplicationPolicy(org.dataone.integration.it.functional.v2.V1V2InteropFunctionalIT): POST https://mn-stage-ucsb-2.test.dataone.org/knb/d1/mn/v1/object; MMP message has: ParamPart:pid = testV1CreateV2UpdateSameNode_1_2017112224429675; FilePart:object = /tmp/mmp.output.442740398681593996.tmp (17181 bytes); FilePart:sysmeta = /tmp/mmp.output.727749024922943874.tmp (1013 bytes);  testV1CreateV2UpdateSameNode() couldn't create test object: org.dataone.client.exception.ClientSideException: Unable to create test object!/class org.dataone.client.exception.ClientSideException: /Read timed out
  testV2CreateCnSetRightsHolder(org.dataone.integration.it.functional.v2.V1V2InteropFunctionalIT): POST https://mn-stage-ucsb-2.test.dataone.org/knb/d1/mn/v2/object; MMP message has: ParamPart:pid = testV2CreateV1UpdateSameNode_pid_2017112224741282; FilePart:object = /tmp/mmp.output.6147829118832229472.tmp (17181 bytes); FilePart:sysmeta = /tmp/mmp.output.2461887391056243204.tmp (1118 bytes);  testV2CreateV1UpdateSameNode() couldn't create test object: org.dataone.client.exception.ClientSideException: Unable to create test object!/class org.dataone.client.exception.ClientSideException: /Read timed out
  testV2CreateV1GetSysmetaSameNode(org.dataone.integration.it.functional.v2.V1V2InteropFunctionalIT): Tests require at least 1 MN that supports ONLY the v1 API
  testV1CreateV2GetSysmetaSameNode(org.dataone.integration.it.functional.v2.V1V2InteropFunctionalIT): POST https://mn-stage-ucsb-2.test.dataone.org/knb/d1/mn/v1/object; MMP message has: ParamPart:pid = testV1CreateV2UpdateSameNode_1_201711222538542; FilePart:object = /tmp/mmp.output.7680649810356301716.tmp (17181 bytes); FilePart:sysmeta = /tmp/mmp.output.7107670079390681771.tmp (1012 bytes);  testV1CreateV2UpdateSameNode() couldn't create test object: org.dataone.client.exception.ClientSideException: Unable to create test object!/class org.dataone.client.exception.ClientSideException: /Read timed out
  testV2CreateV1DeleteSameNode(org.dataone.integration.it.functional.v2.V1V2InteropFunctionalIT): Tests require at least 1 MN that supports ONLY the v1 API
  testV1CreateV2DeleteSameNode(org.dataone.integration.it.functional.v2.V1V2InteropFunctionalIT): Tests require at least 1 MN that supports ONLY the v1 API
  testV2CreateV1ListObjectsSameNode(org.dataone.integration.it.functional.v2.V1V2InteropFunctionalIT): POST https://mn-stage-ucsb-2.test.dataone.org/knb/d1/mn/v1/object; MMP message has: ParamPart:pid = testV1CreateV2UpdateSameNode_1_201711223150509; FilePart:object = /tmp/mmp.output.3040152556392351911.tmp (17181 bytes); FilePart:sysmeta = /tmp/mmp.output.5310015263580547984.tmp (1012 bytes);  testV1CreateV2UpdateSameNode() couldn't create test object: org.dataone.client.exception.ClientSideException: Unable to create test object!/class org.dataone.client.exception.ClientSideException: /Read timed out
  testV1CreateV2ListObjectsSameNode(org.dataone.integration.it.functional.v2.V1V2InteropFunctionalIT): Tests require at least 1 MN that supports ONLY the v1 API
  testV2CreateV1GetSameNode(org.dataone.integration.it.functional.v2.V1V2InteropFunctionalIT): Tests require at least 1 MN that supports ONLY the v1 API
  testV2CreateV1UpdateSameNode(org.dataone.integration.it.functional.v2.V1V2InteropFunctionalIT): POST https://mn-stage-ucsb-2.test.dataone.org/knb/d1/mn/v1/object; MMP message has: ParamPart:pid = testV1CreateV2UpdateSameNode_1_201711223104336; FilePart:object = /tmp/mmp.output.5618011358491533599.tmp (17181 bytes); FilePart:sysmeta = /tmp/mmp.output.5062561005783663414.tmp (1012 bytes);  testV1CreateV2UpdateSameNode() couldn't create test object: org.dataone.client.exception.ClientSideException: Unable to create test object!/class org.dataone.client.exception.ClientSideException: /Read timed out
  testV1CreateV2UpdateSameNode(org.dataone.integration.it.functional.v2.V1V2InteropFunctionalIT): Tests require at least 1 MN that supports ONLY the v1 API
  testV1CreateV2GetSysMeta(org.dataone.integration.it.functional.v2.V1V2InteropFunctionalIT): Tests require at least 1 MN that supports ONLY the v1 API
  testV1CreateV2Query(org.dataone.integration.it.functional.v2.V1V2InteropFunctionalIT): POST https://mn-stage-ucsb-2.test.dataone.org/knb/d1/mn/v2/object; MMP message has: ParamPart:pid = testV2CreateV1UpdateSameNode_pid_2017112231741792; FilePart:object = /tmp/mmp.output.2598000118253794488.tmp (17181 bytes); FilePart:sysmeta = /tmp/mmp.output.1215641689554124686.tmp (1118 bytes);  testV2CreateV1UpdateSameNode() couldn't create test object: org.dataone.client.exception.ClientSideException: Unable to create test object!/class org.dataone.client.exception.ClientSideException: /Read timed out
  testV2CreateV1GetSysMeta(org.dataone.integration.it.functional.v2.V1V2InteropFunctionalIT): POST https://mn-stage-ucsb-2.test.dataone.org/knb/d1/mn/v2/object; MMP message has: ParamPart:pid = testV2CreateV1UpdateSameNode_pid_2017112232026537; FilePart:object = /tmp/mmp.output.5456705790157698027.tmp (17181 bytes); FilePart:sysmeta = /tmp/mmp.output.3131786254275015335.tmp (1118 bytes);  testV2CreateV1UpdateSameNode() couldn't create test object: org.dataone.client.exception.ClientSideException: Unable to create test object!/class org.dataone.client.exception.ClientSideException: /Read timed out
  testV1CreateV2Get(org.dataone.integration.it.functional.v2.V1V2InteropFunctionalIT): POST https://mn-stage-ucsb-2.test.dataone.org/knb/d1/mn/v2/object; MMP message has: ParamPart:pid = testV2CreateV1UpdateSameNode_pid_2017112232310319; FilePart:object = /tmp/mmp.output.2267945854865577000.tmp (17181 bytes); FilePart:sysmeta = /tmp/mmp.output.49318349932458392.tmp (1118 bytes);  testV2CreateV1UpdateSameNode() couldn't create test object: org.dataone.client.exception.ClientSideException: Unable to create test object!/class org.dataone.client.exception.ClientSideException: /Read timed out
  testV2CreateV1Delete(org.dataone.integration.it.functional.v2.V1V2InteropFunctionalIT): POST https://mn-stage-ucsb-2.test.dataone.org/knb/d1/mn/v2/object; MMP message has: ParamPart:pid = testV2CreateV1UpdateSameNode_pid_2017112232557273; FilePart:object = /tmp/mmp.output.1933549360205668714.tmp (17181 bytes); FilePart:sysmeta = /tmp/mmp.output.5788946500456362835.tmp (1118 bytes);  testV2CreateV1UpdateSameNode() couldn't create test object: org.dataone.client.exception.ClientSideException: Unable to create test object!/class org.dataone.client.exception.ClientSideException: /Read timed out
  testV1CreateV2Delete(org.dataone.integration.it.functional.v2.V1V2InteropFunctionalIT): Tests require at least 1 MN that supports ONLY the v1 API
  testV2CreateV1ListObjects(org.dataone.integration.it.functional.v2.V1V2InteropFunctionalIT): Tests require at least 1 MN that supports ONLY the v1 API
  testV1CreateV2ListObjects(org.dataone.integration.it.functional.v2.V1V2InteropFunctionalIT): POST https://mn-stage-ucsb-2.test.dataone.org/knb/d1/mn/v1/object; MMP message has: ParamPart:pid = testV1CreateV2UpdateSameNode_1_2017112233420116; FilePart:object = /tmp/mmp.output.7316860672590588920.tmp (17181 bytes); FilePart:sysmeta = /tmp/mmp.output.2673137273816855190.tmp (1013 bytes);  testV1CreateV2UpdateSameNode() couldn't create test object: org.dataone.client.exception.ClientSideException: Unable to create test object!/class org.dataone.client.exception.ClientSideException: /Read timed out
  testV2CreateCnArchive(org.dataone.integration.it.functional.v2.V1V2InteropFunctionalIT): POST https://mn-stage-ucsb-2.test.dataone.org/knb/d1/mn/v1/object; MMP message has: ParamPart:pid = testV1CreateV2UpdateSameNode_1_2017112233734951; FilePart:object = /tmp/mmp.output.2490824260295702577.tmp (17181 bytes); FilePart:sysmeta = /tmp/mmp.output.616539687192414163.tmp (1013 bytes);  testV1CreateV2UpdateSameNode() couldn't create test object: org.dataone.client.exception.ClientSideException: Unable to create test object!/class org.dataone.client.exception.ClientSideException: /Read timed out

Tests run: 22, Failures: 22, Errors: 0, Skipped: 0

[WARNING] File encoding has not been set, using platform encoding UTF-8, i.e. build is platform dependent!
[JENKINS] Recording test results
[INFO] 
[INFO] --- maven-failsafe-plugin:2.8.1:verify (verify) @ d1_integration ---
[INFO] Failsafe report directory: /var/lib/jenkins/jobs/d1_integration_Stage_v1_v2_interop_functional/workspace/target/failsafe-reports
[WARNING] File encoding has not been set, using platform encoding UTF-8, i.e. build is platform dependent!
[ERROR] There are test failures.

Please refer to /var/lib/jenkins/jobs/d1_integration_Stage_v1_v2_interop_functional/workspace/target/failsafe-reports for the individual test results.
[JENKINS] Recording test results
Notifying upstream projects of job completion
Join notifier requires a CauseAction
[INFO] ------------------------------------------------------------------------
[INFO] BUILD SUCCESS
[INFO] ------------------------------------------------------------------------
[INFO] Total time: 1:03:42.418s
[INFO] Finished at: Sun Apr 23 06:38:35 UTC 2017
[INFO] Final Memory: 29M/523M
[INFO] ------------------------------------------------------------------------
Waiting for Jenkins to finish collecting data