UnstableConsole Output

Skipping 630 KB.. Full Log
n.ContextAwareTestCaseDataone]
20170503-06:09:52: [INFO]: created client for certificate file: cnStageUNM1 with subject: CN=urn:node:cnStageUNM1,DC=dataone,DC=org [org.dataone.integration.ContextAwareTestCaseDataone]
20170503-06:09:52: [INFO]: RestClient.doRequestNoBody, thread(1) call Info: GET http://dataone.neonscience.org/metacat/d1/mn/v2/monitor/ping [org.dataone.client.rest.RestClient]
20170503-06:09:52: [INFO]: MN included in test: http://dataone.neonscience.org/metacat/d1/mn [org.dataone.integration.ContextAwareTestCaseDataone]
20170503-06:09:52: [INFO]: created client for certificate file: cnStageUNM1 with subject: CN=urn:node:cnStageUNM1,DC=dataone,DC=org [org.dataone.integration.ContextAwareTestCaseDataone]
20170503-06:09:53: [INFO]: RestClient.doRequestNoBody, thread(1) call Info: GET https://test.arcticdata.io/metacat/d1/mn/v2/monitor/ping [org.dataone.client.rest.RestClient]
20170503-06:09:53: [INFO]: MN included in test: https://test.arcticdata.io/metacat/d1/mn [org.dataone.integration.ContextAwareTestCaseDataone]
20170503-06:09:53: [INFO]: created client for certificate file: cnStageUNM1 with subject: CN=urn:node:cnStageUNM1,DC=dataone,DC=org [org.dataone.integration.ContextAwareTestCaseDataone]
20170503-06:09:53: [INFO]: RestClient.doRequestNoBody, thread(1) call Info: GET http://dataone.ornith.cornell.edu/metacat/d1/mn/v2/monitor/ping [org.dataone.client.rest.RestClient]
20170503-06:09:53: [INFO]: MN included in test: http://dataone.ornith.cornell.edu/metacat/d1/mn [org.dataone.integration.ContextAwareTestCaseDataone]
20170503-06:09:53: [INFO]: created client for certificate file: cnStageUNM1 with subject: CN=urn:node:cnStageUNM1,DC=dataone,DC=org [org.dataone.integration.ContextAwareTestCaseDataone]
20170503-06:09:54: [INFO]: RestClient.doRequestNoBody, thread(1) call Info: GET https://dataone-test.researchworkspace.com/mn/v2/monitor/ping [org.dataone.client.rest.RestClient]
20170503-06:09:54: [INFO]: MN included in test: https://dataone-test.researchworkspace.com/mn [org.dataone.integration.ContextAwareTestCaseDataone]
20170503-06:09:54: [INFO]: created client for certificate file: cnStageUNM1 with subject: CN=urn:node:cnStageUNM1,DC=dataone,DC=org [org.dataone.integration.ContextAwareTestCaseDataone]
20170503-06:09:54: [INFO]: RestClient.doRequestNoBody, thread(1) call Info: GET https://dataone.lib.uic.edu/metacat/d1/mn/v2/monitor/ping [org.dataone.client.rest.RestClient]
20170503-06:09:54: [INFO]: MN excluded from test: https://dataone.lib.uic.edu/metacat/d1/mn [org.dataone.integration.ContextAwareTestCaseDataone]
20170503-06:09:54: [INFO]: created client for certificate file: cnStageUNM1 with subject: CN=urn:node:cnStageUNM1,DC=dataone,DC=org [org.dataone.integration.ContextAwareTestCaseDataone]
20170503-06:09:54: [INFO]: RestClient.doRequestNoBody, thread(1) call Info: GET https://gmn-s.edirepository.org/mn/v2/monitor/ping [org.dataone.client.rest.RestClient]
20170503-06:09:54: [INFO]: MN included in test: https://gmn-s.edirepository.org/mn [org.dataone.integration.ContextAwareTestCaseDataone]
20170503-06:09:54: [INFO]: created client for certificate file: cnStageUNM1 with subject: CN=urn:node:cnStageUNM1,DC=dataone,DC=org [org.dataone.integration.ContextAwareTestCaseDataone]
20170503-06:09:55: [INFO]: RestClient.doRequestNoBody, thread(1) call Info: GET https://ncei.nceas.ucsb.edu/mn/v2/monitor/ping [org.dataone.client.rest.RestClient]
20170503-06:09:55: [INFO]: MN included in test: https://ncei.nceas.ucsb.edu/mn [org.dataone.integration.ContextAwareTestCaseDataone]
20170503-06:09:55: [INFO]: created client for certificate file: cnStageUNM1 with subject: CN=urn:node:cnStageUNM1,DC=dataone,DC=org [org.dataone.integration.ContextAwareTestCaseDataone]
20170503-06:09:55: [INFO]: CREATING test object... pid: P1_20171222395529 with a sid: S1_20171222395531 obsoletes: null obsoletedBy: null [org.dataone.integration.ContextAwareTestCaseDataone]
20170503-06:09:55: [INFO]: created client for certificate file: testRightsHolder with subject: CN=testRightsHolder,DC=dataone,DC=org [org.dataone.integration.ContextAwareTestCaseDataone]
20170503-06:09:55: [INFO]: certificate directory: /etc/dataone/client/testClientCerts/ [org.dataone.integration.ContextAwareTestCaseDataone]
20170503-06:09:55: [INFO]: certificate filename: cnStageUNM1 [org.dataone.integration.ContextAwareTestCaseDataone]
20170503-06:09:55: [WARN]: registering ConnectionManager... [org.dataone.client.utils.HttpConnectionMonitorService]
20170503-06:09:55: [INFO]: client setup as Subject: CN=urn:node:cnStageUNM1,DC=dataone,DC=org [org.dataone.integration.ContextAwareTestCaseDataone]
20170503-06:09:55: [WARN]: Unable to find a valid authoritative MN to use for the object: P1_20171222395529 [org.dataone.integration.ContextAwareTestCaseDataone]
20170503-06:09:55: [INFO]: creating a test object.  pid = P1_20171222395529 on https://mn-stage-ucsb-2.test.dataone.org/knb/d1/mn/v2 [org.dataone.integration.ContextAwareTestCaseDataone]
20170503-06:09:55: [INFO]: SystemMetadata for pid: P1_20171222395529
<?xml version="1.0" encoding="UTF-8" standalone="yes"?>
<ns3:systemMetadata xmlns:ns2="http://ns.dataone.org/service/types/v1" xmlns:ns3="http://ns.dataone.org/service/types/v2.0">
    <serialVersion>1</serialVersion>
    <identifier>P1_20171222395529</identifier>
    <formatId>eml://ecoinformatics.org/eml-2.0.1</formatId>
    <size>17181</size>
    <checksum algorithm="MD5">03ce09c6b4c3efc1681f3023402998a2</checksum>
    <submitter>CN=urn:node:cnStageUNM1,DC=dataone,DC=org</submitter>
    <rightsHolder>CN=testRightsHolder,DC=dataone,DC=org</rightsHolder>
    <accessPolicy>
        <allow>
            <subject>public</subject>
            <permission>read</permission>
        </allow>
    </accessPolicy>
    <dateUploaded>2017-05-03T06:09:55.042+00:00</dateUploaded>
    <dateSysMetadataModified>2017-05-03T06:09:55.042+00:00</dateSysMetadataModified>
    <originMemberNode>bogusAuthoritativeNode</originMemberNode>
    <authoritativeMemberNode>bogusAuthoritativeNode</authoritativeMemberNode>
    <seriesId>S1_20171222395531</seriesId>
</ns3:systemMetadata>
 [org.dataone.integration.ContextAwareTestCaseDataone]
20170503-06:09:56: [INFO]: RestClient.doRequestMMPBody, thread(1) call Info: POST https://mn-stage-ucsb-2.test.dataone.org/knb/d1/mn/v2/object; MMP message has: ParamPart:pid = P1_20171222395529; FilePart:object = /tmp/mmp.output.5549265147461174328.tmp (17181 bytes); FilePart:sysmeta = /tmp/mmp.output.6712097813087093891.tmp (1069 bytes);  [org.dataone.client.rest.RestClient]
20170503-06:09:56: [INFO]: object created.  pid = P1_20171222395529 [org.dataone.integration.ContextAwareTestCaseDataone]
20170503-06:09:56: [WARN]: registering ConnectionManager... [org.dataone.client.utils.HttpConnectionMonitorService]
20170503-06:10:06: [INFO]: Created SID (S1_20171222395531) and head PID (P1_20171222395529) pair. [org.dataone.integration.ContextAwareTestCaseDataone]
20170503-06:10:16: [INFO]: RestClient.doRequestNoBody, thread(1) call Info: GET https://mn-stage-ucsb-2.test.dataone.org/knb/d1/mn/v2/object?identifier=P1_20171222395529 [org.dataone.client.rest.RestClient]
20170503-06:10:16: [INFO]: RestClient.doRequestNoBody, thread(1) call Info: GET https://mn-stage-ucsb-2.test.dataone.org/knb/d1/mn/v2/object?identifier=S1_20171222395531 [org.dataone.client.rest.RestClient]
20170503-06:10:16: [INFO]: created client for certificate file: cnStageUNM1 with subject: CN=urn:node:cnStageUNM1,DC=dataone,DC=org [org.dataone.integration.ContextAwareTestCaseDataone]
20170503-06:10:16: [INFO]: CREATING test object... pid: P1_2017122231016622 with a sid: S1_2017122231016625 obsoletes: null obsoletedBy: null [org.dataone.integration.ContextAwareTestCaseDataone]
20170503-06:10:16: [INFO]: created client for certificate file: testRightsHolder with subject: CN=testRightsHolder,DC=dataone,DC=org [org.dataone.integration.ContextAwareTestCaseDataone]
20170503-06:10:16: [INFO]: certificate directory: /etc/dataone/client/testClientCerts/ [org.dataone.integration.ContextAwareTestCaseDataone]
20170503-06:10:16: [INFO]: certificate filename: cnStageUNM1 [org.dataone.integration.ContextAwareTestCaseDataone]
20170503-06:10:16: [WARN]: registering ConnectionManager... [org.dataone.client.utils.HttpConnectionMonitorService]
20170503-06:10:16: [INFO]: client setup as Subject: CN=urn:node:cnStageUNM1,DC=dataone,DC=org [org.dataone.integration.ContextAwareTestCaseDataone]
20170503-06:10:16: [WARN]: Unable to find a valid authoritative MN to use for the object: P1_2017122231016622 [org.dataone.integration.ContextAwareTestCaseDataone]
20170503-06:10:16: [INFO]: creating a test object.  pid = P1_2017122231016622 on https://mn-demo-11.test.dataone.org/knb/d1/mn/v2 [org.dataone.integration.ContextAwareTestCaseDataone]
20170503-06:10:16: [INFO]: SystemMetadata for pid: P1_2017122231016622
<?xml version="1.0" encoding="UTF-8" standalone="yes"?>
<ns3:systemMetadata xmlns:ns2="http://ns.dataone.org/service/types/v1" xmlns:ns3="http://ns.dataone.org/service/types/v2.0">
    <serialVersion>1</serialVersion>
    <identifier>P1_2017122231016622</identifier>
    <formatId>eml://ecoinformatics.org/eml-2.0.1</formatId>
    <size>17181</size>
    <checksum algorithm="MD5">03ce09c6b4c3efc1681f3023402998a2</checksum>
    <submitter>CN=urn:node:cnStageUNM1,DC=dataone,DC=org</submitter>
    <rightsHolder>CN=testRightsHolder,DC=dataone,DC=org</rightsHolder>
    <accessPolicy>
        <allow>
            <subject>public</subject>
            <permission>read</permission>
        </allow>
    </accessPolicy>
    <dateUploaded>2017-05-03T06:10:16.638+00:00</dateUploaded>
    <dateSysMetadataModified>2017-05-03T06:10:16.638+00:00</dateSysMetadataModified>
    <originMemberNode>bogusAuthoritativeNode</originMemberNode>
    <authoritativeMemberNode>bogusAuthoritativeNode</authoritativeMemberNode>
    <seriesId>S1_2017122231016625</seriesId>
</ns3:systemMetadata>
 [org.dataone.integration.ContextAwareTestCaseDataone]
20170503-06:10:17: [INFO]: RestClient.doRequestMMPBody, thread(1) call Info: POST https://mn-demo-11.test.dataone.org/knb/d1/mn/v2/object; MMP message has: ParamPart:pid = P1_2017122231016622; FilePart:object = /tmp/mmp.output.8181975811120371946.tmp (17181 bytes); FilePart:sysmeta = /tmp/mmp.output.5924791557872689081.tmp (1073 bytes);  [org.dataone.client.rest.RestClient]
20170503-06:10:17: [INFO]: object created.  pid = P1_2017122231016622 [org.dataone.integration.ContextAwareTestCaseDataone]
20170503-06:10:17: [WARN]: registering ConnectionManager... [org.dataone.client.utils.HttpConnectionMonitorService]
20170503-06:10:27: [INFO]: Created SID (S1_2017122231016625) and head PID (P1_2017122231016622) pair. [org.dataone.integration.ContextAwareTestCaseDataone]
20170503-06:10:38: [INFO]: RestClient.doRequestNoBody, thread(1) call Info: GET https://mn-demo-11.test.dataone.org/knb/d1/mn/v2/object?identifier=P1_2017122231016622 [org.dataone.client.rest.RestClient]
20170503-06:10:38: [INFO]: RestClient.doRequestNoBody, thread(1) call Info: GET https://mn-demo-11.test.dataone.org/knb/d1/mn/v2/object?identifier=S1_2017122231016625 [org.dataone.client.rest.RestClient]
20170503-06:10:38: [INFO]: created client for certificate file: cnStageUNM1 with subject: CN=urn:node:cnStageUNM1,DC=dataone,DC=org [org.dataone.integration.ContextAwareTestCaseDataone]
20170503-06:10:38: [INFO]: CREATING test object... pid: P1_2017122231038309 with a sid: S1_2017122231038311 obsoletes: null obsoletedBy: null [org.dataone.integration.ContextAwareTestCaseDataone]
20170503-06:10:38: [INFO]: created client for certificate file: testRightsHolder with subject: CN=testRightsHolder,DC=dataone,DC=org [org.dataone.integration.ContextAwareTestCaseDataone]
20170503-06:10:38: [INFO]: certificate directory: /etc/dataone/client/testClientCerts/ [org.dataone.integration.ContextAwareTestCaseDataone]
20170503-06:10:38: [INFO]: certificate filename: cnStageUNM1 [org.dataone.integration.ContextAwareTestCaseDataone]
20170503-06:10:38: [WARN]: registering ConnectionManager... [org.dataone.client.utils.HttpConnectionMonitorService]
20170503-06:10:38: [INFO]: client setup as Subject: CN=urn:node:cnStageUNM1,DC=dataone,DC=org [org.dataone.integration.ContextAwareTestCaseDataone]
20170503-06:10:38: [WARN]: Unable to find a valid authoritative MN to use for the object: P1_2017122231038309 [org.dataone.integration.ContextAwareTestCaseDataone]
20170503-06:10:38: [INFO]: creating a test object.  pid = P1_2017122231038309 on https://gmn-s.lternet.edu/mn/v2 [org.dataone.integration.ContextAwareTestCaseDataone]
20170503-06:10:38: [INFO]: SystemMetadata for pid: P1_2017122231038309
<?xml version="1.0" encoding="UTF-8" standalone="yes"?>
<ns3:systemMetadata xmlns:ns2="http://ns.dataone.org/service/types/v1" xmlns:ns3="http://ns.dataone.org/service/types/v2.0">
    <serialVersion>1</serialVersion>
    <identifier>P1_2017122231038309</identifier>
    <formatId>eml://ecoinformatics.org/eml-2.0.1</formatId>
    <size>17181</size>
    <checksum algorithm="MD5">03ce09c6b4c3efc1681f3023402998a2</checksum>
    <submitter>CN=urn:node:cnStageUNM1,DC=dataone,DC=org</submitter>
    <rightsHolder>CN=testRightsHolder,DC=dataone,DC=org</rightsHolder>
    <accessPolicy>
        <allow>
            <subject>public</subject>
            <permission>read</permission>
        </allow>
    </accessPolicy>
    <dateUploaded>2017-05-03T06:10:38.321+00:00</dateUploaded>
    <dateSysMetadataModified>2017-05-03T06:10:38.321+00:00</dateSysMetadataModified>
    <originMemberNode>bogusAuthoritativeNode</originMemberNode>
    <authoritativeMemberNode>bogusAuthoritativeNode</authoritativeMemberNode>
    <seriesId>S1_2017122231038311</seriesId>
</ns3:systemMetadata>
 [org.dataone.integration.ContextAwareTestCaseDataone]
20170503-06:10:38: [INFO]: RestClient.doRequestMMPBody, thread(1) call Info: POST https://gmn-s.lternet.edu/mn/v2/object; MMP message has: ParamPart:pid = P1_2017122231038309; FilePart:object = /tmp/mmp.output.7769824510431684576.tmp (17181 bytes); FilePart:sysmeta = /tmp/mmp.output.8943066640344308128.tmp (1073 bytes);  [org.dataone.client.rest.RestClient]
20170503-06:10:38: [INFO]: object created.  pid = P1_2017122231038309 [org.dataone.integration.ContextAwareTestCaseDataone]
20170503-06:10:38: [WARN]: registering ConnectionManager... [org.dataone.client.utils.HttpConnectionMonitorService]
20170503-06:10:48: [INFO]: Created SID (S1_2017122231038311) and head PID (P1_2017122231038309) pair. [org.dataone.integration.ContextAwareTestCaseDataone]
20170503-06:11:01: [INFO]: RestClient.doRequestNoBody, thread(1) call Info: GET https://gmn-s.lternet.edu/mn/v2/object?identifier=P1_2017122231038309 [org.dataone.client.rest.RestClient]
20170503-06:11:05: [INFO]: RestClient.doRequestNoBody, thread(1) call Info: GET https://gmn-s.lternet.edu/mn/v2/object?identifier=S1_2017122231038311 [org.dataone.client.rest.RestClient]
20170503-06:11:05: [INFO]: **************************************************** [org.dataone.integration.ContextAwareTestCaseDataone]
20170503-06:11:05: [INFO]: ***  context label:   STAGE [org.dataone.integration.ContextAwareTestCaseDataone]
20170503-06:11:05: [INFO]: **************************************************** [org.dataone.integration.ContextAwareTestCaseDataone]
20170503-06:11:05: [INFO]: **************************************************** [org.dataone.integration.ContextAwareTestCaseDataone]
                          nodeId  key                       value
=============================================================================================================
20170503-06:11:05: [INFO]: Testing isAuthorized() method ...  [org.dataone.integration.ContextAwareTestCaseDataone]
20170503-06:11:05: [INFO]: Testing isAuthorized(), Case1 [org.dataone.integration.ContextAwareTestCaseDataone]
20170503-06:11:05: [INFO]: created client for certificate file: cnStageUNM1 with subject: CN=urn:node:cnStageUNM1,DC=dataone,DC=org [org.dataone.integration.ContextAwareTestCaseDataone]
20170503-06:11:05: [INFO]: RestClient.doRequestNoBody, thread(1) call Info: GET https://mn-stage-ucsb-2.test.dataone.org/knb/d1/mn/v2/monitor/ping [org.dataone.client.rest.RestClient]
20170503-06:11:05: [INFO]: MN included in test: https://mn-stage-ucsb-2.test.dataone.org/knb/d1/mn [org.dataone.integration.ContextAwareTestCaseDataone]
20170503-06:11:05: [INFO]: created client for certificate file: cnStageUNM1 with subject: CN=urn:node:cnStageUNM1,DC=dataone,DC=org [org.dataone.integration.ContextAwareTestCaseDataone]
20170503-06:11:06: [INFO]: RestClient.doRequestNoBody, thread(1) call Info: GET http://seadva-test.d2i.indiana.edu/sead/rest/mn/v2/monitor/ping [org.dataone.client.rest.RestClient]
20170503-06:11:06: [INFO]: MN excluded from test: http://seadva-test.d2i.indiana.edu/sead/rest/mn [org.dataone.integration.ContextAwareTestCaseDataone]
20170503-06:11:06: [INFO]: created client for certificate file: cnStageUNM1 with subject: CN=urn:node:cnStageUNM1,DC=dataone,DC=org [org.dataone.integration.ContextAwareTestCaseDataone]
20170503-06:11:06: [INFO]: RestClient.doRequestNoBody, thread(1) call Info: GET https://mn-demo-11.test.dataone.org/knb/d1/mn/v2/monitor/ping [org.dataone.client.rest.RestClient]
20170503-06:11:06: [INFO]: MN included in test: https://mn-demo-11.test.dataone.org/knb/d1/mn [org.dataone.integration.ContextAwareTestCaseDataone]
20170503-06:11:06: [INFO]: created client for certificate file: cnStageUNM1 with subject: CN=urn:node:cnStageUNM1,DC=dataone,DC=org [org.dataone.integration.ContextAwareTestCaseDataone]
20170503-06:11:06: [INFO]: RestClient.doRequestNoBody, thread(1) call Info: GET https://gmn-s.lternet.edu/mn/v2/monitor/ping [org.dataone.client.rest.RestClient]
20170503-06:11:06: [INFO]: MN included in test: https://gmn-s.lternet.edu/mn [org.dataone.integration.ContextAwareTestCaseDataone]
20170503-06:11:06: [INFO]: created client for certificate file: cnStageUNM1 with subject: CN=urn:node:cnStageUNM1,DC=dataone,DC=org [org.dataone.integration.ContextAwareTestCaseDataone]
20170503-06:11:07: [INFO]: RestClient.doRequestNoBody, thread(1) call Info: GET https://dataone-dev.ecoinformatics.org.au/mn/v2/monitor/ping [org.dataone.client.rest.RestClient]
20170503-06:11:07: [INFO]: MN excluded from test: https://dataone-dev.ecoinformatics.org.au/mn [org.dataone.integration.ContextAwareTestCaseDataone]
20170503-06:11:07: [INFO]: created client for certificate file: cnStageUNM1 with subject: CN=urn:node:cnStageUNM1,DC=dataone,DC=org [org.dataone.integration.ContextAwareTestCaseDataone]
20170503-06:11:07: [INFO]: RestClient.doRequestNoBody, thread(1) call Info: GET http://dataone.neonscience.org/metacat/d1/mn/v2/monitor/ping [org.dataone.client.rest.RestClient]
20170503-06:11:07: [INFO]: MN included in test: http://dataone.neonscience.org/metacat/d1/mn [org.dataone.integration.ContextAwareTestCaseDataone]
20170503-06:11:07: [INFO]: created client for certificate file: cnStageUNM1 with subject: CN=urn:node:cnStageUNM1,DC=dataone,DC=org [org.dataone.integration.ContextAwareTestCaseDataone]
20170503-06:11:08: [INFO]: RestClient.doRequestNoBody, thread(1) call Info: GET https://test.arcticdata.io/metacat/d1/mn/v2/monitor/ping [org.dataone.client.rest.RestClient]
20170503-06:11:08: [INFO]: MN included in test: https://test.arcticdata.io/metacat/d1/mn [org.dataone.integration.ContextAwareTestCaseDataone]
20170503-06:11:08: [INFO]: created client for certificate file: cnStageUNM1 with subject: CN=urn:node:cnStageUNM1,DC=dataone,DC=org [org.dataone.integration.ContextAwareTestCaseDataone]
20170503-06:11:08: [INFO]: RestClient.doRequestNoBody, thread(1) call Info: GET http://dataone.ornith.cornell.edu/metacat/d1/mn/v2/monitor/ping [org.dataone.client.rest.RestClient]
20170503-06:11:08: [INFO]: MN included in test: http://dataone.ornith.cornell.edu/metacat/d1/mn [org.dataone.integration.ContextAwareTestCaseDataone]
20170503-06:11:08: [INFO]: created client for certificate file: cnStageUNM1 with subject: CN=urn:node:cnStageUNM1,DC=dataone,DC=org [org.dataone.integration.ContextAwareTestCaseDataone]
20170503-06:11:08: [INFO]: RestClient.doRequestNoBody, thread(1) call Info: GET https://dataone-test.researchworkspace.com/mn/v2/monitor/ping [org.dataone.client.rest.RestClient]
20170503-06:11:08: [INFO]: MN included in test: https://dataone-test.researchworkspace.com/mn [org.dataone.integration.ContextAwareTestCaseDataone]
20170503-06:11:08: [INFO]: created client for certificate file: cnStageUNM1 with subject: CN=urn:node:cnStageUNM1,DC=dataone,DC=org [org.dataone.integration.ContextAwareTestCaseDataone]
20170503-06:11:09: [INFO]: RestClient.doRequestNoBody, thread(1) call Info: GET https://dataone.lib.uic.edu/metacat/d1/mn/v2/monitor/ping [org.dataone.client.rest.RestClient]
20170503-06:11:09: [INFO]: MN excluded from test: https://dataone.lib.uic.edu/metacat/d1/mn [org.dataone.integration.ContextAwareTestCaseDataone]
20170503-06:11:09: [INFO]: created client for certificate file: cnStageUNM1 with subject: CN=urn:node:cnStageUNM1,DC=dataone,DC=org [org.dataone.integration.ContextAwareTestCaseDataone]
20170503-06:11:09: [INFO]: RestClient.doRequestNoBody, thread(1) call Info: GET https://gmn-s.edirepository.org/mn/v2/monitor/ping [org.dataone.client.rest.RestClient]
20170503-06:11:09: [INFO]: MN included in test: https://gmn-s.edirepository.org/mn [org.dataone.integration.ContextAwareTestCaseDataone]
20170503-06:11:09: [INFO]: created client for certificate file: cnStageUNM1 with subject: CN=urn:node:cnStageUNM1,DC=dataone,DC=org [org.dataone.integration.ContextAwareTestCaseDataone]
20170503-06:11:09: [INFO]: RestClient.doRequestNoBody, thread(1) call Info: GET https://ncei.nceas.ucsb.edu/mn/v2/monitor/ping [org.dataone.client.rest.RestClient]
20170503-06:11:09: [INFO]: MN included in test: https://ncei.nceas.ucsb.edu/mn [org.dataone.integration.ContextAwareTestCaseDataone]
20170503-06:11:09: [INFO]: created client for certificate file: cnStageUNM1 with subject: CN=urn:node:cnStageUNM1,DC=dataone,DC=org [org.dataone.integration.ContextAwareTestCaseDataone]
20170503-06:11:09: [INFO]: CREATING test object... pid: P1_201712223119953 with a sid: S1_201712223119956 obsoletes: null obsoletedBy: null [org.dataone.integration.ContextAwareTestCaseDataone]
20170503-06:11:09: [INFO]: created client for certificate file: testRightsHolder with subject: CN=testRightsHolder,DC=dataone,DC=org [org.dataone.integration.ContextAwareTestCaseDataone]
20170503-06:11:09: [INFO]: certificate directory: /etc/dataone/client/testClientCerts/ [org.dataone.integration.ContextAwareTestCaseDataone]
20170503-06:11:09: [INFO]: certificate filename: cnStageUNM1 [org.dataone.integration.ContextAwareTestCaseDataone]
20170503-06:11:09: [WARN]: registering ConnectionManager... [org.dataone.client.utils.HttpConnectionMonitorService]
20170503-06:11:09: [INFO]: client setup as Subject: CN=urn:node:cnStageUNM1,DC=dataone,DC=org [org.dataone.integration.ContextAwareTestCaseDataone]
20170503-06:11:09: [WARN]: Unable to find a valid authoritative MN to use for the object: P1_201712223119953 [org.dataone.integration.ContextAwareTestCaseDataone]
20170503-06:11:09: [INFO]: creating a test object.  pid = P1_201712223119953 on https://mn-stage-ucsb-2.test.dataone.org/knb/d1/mn/v2 [org.dataone.integration.ContextAwareTestCaseDataone]
20170503-06:11:09: [INFO]: SystemMetadata for pid: P1_201712223119953
<?xml version="1.0" encoding="UTF-8" standalone="yes"?>
<ns3:systemMetadata xmlns:ns2="http://ns.dataone.org/service/types/v1" xmlns:ns3="http://ns.dataone.org/service/types/v2.0">
    <serialVersion>1</serialVersion>
    <identifier>P1_201712223119953</identifier>
    <formatId>eml://ecoinformatics.org/eml-2.0.1</formatId>
    <size>17181</size>
    <checksum algorithm="MD5">03ce09c6b4c3efc1681f3023402998a2</checksum>
    <submitter>CN=urn:node:cnStageUNM1,DC=dataone,DC=org</submitter>
    <rightsHolder>CN=testRightsHolder,DC=dataone,DC=org</rightsHolder>
    <accessPolicy>
        <allow>
            <subject>public</subject>
            <permission>read</permission>
        </allow>
    </accessPolicy>
    <dateUploaded>2017-05-03T06:11:09.969+00:00</dateUploaded>
    <dateSysMetadataModified>2017-05-03T06:11:09.969+00:00</dateSysMetadataModified>
    <originMemberNode>bogusAuthoritativeNode</originMemberNode>
    <authoritativeMemberNode>bogusAuthoritativeNode</authoritativeMemberNode>
    <seriesId>S1_201712223119956</seriesId>
</ns3:systemMetadata>
 [org.dataone.integration.ContextAwareTestCaseDataone]
20170503-06:11:10: [INFO]: RestClient.doRequestMMPBody, thread(1) call Info: POST https://mn-stage-ucsb-2.test.dataone.org/knb/d1/mn/v2/object; MMP message has: ParamPart:pid = P1_201712223119953; FilePart:object = /tmp/mmp.output.8233436807680020281.tmp (17181 bytes); FilePart:sysmeta = /tmp/mmp.output.1626632803531470669.tmp (1071 bytes);  [org.dataone.client.rest.RestClient]
20170503-06:11:10: [INFO]: object created.  pid = P1_201712223119953 [org.dataone.integration.ContextAwareTestCaseDataone]
20170503-06:11:10: [WARN]: registering ConnectionManager... [org.dataone.client.utils.HttpConnectionMonitorService]
20170503-06:11:20: [INFO]: Created SID (S1_201712223119956) and head PID (P1_201712223119953) pair. [org.dataone.integration.ContextAwareTestCaseDataone]
20170503-06:11:21: [INFO]: RestClient.doRequestNoBody, thread(1) call Info: GET https://mn-stage-ucsb-2.test.dataone.org/knb/d1/mn/v2/isAuthorized/S1_201712223119956?action=read [org.dataone.client.rest.RestClient]
20170503-06:11:21: [INFO]: RestClient.doRequestNoBody, thread(1) call Info: GET https://mn-stage-ucsb-2.test.dataone.org/knb/d1/mn/v2/isAuthorized/P1_201712223119953?action=read [org.dataone.client.rest.RestClient]
20170503-06:11:21: [INFO]: RestClient.doRequestNoBody, thread(1) call Info: GET https://mn-stage-ucsb-2.test.dataone.org/knb/d1/mn/v2/isAuthorized/S1_201712223119956?action=write [org.dataone.client.rest.RestClient]
20170503-06:11:21: [INFO]: RestClient.doRequestNoBody, thread(1) call Info: GET https://mn-stage-ucsb-2.test.dataone.org/knb/d1/mn/v2/isAuthorized/P1_201712223119953?action=write [org.dataone.client.rest.RestClient]
20170503-06:11:21: [INFO]: RestClient.doRequestNoBody, thread(1) call Info: GET https://mn-stage-ucsb-2.test.dataone.org/knb/d1/mn/v2/isAuthorized/S1_201712223119956?action=changePermission [org.dataone.client.rest.RestClient]
20170503-06:11:21: [INFO]: RestClient.doRequestNoBody, thread(1) call Info: GET https://mn-stage-ucsb-2.test.dataone.org/knb/d1/mn/v2/isAuthorized/P1_201712223119953?action=changePermission [org.dataone.client.rest.RestClient]
20170503-06:11:21: [INFO]: created client for certificate file: cnStageUNM1 with subject: CN=urn:node:cnStageUNM1,DC=dataone,DC=org [org.dataone.integration.ContextAwareTestCaseDataone]
20170503-06:11:21: [INFO]: CREATING test object... pid: P1_2017122231121761 with a sid: S1_2017122231121763 obsoletes: null obsoletedBy: null [org.dataone.integration.ContextAwareTestCaseDataone]
20170503-06:11:21: [INFO]: created client for certificate file: testRightsHolder with subject: CN=testRightsHolder,DC=dataone,DC=org [org.dataone.integration.ContextAwareTestCaseDataone]
20170503-06:11:21: [INFO]: certificate directory: /etc/dataone/client/testClientCerts/ [org.dataone.integration.ContextAwareTestCaseDataone]
20170503-06:11:21: [INFO]: certificate filename: cnStageUNM1 [org.dataone.integration.ContextAwareTestCaseDataone]
20170503-06:11:21: [WARN]: registering ConnectionManager... [org.dataone.client.utils.HttpConnectionMonitorService]
20170503-06:11:21: [INFO]: client setup as Subject: CN=urn:node:cnStageUNM1,DC=dataone,DC=org [org.dataone.integration.ContextAwareTestCaseDataone]
20170503-06:11:21: [WARN]: Unable to find a valid authoritative MN to use for the object: P1_2017122231121761 [org.dataone.integration.ContextAwareTestCaseDataone]
20170503-06:11:21: [INFO]: creating a test object.  pid = P1_2017122231121761 on https://mn-demo-11.test.dataone.org/knb/d1/mn/v2 [org.dataone.integration.ContextAwareTestCaseDataone]
20170503-06:11:21: [INFO]: SystemMetadata for pid: P1_2017122231121761
<?xml version="1.0" encoding="UTF-8" standalone="yes"?>
<ns3:systemMetadata xmlns:ns2="http://ns.dataone.org/service/types/v1" xmlns:ns3="http://ns.dataone.org/service/types/v2.0">
    <serialVersion>1</serialVersion>
    <identifier>P1_2017122231121761</identifier>
    <formatId>eml://ecoinformatics.org/eml-2.0.1</formatId>
    <size>17181</size>
    <checksum algorithm="MD5">03ce09c6b4c3efc1681f3023402998a2</checksum>
    <submitter>CN=urn:node:cnStageUNM1,DC=dataone,DC=org</submitter>
    <rightsHolder>CN=testRightsHolder,DC=dataone,DC=org</rightsHolder>
    <accessPolicy>
        <allow>
            <subject>public</subject>
            <permission>read</permission>
        </allow>
    </accessPolicy>
    <dateUploaded>2017-05-03T06:11:21.773+00:00</dateUploaded>
    <dateSysMetadataModified>2017-05-03T06:11:21.773+00:00</dateSysMetadataModified>
    <originMemberNode>bogusAuthoritativeNode</originMemberNode>
    <authoritativeMemberNode>bogusAuthoritativeNode</authoritativeMemberNode>
    <seriesId>S1_2017122231121763</seriesId>
</ns3:systemMetadata>
 [org.dataone.integration.ContextAwareTestCaseDataone]
20170503-06:11:22: [INFO]: RestClient.doRequestMMPBody, thread(1) call Info: POST https://mn-demo-11.test.dataone.org/knb/d1/mn/v2/object; MMP message has: ParamPart:pid = P1_2017122231121761; FilePart:object = /tmp/mmp.output.106268400278810475.tmp (17181 bytes); FilePart:sysmeta = /tmp/mmp.output.7266983223704110951.tmp (1073 bytes);  [org.dataone.client.rest.RestClient]
20170503-06:11:22: [INFO]: object created.  pid = P1_2017122231121761 [org.dataone.integration.ContextAwareTestCaseDataone]
20170503-06:11:22: [WARN]: registering ConnectionManager... [org.dataone.client.utils.HttpConnectionMonitorService]
20170503-06:11:32: [INFO]: Created SID (S1_2017122231121763) and head PID (P1_2017122231121761) pair. [org.dataone.integration.ContextAwareTestCaseDataone]
20170503-06:11:33: [INFO]: RestClient.doRequestNoBody, thread(1) call Info: GET https://mn-demo-11.test.dataone.org/knb/d1/mn/v2/isAuthorized/S1_2017122231121763?action=read [org.dataone.client.rest.RestClient]
20170503-06:11:33: [INFO]: RestClient.doRequestNoBody, thread(1) call Info: GET https://mn-demo-11.test.dataone.org/knb/d1/mn/v2/isAuthorized/P1_2017122231121761?action=read [org.dataone.client.rest.RestClient]
20170503-06:11:33: [INFO]: RestClient.doRequestNoBody, thread(1) call Info: GET https://mn-demo-11.test.dataone.org/knb/d1/mn/v2/isAuthorized/S1_2017122231121763?action=write [org.dataone.client.rest.RestClient]
20170503-06:11:33: [INFO]: RestClient.doRequestNoBody, thread(1) call Info: GET https://mn-demo-11.test.dataone.org/knb/d1/mn/v2/isAuthorized/P1_2017122231121761?action=write [org.dataone.client.rest.RestClient]
20170503-06:11:33: [INFO]: RestClient.doRequestNoBody, thread(1) call Info: GET https://mn-demo-11.test.dataone.org/knb/d1/mn/v2/isAuthorized/S1_2017122231121763?action=changePermission [org.dataone.client.rest.RestClient]
20170503-06:11:34: [INFO]: RestClient.doRequestNoBody, thread(1) call Info: GET https://mn-demo-11.test.dataone.org/knb/d1/mn/v2/isAuthorized/P1_2017122231121761?action=changePermission [org.dataone.client.rest.RestClient]
20170503-06:11:34: [INFO]: created client for certificate file: cnStageUNM1 with subject: CN=urn:node:cnStageUNM1,DC=dataone,DC=org [org.dataone.integration.ContextAwareTestCaseDataone]
20170503-06:11:34: [INFO]: CREATING test object... pid: P1_2017122231134178 with a sid: S1_2017122231134180 obsoletes: null obsoletedBy: null [org.dataone.integration.ContextAwareTestCaseDataone]
20170503-06:11:34: [INFO]: created client for certificate file: testRightsHolder with subject: CN=testRightsHolder,DC=dataone,DC=org [org.dataone.integration.ContextAwareTestCaseDataone]
20170503-06:11:34: [INFO]: certificate directory: /etc/dataone/client/testClientCerts/ [org.dataone.integration.ContextAwareTestCaseDataone]
20170503-06:11:34: [INFO]: certificate filename: cnStageUNM1 [org.dataone.integration.ContextAwareTestCaseDataone]
20170503-06:11:34: [WARN]: registering ConnectionManager... [org.dataone.client.utils.HttpConnectionMonitorService]
20170503-06:11:34: [INFO]: client setup as Subject: CN=urn:node:cnStageUNM1,DC=dataone,DC=org [org.dataone.integration.ContextAwareTestCaseDataone]
20170503-06:11:34: [WARN]: Unable to find a valid authoritative MN to use for the object: P1_2017122231134178 [org.dataone.integration.ContextAwareTestCaseDataone]
20170503-06:11:34: [INFO]: creating a test object.  pid = P1_2017122231134178 on https://gmn-s.lternet.edu/mn/v2 [org.dataone.integration.ContextAwareTestCaseDataone]
20170503-06:11:34: [INFO]: SystemMetadata for pid: P1_2017122231134178
<?xml version="1.0" encoding="UTF-8" standalone="yes"?>
<ns3:systemMetadata xmlns:ns2="http://ns.dataone.org/service/types/v1" xmlns:ns3="http://ns.dataone.org/service/types/v2.0">
    <serialVersion>1</serialVersion>
    <identifier>P1_2017122231134178</identifier>
    <formatId>eml://ecoinformatics.org/eml-2.0.1</formatId>
    <size>17181</size>
    <checksum algorithm="MD5">03ce09c6b4c3efc1681f3023402998a2</checksum>
    <submitter>CN=urn:node:cnStageUNM1,DC=dataone,DC=org</submitter>
    <rightsHolder>CN=testRightsHolder,DC=dataone,DC=org</rightsHolder>
    <accessPolicy>
        <allow>
            <subject>public</subject>
            <permission>read</permission>
        </allow>
    </accessPolicy>
    <dateUploaded>2017-05-03T06:11:34.190+00:00</dateUploaded>
    <dateSysMetadataModified>2017-05-03T06:11:34.190+00:00</dateSysMetadataModified>
    <originMemberNode>bogusAuthoritativeNode</originMemberNode>
    <authoritativeMemberNode>bogusAuthoritativeNode</authoritativeMemberNode>
    <seriesId>S1_2017122231134180</seriesId>
</ns3:systemMetadata>
 [org.dataone.integration.ContextAwareTestCaseDataone]
20170503-06:11:34: [INFO]: RestClient.doRequestMMPBody, thread(1) call Info: POST https://gmn-s.lternet.edu/mn/v2/object; MMP message has: ParamPart:pid = P1_2017122231134178; FilePart:object = /tmp/mmp.output.485843169557940998.tmp (17181 bytes); FilePart:sysmeta = /tmp/mmp.output.7336838479239424258.tmp (1073 bytes);  [org.dataone.client.rest.RestClient]
20170503-06:11:34: [INFO]: object created.  pid = P1_2017122231134178 [org.dataone.integration.ContextAwareTestCaseDataone]
20170503-06:11:34: [WARN]: registering ConnectionManager... [org.dataone.client.utils.HttpConnectionMonitorService]
20170503-06:11:44: [INFO]: Created SID (S1_2017122231134180) and head PID (P1_2017122231134178) pair. [org.dataone.integration.ContextAwareTestCaseDataone]
20170503-06:11:44: [INFO]: RestClient.doRequestNoBody, thread(1) call Info: GET https://gmn-s.lternet.edu/mn/v2/isAuthorized/S1_2017122231134180?action=read [org.dataone.client.rest.RestClient]
20170503-06:11:44: [INFO]: RestClient.doRequestNoBody, thread(1) call Info: GET https://gmn-s.lternet.edu/mn/v2/isAuthorized/P1_2017122231134178?action=read [org.dataone.client.rest.RestClient]
20170503-06:11:44: [INFO]: RestClient.doRequestNoBody, thread(1) call Info: GET https://gmn-s.lternet.edu/mn/v2/isAuthorized/S1_2017122231134180?action=write [org.dataone.client.rest.RestClient]
20170503-06:11:44: [INFO]: RestClient.doRequestNoBody, thread(1) call Info: GET https://gmn-s.lternet.edu/mn/v2/isAuthorized/P1_2017122231134178?action=write [org.dataone.client.rest.RestClient]
20170503-06:11:44: [INFO]: RestClient.doRequestNoBody, thread(1) call Info: GET https://gmn-s.lternet.edu/mn/v2/isAuthorized/S1_2017122231134180?action=changePermission [org.dataone.client.rest.RestClient]
20170503-06:11:44: [INFO]: RestClient.doRequestNoBody, thread(1) call Info: GET https://gmn-s.lternet.edu/mn/v2/isAuthorized/P1_2017122231134178?action=changePermission [org.dataone.client.rest.RestClient]
20170503-06:11:44: [INFO]: created client for certificate file: cnStageUNM1 with subject: CN=urn:node:cnStageUNM1,DC=dataone,DC=org [org.dataone.integration.ContextAwareTestCaseDataone]
20170503-06:11:44: [INFO]: CREATING test object... pid: P1_2017122231144671 with a sid: S1_2017122231144673 obsoletes: null obsoletedBy: null [org.dataone.integration.ContextAwareTestCaseDataone]
20170503-06:11:44: [INFO]: created client for certificate file: testRightsHolder with subject: CN=testRightsHolder,DC=dataone,DC=org [org.dataone.integration.ContextAwareTestCaseDataone]
20170503-06:11:44: [INFO]: certificate directory: /etc/dataone/client/testClientCerts/ [org.dataone.integration.ContextAwareTestCaseDataone]
20170503-06:11:44: [INFO]: certificate filename: cnStageUNM1 [org.dataone.integration.ContextAwareTestCaseDataone]
20170503-06:11:44: [WARN]: registering ConnectionManager... [org.dataone.client.utils.HttpConnectionMonitorService]
20170503-06:11:44: [INFO]: client setup as Subject: CN=urn:node:cnStageUNM1,DC=dataone,DC=org [org.dataone.integration.ContextAwareTestCaseDataone]
20170503-06:11:44: [WARN]: Unable to find a valid authoritative MN to use for the object: P1_2017122231144671 [org.dataone.integration.ContextAwareTestCaseDataone]
20170503-06:11:44: [INFO]: creating a test object.  pid = P1_2017122231144671 on http://dataone.neonscience.org/metacat/d1/mn/v2 [org.dataone.integration.ContextAwareTestCaseDataone]
20170503-06:11:44: [INFO]: SystemMetadata for pid: P1_2017122231144671
<?xml version="1.0" encoding="UTF-8" standalone="yes"?>
<ns3:systemMetadata xmlns:ns2="http://ns.dataone.org/service/types/v1" xmlns:ns3="http://ns.dataone.org/service/types/v2.0">
    <serialVersion>1</serialVersion>
    <identifier>P1_2017122231144671</identifier>
    <formatId>eml://ecoinformatics.org/eml-2.0.1</formatId>
    <size>17181</size>
    <checksum algorithm="MD5">03ce09c6b4c3efc1681f3023402998a2</checksum>
    <submitter>CN=urn:node:cnStageUNM1,DC=dataone,DC=org</submitter>
    <rightsHolder>CN=testRightsHolder,DC=dataone,DC=org</rightsHolder>
    <accessPolicy>
        <allow>
            <subject>public</subject>
            <permission>read</permission>
        </allow>
    </accessPolicy>
    <dateUploaded>2017-05-03T06:11:44.684+00:00</dateUploaded>
    <dateSysMetadataModified>2017-05-03T06:11:44.685+00:00</dateSysMetadataModified>
    <originMemberNode>bogusAuthoritativeNode</originMemberNode>
    <authoritativeMemberNode>bogusAuthoritativeNode</authoritativeMemberNode>
    <seriesId>S1_2017122231144673</seriesId>
</ns3:systemMetadata>
 [org.dataone.integration.ContextAwareTestCaseDataone]
20170503-06:11:45: [INFO]: RestClient.doRequestMMPBody, thread(1) call Info: POST http://dataone.neonscience.org/metacat/d1/mn/v2/object; MMP message has: ParamPart:pid = P1_2017122231144671; FilePart:object = /tmp/mmp.output.6721365136636452468.tmp (17181 bytes); FilePart:sysmeta = /tmp/mmp.output.2090786561757024639.tmp (1073 bytes);  [org.dataone.client.rest.RestClient]
20170503-06:11:45: [WARN]: registering ConnectionManager... [org.dataone.client.utils.HttpConnectionMonitorService]
java.lang.reflect.InvocationTargetException
	at sun.reflect.GeneratedMethodAccessor48.invoke(Unknown Source)
	at sun.reflect.DelegatingMethodAccessorImpl.invoke(DelegatingMethodAccessorImpl.java:43)
	at java.lang.reflect.Method.invoke(Method.java:606)
	at org.dataone.integration.it.testImplementations.SidCommonTestImplementations.testIsAuthorized(SidCommonTestImplementations.java:628)
	at sun.reflect.NativeMethodAccessorImpl.invoke0(Native Method)
	at sun.reflect.NativeMethodAccessorImpl.invoke(NativeMethodAccessorImpl.java:57)
	at sun.reflect.DelegatingMethodAccessorImpl.invoke(DelegatingMethodAccessorImpl.java:43)
	at java.lang.reflect.Method.invoke(Method.java:606)
	at org.junit.runners.model.FrameworkMethod$1.runReflectiveCall(FrameworkMethod.java:44)
	at org.junit.internal.runners.model.ReflectiveCallable.run(ReflectiveCallable.java:15)
	at org.junit.runners.model.FrameworkMethod.invokeExplosively(FrameworkMethod.java:41)
	at org.junit.internal.runners.statements.InvokeMethod.evaluate(InvokeMethod.java:20)
	at org.junit.rules.Verifier$1.evaluate(Verifier.java:34)
	at org.junit.internal.runners.statements.RunBefores.evaluate(RunBefores.java:28)
	at org.junit.runners.BlockJUnit4ClassRunner.runChild(BlockJUnit4ClassRunner.java:76)
	at org.junit.runners.BlockJUnit4ClassRunner.runChild(BlockJUnit4ClassRunner.java:50)
	at org.junit.runners.ParentRunner$3.run(ParentRunner.java:193)
	at org.junit.runners.ParentRunner$1.schedule(ParentRunner.java:52)
	at org.junit.runners.ParentRunner.runChildren(ParentRunner.java:191)
	at org.junit.runners.ParentRunner.access$000(ParentRunner.java:42)
	at org.junit.runners.ParentRunner$2.evaluate(ParentRunner.java:184)
	at org.junit.runners.ParentRunner.run(ParentRunner.java:236)
	at org.apache.maven.surefire.junit4.JUnit4TestSet.execute(JUnit4TestSet.java:53)
	at org.apache.maven.surefire.junit4.JUnit4Provider.executeTestSet(JUnit4Provider.java:119)
	at org.apache.maven.surefire.junit4.JUnit4Provider.invoke(JUnit4Provider.java:101)
	at sun.reflect.NativeMethodAccessorImpl.invoke0(Native Method)
	at sun.reflect.NativeMethodAccessorImpl.invoke(NativeMethodAccessorImpl.java:57)
	at sun.reflect.DelegatingMethodAccessorImpl.invoke(DelegatingMethodAccessorImpl.java:43)
	at java.lang.reflect.Method.invoke(Method.java:606)
	at org.apache.maven.surefire.booter.ProviderFactory$ClassLoaderProxy.invoke(ProviderFactory.java:103)
	at com.sun.proxy.$Proxy0.invoke(Unknown Source)
	at org.apache.maven.surefire.booter.SurefireStarter.invokeProvider(SurefireStarter.java:150)
	at org.apache.maven.surefire.booter.SurefireStarter.runSuitesInProcess(SurefireStarter.java:91)
	at org.apache.maven.surefire.booter.ForkedBooter.main(ForkedBooter.java:69)
Caused by: org.dataone.client.exception.ClientSideException: Unable to create test object!/Session is required to WRITE to the Node.
	at org.dataone.integration.ContextAwareTestCaseDataone.createTestObject(ContextAwareTestCaseDataone.java:1609)
	at org.dataone.integration.ContextAwareTestCaseDataone.createTestObject(ContextAwareTestCaseDataone.java:1441)
	at org.dataone.integration.it.testImplementations.SidCommonTestImplementations.createTestObject(SidCommonTestImplementations.java:209)
	at org.dataone.integration.it.testImplementations.SidMNTestImplementations.setupMNCase1(SidMNTestImplementations.java:92)
	... 34 more
Caused by: org.dataone.service.exceptions.InvalidToken: Session is required to WRITE to the Node.
	at org.dataone.service.util.ExceptionHandler.deserializeXml(ExceptionHandler.java:628)
	at org.dataone.service.util.ExceptionHandler.deserializeXmlAndThrowException(ExceptionHandler.java:517)
	at org.dataone.service.util.ExceptionHandler.deserializeAndThrowException(ExceptionHandler.java:363)
	at org.dataone.service.util.ExceptionHandler.deserializeAndThrowException(ExceptionHandler.java:313)
	at org.dataone.service.util.ExceptionHandler.filterErrors(ExceptionHandler.java:107)
	at org.dataone.service.util.ExceptionHandler.filterErrors(ExceptionHandler.java:82)
	at org.dataone.client.rest.HttpMultipartRestClient.doPostRequest(HttpMultipartRestClient.java:463)
	at org.dataone.client.v2.impl.MultipartMNode.create(MultipartMNode.java:495)
	at org.dataone.integration.adapters.CommonCallAdapter.create(CommonCallAdapter.java:505)
	at org.dataone.integration.ContextAwareTestCaseDataone.createTestObject(ContextAwareTestCaseDataone.java:1600)
	... 37 more
20170503-06:11:45: [INFO]: created client for certificate file: cnStageUNM1 with subject: CN=urn:node:cnStageUNM1,DC=dataone,DC=org [org.dataone.integration.ContextAwareTestCaseDataone]
20170503-06:11:45: [INFO]: CREATING test object... pid: P1_2017122231145111 with a sid: S1_2017122231145113 obsoletes: null obsoletedBy: null [org.dataone.integration.ContextAwareTestCaseDataone]
20170503-06:11:45: [INFO]: created client for certificate file: testRightsHolder with subject: CN=testRightsHolder,DC=dataone,DC=org [org.dataone.integration.ContextAwareTestCaseDataone]
20170503-06:11:45: [INFO]: certificate directory: /etc/dataone/client/testClientCerts/ [org.dataone.integration.ContextAwareTestCaseDataone]
20170503-06:11:45: [INFO]: certificate filename: cnStageUNM1 [org.dataone.integration.ContextAwareTestCaseDataone]
20170503-06:11:45: [WARN]: registering ConnectionManager... [org.dataone.client.utils.HttpConnectionMonitorService]
20170503-06:11:45: [INFO]: client setup as Subject: CN=urn:node:cnStageUNM1,DC=dataone,DC=org [org.dataone.integration.ContextAwareTestCaseDataone]
20170503-06:11:45: [WARN]: Unable to find a valid authoritative MN to use for the object: P1_2017122231145111 [org.dataone.integration.ContextAwareTestCaseDataone]
20170503-06:11:45: [INFO]: creating a test object.  pid = P1_2017122231145111 on https://test.arcticdata.io/metacat/d1/mn/v2 [org.dataone.integration.ContextAwareTestCaseDataone]
20170503-06:11:45: [INFO]: SystemMetadata for pid: P1_2017122231145111
<?xml version="1.0" encoding="UTF-8" standalone="yes"?>
<ns3:systemMetadata xmlns:ns2="http://ns.dataone.org/service/types/v1" xmlns:ns3="http://ns.dataone.org/service/types/v2.0">
    <serialVersion>1</serialVersion>
    <identifier>P1_2017122231145111</identifier>
    <formatId>eml://ecoinformatics.org/eml-2.0.1</formatId>
    <size>17181</size>
    <checksum algorithm="MD5">03ce09c6b4c3efc1681f3023402998a2</checksum>
    <submitter>CN=urn:node:cnStageUNM1,DC=dataone,DC=org</submitter>
    <rightsHolder>CN=testRightsHolder,DC=dataone,DC=org</rightsHolder>
    <accessPolicy>
        <allow>
            <subject>public</subject>
            <permission>read</permission>
        </allow>
    </accessPolicy>
    <dateUploaded>2017-05-03T06:11:45.122+00:00</dateUploaded>
    <dateSysMetadataModified>2017-05-03T06:11:45.122+00:00</dateSysMetadataModified>
    <originMemberNode>bogusAuthoritativeNode</originMemberNode>
    <authoritativeMemberNode>bogusAuthoritativeNode</authoritativeMemberNode>
    <seriesId>S1_2017122231145113</seriesId>
</ns3:systemMetadata>
 [org.dataone.integration.ContextAwareTestCaseDataone]
20170503-06:11:46: [INFO]: RestClient.doRequestMMPBody, thread(1) call Info: POST https://test.arcticdata.io/metacat/d1/mn/v2/object; MMP message has: ParamPart:pid = P1_2017122231145111; FilePart:object = /tmp/mmp.output.6528802887451062101.tmp (17181 bytes); FilePart:sysmeta = /tmp/mmp.output.3314942332042982775.tmp (1073 bytes);  [org.dataone.client.rest.RestClient]
20170503-06:11:46: [INFO]: object created.  pid = P1_2017122231145111 [org.dataone.integration.ContextAwareTestCaseDataone]
20170503-06:11:46: [WARN]: registering ConnectionManager... [org.dataone.client.utils.HttpConnectionMonitorService]
20170503-06:11:56: [INFO]: Created SID (S1_2017122231145113) and head PID (P1_2017122231145111) pair. [org.dataone.integration.ContextAwareTestCaseDataone]
20170503-06:11:57: [INFO]: RestClient.doRequestNoBody, thread(1) call Info: GET https://test.arcticdata.io/metacat/d1/mn/v2/isAuthorized/S1_2017122231145113?action=read [org.dataone.client.rest.RestClient]
20170503-06:11:57: [INFO]: RestClient.doRequestNoBody, thread(1) call Info: GET https://test.arcticdata.io/metacat/d1/mn/v2/isAuthorized/P1_2017122231145111?action=read [org.dataone.client.rest.RestClient]
20170503-06:11:57: [INFO]: RestClient.doRequestNoBody, thread(1) call Info: GET https://test.arcticdata.io/metacat/d1/mn/v2/isAuthorized/S1_2017122231145113?action=write [org.dataone.client.rest.RestClient]
20170503-06:11:58: [INFO]: RestClient.doRequestNoBody, thread(1) call Info: GET https://test.arcticdata.io/metacat/d1/mn/v2/isAuthorized/P1_2017122231145111?action=write [org.dataone.client.rest.RestClient]
20170503-06:11:58: [INFO]: RestClient.doRequestNoBody, thread(1) call Info: GET https://test.arcticdata.io/metacat/d1/mn/v2/isAuthorized/S1_2017122231145113?action=changePermission [org.dataone.client.rest.RestClient]
20170503-06:11:58: [INFO]: RestClient.doRequestNoBody, thread(1) call Info: GET https://test.arcticdata.io/metacat/d1/mn/v2/isAuthorized/P1_2017122231145111?action=changePermission [org.dataone.client.rest.RestClient]
20170503-06:11:58: [INFO]: created client for certificate file: cnStageUNM1 with subject: CN=urn:node:cnStageUNM1,DC=dataone,DC=org [org.dataone.integration.ContextAwareTestCaseDataone]
20170503-06:11:58: [INFO]: CREATING test object... pid: P1_2017122231158769 with a sid: S1_2017122231158771 obsoletes: null obsoletedBy: null [org.dataone.integration.ContextAwareTestCaseDataone]
20170503-06:11:58: [INFO]: created client for certificate file: testRightsHolder with subject: CN=testRightsHolder,DC=dataone,DC=org [org.dataone.integration.ContextAwareTestCaseDataone]
20170503-06:11:58: [INFO]: certificate directory: /etc/dataone/client/testClientCerts/ [org.dataone.integration.ContextAwareTestCaseDataone]
20170503-06:11:58: [INFO]: certificate filename: cnStageUNM1 [org.dataone.integration.ContextAwareTestCaseDataone]
20170503-06:11:58: [WARN]: registering ConnectionManager... [org.dataone.client.utils.HttpConnectionMonitorService]
20170503-06:11:58: [INFO]: client setup as Subject: CN=urn:node:cnStageUNM1,DC=dataone,DC=org [org.dataone.integration.ContextAwareTestCaseDataone]
20170503-06:11:58: [WARN]: Unable to find a valid authoritative MN to use for the object: P1_2017122231158769 [org.dataone.integration.ContextAwareTestCaseDataone]
20170503-06:11:58: [INFO]: creating a test object.  pid = P1_2017122231158769 on http://dataone.ornith.cornell.edu/metacat/d1/mn/v2 [org.dataone.integration.ContextAwareTestCaseDataone]
20170503-06:11:58: [INFO]: SystemMetadata for pid: P1_2017122231158769
<?xml version="1.0" encoding="UTF-8" standalone="yes"?>
<ns3:systemMetadata xmlns:ns2="http://ns.dataone.org/service/types/v1" xmlns:ns3="http://ns.dataone.org/service/types/v2.0">
    <serialVersion>1</serialVersion>
    <identifier>P1_2017122231158769</identifier>
    <formatId>eml://ecoinformatics.org/eml-2.0.1</formatId>
    <size>17181</size>
    <checksum algorithm="MD5">03ce09c6b4c3efc1681f3023402998a2</checksum>
    <submitter>CN=urn:node:cnStageUNM1,DC=dataone,DC=org</submitter>
    <rightsHolder>CN=testRightsHolder,DC=dataone,DC=org</rightsHolder>
    <accessPolicy>
        <allow>
            <subject>public</subject>
            <permission>read</permission>
        </allow>
    </accessPolicy>
    <dateUploaded>2017-05-03T06:11:58.781+00:00</dateUploaded>
    <dateSysMetadataModified>2017-05-03T06:11:58.781+00:00</dateSysMetadataModified>
    <originMemberNode>bogusAuthoritativeNode</originMemberNode>
    <authoritativeMemberNode>bogusAuthoritativeNode</authoritativeMemberNode>
    <seriesId>S1_2017122231158771</seriesId>
</ns3:systemMetadata>
 [org.dataone.integration.ContextAwareTestCaseDataone]
20170503-06:12:00: [INFO]: RestClient.doRequestMMPBody, thread(1) call Info: POST http://dataone.ornith.cornell.edu/metacat/d1/mn/v2/object; MMP message has: ParamPart:pid = P1_2017122231158769; FilePart:object = /tmp/mmp.output.8991088402004978969.tmp (17181 bytes); FilePart:sysmeta = /tmp/mmp.output.1848515736773708601.tmp (1073 bytes);  [org.dataone.client.rest.RestClient]
20170503-06:12:00: [WARN]: registering ConnectionManager... [org.dataone.client.utils.HttpConnectionMonitorService]
java.lang.reflect.InvocationTargetException
	at sun.reflect.GeneratedMethodAccessor48.invoke(Unknown Source)
	at sun.reflect.DelegatingMethodAccessorImpl.invoke(DelegatingMethodAccessorImpl.java:43)
	at java.lang.reflect.Method.invoke(Method.java:606)
	at org.dataone.integration.it.testImplementations.SidCommonTestImplementations.testIsAuthorized(SidCommonTestImplementations.java:628)
	at sun.reflect.NativeMethodAccessorImpl.invoke0(Native Method)
	at sun.reflect.NativeMethodAccessorImpl.invoke(NativeMethodAccessorImpl.java:57)
	at sun.reflect.DelegatingMethodAccessorImpl.invoke(DelegatingMethodAccessorImpl.java:43)
	at java.lang.reflect.Method.invoke(Method.java:606)
	at org.junit.runners.model.FrameworkMethod$1.runReflectiveCall(FrameworkMethod.java:44)
	at org.junit.internal.runners.model.ReflectiveCallable.run(ReflectiveCallable.java:15)
	at org.junit.runners.model.FrameworkMethod.invokeExplosively(FrameworkMethod.java:41)
	at org.junit.internal.runners.statements.InvokeMethod.evaluate(InvokeMethod.java:20)
	at org.junit.rules.Verifier$1.evaluate(Verifier.java:34)
	at org.junit.internal.runners.statements.RunBefores.evaluate(RunBefores.java:28)
	at org.junit.runners.BlockJUnit4ClassRunner.runChild(BlockJUnit4ClassRunner.java:76)
	at org.junit.runners.BlockJUnit4ClassRunner.runChild(BlockJUnit4ClassRunner.java:50)
	at org.junit.runners.ParentRunner$3.run(ParentRunner.java:193)
	at org.junit.runners.ParentRunner$1.schedule(ParentRunner.java:52)
	at org.junit.runners.ParentRunner.runChildren(ParentRunner.java:191)
	at org.junit.runners.ParentRunner.access$000(ParentRunner.java:42)
	at org.junit.runners.ParentRunner$2.evaluate(ParentRunner.java:184)
	at org.junit.runners.ParentRunner.run(ParentRunner.java:236)
	at org.apache.maven.surefire.junit4.JUnit4TestSet.execute(JUnit4TestSet.java:53)
	at org.apache.maven.surefire.junit4.JUnit4Provider.executeTestSet(JUnit4Provider.java:119)
	at org.apache.maven.surefire.junit4.JUnit4Provider.invoke(JUnit4Provider.java:101)
	at sun.reflect.NativeMethodAccessorImpl.invoke0(Native Method)
	at sun.reflect.NativeMethodAccessorImpl.invoke(NativeMethodAccessorImpl.java:57)
	at sun.reflect.DelegatingMethodAccessorImpl.invoke(DelegatingMethodAccessorImpl.java:43)
	at java.lang.reflect.Method.invoke(Method.java:606)
	at org.apache.maven.surefire.booter.ProviderFactory$ClassLoaderProxy.invoke(ProviderFactory.java:103)
	at com.sun.proxy.$Proxy0.invoke(Unknown Source)
	at org.apache.maven.surefire.booter.SurefireStarter.invokeProvider(SurefireStarter.java:150)
	at org.apache.maven.surefire.booter.SurefireStarter.runSuitesInProcess(SurefireStarter.java:91)
	at org.apache.maven.surefire.booter.ForkedBooter.main(ForkedBooter.java:69)
Caused by: org.dataone.client.exception.ClientSideException: Unable to create test object!/Session is required to WRITE to the Node.
	at org.dataone.integration.ContextAwareTestCaseDataone.createTestObject(ContextAwareTestCaseDataone.java:1609)
	at org.dataone.integration.ContextAwareTestCaseDataone.createTestObject(ContextAwareTestCaseDataone.java:1441)
	at org.dataone.integration.it.testImplementations.SidCommonTestImplementations.createTestObject(SidCommonTestImplementations.java:209)
	at org.dataone.integration.it.testImplementations.SidMNTestImplementations.setupMNCase1(SidMNTestImplementations.java:92)
	... 34 more
Caused by: org.dataone.service.exceptions.InvalidToken: Session is required to WRITE to the Node.
	at org.dataone.service.util.ExceptionHandler.deserializeXml(ExceptionHandler.java:628)
	at org.dataone.service.util.ExceptionHandler.deserializeXmlAndThrowException(ExceptionHandler.java:517)
	at org.dataone.service.util.ExceptionHandler.deserializeAndThrowException(ExceptionHandler.java:363)
	at org.dataone.service.util.ExceptionHandler.deserializeAndThrowException(ExceptionHandler.java:313)
	at org.dataone.service.util.ExceptionHandler.filterErrors(ExceptionHandler.java:107)
	at org.dataone.service.util.ExceptionHandler.filterErrors(ExceptionHandler.java:82)
	at org.dataone.client.rest.HttpMultipartRestClient.doPostRequest(HttpMultipartRestClient.java:463)
	at org.dataone.client.v2.impl.MultipartMNode.create(MultipartMNode.java:495)
	at org.dataone.integration.adapters.CommonCallAdapter.create(CommonCallAdapter.java:505)
	at org.dataone.integration.ContextAwareTestCaseDataone.createTestObject(ContextAwareTestCaseDataone.java:1600)
	... 37 more
20170503-06:12:00: [INFO]: created client for certificate file: cnStageUNM1 with subject: CN=urn:node:cnStageUNM1,DC=dataone,DC=org [org.dataone.integration.ContextAwareTestCaseDataone]
20170503-06:12:00: [INFO]: CREATING test object... pid: P1_201712223120485 with a sid: S1_201712223120488 obsoletes: null obsoletedBy: null [org.dataone.integration.ContextAwareTestCaseDataone]
20170503-06:12:00: [INFO]: created client for certificate file: testRightsHolder with subject: CN=testRightsHolder,DC=dataone,DC=org [org.dataone.integration.ContextAwareTestCaseDataone]
20170503-06:12:00: [INFO]: certificate directory: /etc/dataone/client/testClientCerts/ [org.dataone.integration.ContextAwareTestCaseDataone]
20170503-06:12:00: [INFO]: certificate filename: cnStageUNM1 [org.dataone.integration.ContextAwareTestCaseDataone]
20170503-06:12:00: [WARN]: registering ConnectionManager... [org.dataone.client.utils.HttpConnectionMonitorService]
20170503-06:12:00: [INFO]: client setup as Subject: CN=urn:node:cnStageUNM1,DC=dataone,DC=org [org.dataone.integration.ContextAwareTestCaseDataone]
20170503-06:12:00: [WARN]: Unable to find a valid authoritative MN to use for the object: P1_201712223120485 [org.dataone.integration.ContextAwareTestCaseDataone]
20170503-06:12:00: [INFO]: creating a test object.  pid = P1_201712223120485 on https://dataone-test.researchworkspace.com/mn/v2 [org.dataone.integration.ContextAwareTestCaseDataone]
20170503-06:12:00: [INFO]: SystemMetadata for pid: P1_201712223120485
<?xml version="1.0" encoding="UTF-8" standalone="yes"?>
<ns3:systemMetadata xmlns:ns2="http://ns.dataone.org/service/types/v1" xmlns:ns3="http://ns.dataone.org/service/types/v2.0">
    <serialVersion>1</serialVersion>
    <identifier>P1_201712223120485</identifier>
    <formatId>eml://ecoinformatics.org/eml-2.0.1</formatId>
    <size>17181</size>
    <checksum algorithm="MD5">03ce09c6b4c3efc1681f3023402998a2</checksum>
    <submitter>CN=urn:node:cnStageUNM1,DC=dataone,DC=org</submitter>
    <rightsHolder>CN=testRightsHolder,DC=dataone,DC=org</rightsHolder>
    <accessPolicy>
        <allow>
            <subject>public</subject>
            <permission>read</permission>
        </allow>
    </accessPolicy>
    <dateUploaded>2017-05-03T06:12:00.497+00:00</dateUploaded>
    <dateSysMetadataModified>2017-05-03T06:12:00.497+00:00</dateSysMetadataModified>
    <originMemberNode>bogusAuthoritativeNode</originMemberNode>
    <authoritativeMemberNode>bogusAuthoritativeNode</authoritativeMemberNode>
    <seriesId>S1_201712223120488</seriesId>
</ns3:systemMetadata>
 [org.dataone.integration.ContextAwareTestCaseDataone]
20170503-06:12:00: [INFO]: RestClient.doRequestMMPBody, thread(1) call Info: POST https://dataone-test.researchworkspace.com/mn/v2/object; MMP message has: ParamPart:pid = P1_201712223120485; FilePart:object = /tmp/mmp.output.297418291440058811.tmp (17181 bytes); FilePart:sysmeta = /tmp/mmp.output.6996662168819403909.tmp (1071 bytes);  [org.dataone.client.rest.RestClient]
20170503-06:12:00: [INFO]: object created.  pid = P1_201712223120485 [org.dataone.integration.ContextAwareTestCaseDataone]
20170503-06:12:00: [WARN]: registering ConnectionManager... [org.dataone.client.utils.HttpConnectionMonitorService]
20170503-06:12:10: [INFO]: Created SID (S1_201712223120488) and head PID (P1_201712223120485) pair. [org.dataone.integration.ContextAwareTestCaseDataone]
20170503-06:12:11: [INFO]: RestClient.doRequestNoBody, thread(1) call Info: GET https://dataone-test.researchworkspace.com/mn/v2/isAuthorized/S1_201712223120488?action=read [org.dataone.client.rest.RestClient]
20170503-06:12:11: [INFO]: RestClient.doRequestNoBody, thread(1) call Info: GET https://dataone-test.researchworkspace.com/mn/v2/isAuthorized/P1_201712223120485?action=read [org.dataone.client.rest.RestClient]
20170503-06:12:11: [INFO]: RestClient.doRequestNoBody, thread(1) call Info: GET https://dataone-test.researchworkspace.com/mn/v2/isAuthorized/S1_201712223120488?action=write [org.dataone.client.rest.RestClient]
20170503-06:12:11: [INFO]: RestClient.doRequestNoBody, thread(1) call Info: GET https://dataone-test.researchworkspace.com/mn/v2/isAuthorized/P1_201712223120485?action=write [org.dataone.client.rest.RestClient]
20170503-06:12:11: [INFO]: RestClient.doRequestNoBody, thread(1) call Info: GET https://dataone-test.researchworkspace.com/mn/v2/isAuthorized/S1_201712223120488?action=changePermission [org.dataone.client.rest.RestClient]
20170503-06:12:11: [INFO]: RestClient.doRequestNoBody, thread(1) call Info: GET https://dataone-test.researchworkspace.com/mn/v2/isAuthorized/P1_201712223120485?action=changePermission [org.dataone.client.rest.RestClient]
20170503-06:12:11: [INFO]: created client for certificate file: cnStageUNM1 with subject: CN=urn:node:cnStageUNM1,DC=dataone,DC=org [org.dataone.integration.ContextAwareTestCaseDataone]
20170503-06:12:11: [INFO]: CREATING test object... pid: P1_2017122231211956 with a sid: S1_2017122231211958 obsoletes: null obsoletedBy: null [org.dataone.integration.ContextAwareTestCaseDataone]
20170503-06:12:11: [INFO]: created client for certificate file: testRightsHolder with subject: CN=testRightsHolder,DC=dataone,DC=org [org.dataone.integration.ContextAwareTestCaseDataone]
20170503-06:12:11: [INFO]: certificate directory: /etc/dataone/client/testClientCerts/ [org.dataone.integration.ContextAwareTestCaseDataone]
20170503-06:12:11: [INFO]: certificate filename: cnStageUNM1 [org.dataone.integration.ContextAwareTestCaseDataone]
20170503-06:12:11: [WARN]: registering ConnectionManager... [org.dataone.client.utils.HttpConnectionMonitorService]
20170503-06:12:11: [INFO]: client setup as Subject: CN=urn:node:cnStageUNM1,DC=dataone,DC=org [org.dataone.integration.ContextAwareTestCaseDataone]
20170503-06:12:11: [WARN]: Unable to find a valid authoritative MN to use for the object: P1_2017122231211956 [org.dataone.integration.ContextAwareTestCaseDataone]
20170503-06:12:11: [INFO]: creating a test object.  pid = P1_2017122231211956 on https://gmn-s.edirepository.org/mn/v2 [org.dataone.integration.ContextAwareTestCaseDataone]
20170503-06:12:11: [INFO]: SystemMetadata for pid: P1_2017122231211956
<?xml version="1.0" encoding="UTF-8" standalone="yes"?>
<ns3:systemMetadata xmlns:ns2="http://ns.dataone.org/service/types/v1" xmlns:ns3="http://ns.dataone.org/service/types/v2.0">
    <serialVersion>1</serialVersion>
    <identifier>P1_2017122231211956</identifier>
    <formatId>eml://ecoinformatics.org/eml-2.0.1</formatId>
    <size>17181</size>
    <checksum algorithm="MD5">03ce09c6b4c3efc1681f3023402998a2</checksum>
    <submitter>CN=urn:node:cnStageUNM1,DC=dataone,DC=org</submitter>
    <rightsHolder>CN=testRightsHolder,DC=dataone,DC=org</rightsHolder>
    <accessPolicy>
        <allow>
            <subject>public</subject>
            <permission>read</permission>
        </allow>
    </accessPolicy>
    <dateUploaded>2017-05-03T06:12:11.968+00:00</dateUploaded>
    <dateSysMetadataModified>2017-05-03T06:12:11.968+00:00</dateSysMetadataModified>
    <originMemberNode>bogusAuthoritativeNode</originMemberNode>
    <authoritativeMemberNode>bogusAuthoritativeNode</authoritativeMemberNode>
    <seriesId>S1_2017122231211958</seriesId>
</ns3:systemMetadata>
 [org.dataone.integration.ContextAwareTestCaseDataone]
20170503-06:12:12: [INFO]: RestClient.doRequestMMPBody, thread(1) call Info: POST https://gmn-s.edirepository.org/mn/v2/object; MMP message has: ParamPart:pid = P1_2017122231211956; FilePart:object = /tmp/mmp.output.3233322094839029908.tmp (17181 bytes); FilePart:sysmeta = /tmp/mmp.output.3945854303251738927.tmp (1073 bytes);  [org.dataone.client.rest.RestClient]
20170503-06:12:12: [INFO]: object created.  pid = P1_2017122231211956 [org.dataone.integration.ContextAwareTestCaseDataone]
20170503-06:12:12: [WARN]: registering ConnectionManager... [org.dataone.client.utils.HttpConnectionMonitorService]
20170503-06:12:22: [INFO]: Created SID (S1_2017122231211958) and head PID (P1_2017122231211956) pair. [org.dataone.integration.ContextAwareTestCaseDataone]
20170503-06:12:22: [INFO]: RestClient.doRequestNoBody, thread(1) call Info: GET https://gmn-s.edirepository.org/mn/v2/isAuthorized/S1_2017122231211958?action=read [org.dataone.client.rest.RestClient]
20170503-06:12:22: [INFO]: RestClient.doRequestNoBody, thread(1) call Info: GET https://gmn-s.edirepository.org/mn/v2/isAuthorized/P1_2017122231211956?action=read [org.dataone.client.rest.RestClient]
20170503-06:12:22: [INFO]: RestClient.doRequestNoBody, thread(1) call Info: GET https://gmn-s.edirepository.org/mn/v2/isAuthorized/S1_2017122231211958?action=write [org.dataone.client.rest.RestClient]
20170503-06:12:22: [INFO]: RestClient.doRequestNoBody, thread(1) call Info: GET https://gmn-s.edirepository.org/mn/v2/isAuthorized/P1_2017122231211956?action=write [org.dataone.client.rest.RestClient]
20170503-06:12:22: [INFO]: RestClient.doRequestNoBody, thread(1) call Info: GET https://gmn-s.edirepository.org/mn/v2/isAuthorized/S1_2017122231211958?action=changePermission [org.dataone.client.rest.RestClient]
20170503-06:12:22: [INFO]: RestClient.doRequestNoBody, thread(1) call Info: GET https://gmn-s.edirepository.org/mn/v2/isAuthorized/P1_2017122231211956?action=changePermission [org.dataone.client.rest.RestClient]
20170503-06:12:22: [INFO]: created client for certificate file: cnStageUNM1 with subject: CN=urn:node:cnStageUNM1,DC=dataone,DC=org [org.dataone.integration.ContextAwareTestCaseDataone]
20170503-06:12:22: [INFO]: CREATING test object... pid: P1_2017122231222433 with a sid: S1_2017122231222435 obsoletes: null obsoletedBy: null [org.dataone.integration.ContextAwareTestCaseDataone]
20170503-06:12:22: [INFO]: created client for certificate file: testRightsHolder with subject: CN=testRightsHolder,DC=dataone,DC=org [org.dataone.integration.ContextAwareTestCaseDataone]
20170503-06:12:22: [INFO]: certificate directory: /etc/dataone/client/testClientCerts/ [org.dataone.integration.ContextAwareTestCaseDataone]
20170503-06:12:22: [INFO]: certificate filename: cnStageUNM1 [org.dataone.integration.ContextAwareTestCaseDataone]
20170503-06:12:22: [WARN]: registering ConnectionManager... [org.dataone.client.utils.HttpConnectionMonitorService]
20170503-06:12:22: [INFO]: client setup as Subject: CN=urn:node:cnStageUNM1,DC=dataone,DC=org [org.dataone.integration.ContextAwareTestCaseDataone]
20170503-06:12:22: [WARN]: Unable to find a valid authoritative MN to use for the object: P1_2017122231222433 [org.dataone.integration.ContextAwareTestCaseDataone]
20170503-06:12:22: [INFO]: creating a test object.  pid = P1_2017122231222433 on https://ncei.nceas.ucsb.edu/mn/v2 [org.dataone.integration.ContextAwareTestCaseDataone]
20170503-06:12:22: [INFO]: SystemMetadata for pid: P1_2017122231222433
<?xml version="1.0" encoding="UTF-8" standalone="yes"?>
<ns3:systemMetadata xmlns:ns2="http://ns.dataone.org/service/types/v1" xmlns:ns3="http://ns.dataone.org/service/types/v2.0">
    <serialVersion>1</serialVersion>
    <identifier>P1_2017122231222433</identifier>
    <formatId>eml://ecoinformatics.org/eml-2.0.1</formatId>
    <size>17181</size>
    <checksum algorithm="MD5">03ce09c6b4c3efc1681f3023402998a2</checksum>
    <submitter>CN=urn:node:cnStageUNM1,DC=dataone,DC=org</submitter>
    <rightsHolder>CN=testRightsHolder,DC=dataone,DC=org</rightsHolder>
    <accessPolicy>
        <allow>
            <subject>public</subject>
            <permission>read</permission>
        </allow>
    </accessPolicy>
    <dateUploaded>2017-05-03T06:12:22.445+00:00</dateUploaded>
    <dateSysMetadataModified>2017-05-03T06:12:22.445+00:00</dateSysMetadataModified>
    <originMemberNode>bogusAuthoritativeNode</originMemberNode>
    <authoritativeMemberNode>bogusAuthoritativeNode</authoritativeMemberNode>
    <seriesId>S1_2017122231222435</seriesId>
</ns3:systemMetadata>
 [org.dataone.integration.ContextAwareTestCaseDataone]
20170503-06:12:22: [INFO]: RestClient.doRequestMMPBody, thread(1) call Info: POST https://ncei.nceas.ucsb.edu/mn/v2/object; MMP message has: ParamPart:pid = P1_2017122231222433; FilePart:object = /tmp/mmp.output.3755518526630069497.tmp (17181 bytes); FilePart:sysmeta = /tmp/mmp.output.3915931479101748375.tmp (1073 bytes);  [org.dataone.client.rest.RestClient]
20170503-06:12:22: [INFO]: object created.  pid = P1_2017122231222433 [org.dataone.integration.ContextAwareTestCaseDataone]
20170503-06:12:22: [WARN]: registering ConnectionManager... [org.dataone.client.utils.HttpConnectionMonitorService]
20170503-06:12:32: [INFO]: Created SID (S1_2017122231222435) and head PID (P1_2017122231222433) pair. [org.dataone.integration.ContextAwareTestCaseDataone]
20170503-06:12:32: [INFO]: RestClient.doRequestNoBody, thread(1) call Info: GET https://ncei.nceas.ucsb.edu/mn/v2/isAuthorized/S1_2017122231222435?action=read [org.dataone.client.rest.RestClient]
20170503-06:12:33: [INFO]: RestClient.doRequestNoBody, thread(1) call Info: GET https://ncei.nceas.ucsb.edu/mn/v2/isAuthorized/P1_2017122231222433?action=read [org.dataone.client.rest.RestClient]
20170503-06:12:33: [INFO]: RestClient.doRequestNoBody, thread(1) call Info: GET https://ncei.nceas.ucsb.edu/mn/v2/isAuthorized/S1_2017122231222435?action=write [org.dataone.client.rest.RestClient]
20170503-06:12:33: [INFO]: RestClient.doRequestNoBody, thread(1) call Info: GET https://ncei.nceas.ucsb.edu/mn/v2/isAuthorized/P1_2017122231222433?action=write [org.dataone.client.rest.RestClient]
20170503-06:12:33: [INFO]: RestClient.doRequestNoBody, thread(1) call Info: GET https://ncei.nceas.ucsb.edu/mn/v2/isAuthorized/S1_2017122231222435?action=changePermission [org.dataone.client.rest.RestClient]
20170503-06:12:33: [INFO]: RestClient.doRequestNoBody, thread(1) call Info: GET https://ncei.nceas.ucsb.edu/mn/v2/isAuthorized/P1_2017122231222433?action=changePermission [org.dataone.client.rest.RestClient]
20170503-06:12:33: [INFO]: **************************************************** [org.dataone.integration.ContextAwareTestCaseDataone]
20170503-06:12:33: [INFO]: ***  context label:   STAGE [org.dataone.integration.ContextAwareTestCaseDataone]
20170503-06:12:33: [INFO]: **************************************************** [org.dataone.integration.ContextAwareTestCaseDataone]
20170503-06:12:33: [INFO]: **************************************************** [org.dataone.integration.ContextAwareTestCaseDataone]
                          nodeId  key                       value
=============================================================================================================
20170503-06:12:33: [INFO]: Testing view() method ...  [org.dataone.integration.ContextAwareTestCaseDataone]
20170503-06:12:33: [INFO]: Testing view(), Case1 [org.dataone.integration.ContextAwareTestCaseDataone]
20170503-06:12:33: [INFO]: created client for certificate file: cnStageUNM1 with subject: CN=urn:node:cnStageUNM1,DC=dataone,DC=org [org.dataone.integration.ContextAwareTestCaseDataone]
20170503-06:12:33: [INFO]: RestClient.doRequestNoBody, thread(1) call Info: GET https://mn-stage-ucsb-2.test.dataone.org/knb/d1/mn/v2/monitor/ping [org.dataone.client.rest.RestClient]
20170503-06:12:33: [INFO]: MN included in test: https://mn-stage-ucsb-2.test.dataone.org/knb/d1/mn [org.dataone.integration.ContextAwareTestCaseDataone]
20170503-06:12:33: [INFO]: created client for certificate file: cnStageUNM1 with subject: CN=urn:node:cnStageUNM1,DC=dataone,DC=org [org.dataone.integration.ContextAwareTestCaseDataone]
20170503-06:12:34: [INFO]: RestClient.doRequestNoBody, thread(1) call Info: GET http://seadva-test.d2i.indiana.edu/sead/rest/mn/v2/monitor/ping [org.dataone.client.rest.RestClient]
20170503-06:12:34: [INFO]: MN excluded from test: http://seadva-test.d2i.indiana.edu/sead/rest/mn [org.dataone.integration.ContextAwareTestCaseDataone]
20170503-06:12:34: [INFO]: created client for certificate file: cnStageUNM1 with subject: CN=urn:node:cnStageUNM1,DC=dataone,DC=org [org.dataone.integration.ContextAwareTestCaseDataone]
20170503-06:12:34: [INFO]: RestClient.doRequestNoBody, thread(1) call Info: GET https://mn-demo-11.test.dataone.org/knb/d1/mn/v2/monitor/ping [org.dataone.client.rest.RestClient]
20170503-06:12:34: [INFO]: MN included in test: https://mn-demo-11.test.dataone.org/knb/d1/mn [org.dataone.integration.ContextAwareTestCaseDataone]
20170503-06:12:34: [INFO]: created client for certificate file: cnStageUNM1 with subject: CN=urn:node:cnStageUNM1,DC=dataone,DC=org [org.dataone.integration.ContextAwareTestCaseDataone]
20170503-06:12:34: [INFO]: RestClient.doRequestNoBody, thread(1) call Info: GET https://gmn-s.lternet.edu/mn/v2/monitor/ping [org.dataone.client.rest.RestClient]
20170503-06:12:34: [INFO]: MN included in test: https://gmn-s.lternet.edu/mn [org.dataone.integration.ContextAwareTestCaseDataone]
20170503-06:12:34: [INFO]: created client for certificate file: cnStageUNM1 with subject: CN=urn:node:cnStageUNM1,DC=dataone,DC=org [org.dataone.integration.ContextAwareTestCaseDataone]
20170503-06:12:35: [INFO]: RestClient.doRequestNoBody, thread(1) call Info: GET https://dataone-dev.ecoinformatics.org.au/mn/v2/monitor/ping [org.dataone.client.rest.RestClient]
20170503-06:12:35: [INFO]: MN excluded from test: https://dataone-dev.ecoinformatics.org.au/mn [org.dataone.integration.ContextAwareTestCaseDataone]
20170503-06:12:35: [INFO]: created client for certificate file: cnStageUNM1 with subject: CN=urn:node:cnStageUNM1,DC=dataone,DC=org [org.dataone.integration.ContextAwareTestCaseDataone]
20170503-06:12:36: [INFO]: RestClient.doRequestNoBody, thread(1) call Info: GET http://dataone.neonscience.org/metacat/d1/mn/v2/monitor/ping [org.dataone.client.rest.RestClient]
20170503-06:12:36: [INFO]: MN included in test: http://dataone.neonscience.org/metacat/d1/mn [org.dataone.integration.ContextAwareTestCaseDataone]
20170503-06:12:36: [INFO]: created client for certificate file: cnStageUNM1 with subject: CN=urn:node:cnStageUNM1,DC=dataone,DC=org [org.dataone.integration.ContextAwareTestCaseDataone]
20170503-06:12:36: [INFO]: RestClient.doRequestNoBody, thread(1) call Info: GET https://test.arcticdata.io/metacat/d1/mn/v2/monitor/ping [org.dataone.client.rest.RestClient]
20170503-06:12:36: [INFO]: MN included in test: https://test.arcticdata.io/metacat/d1/mn [org.dataone.integration.ContextAwareTestCaseDataone]
20170503-06:12:36: [INFO]: created client for certificate file: cnStageUNM1 with subject: CN=urn:node:cnStageUNM1,DC=dataone,DC=org [org.dataone.integration.ContextAwareTestCaseDataone]
20170503-06:12:36: [INFO]: RestClient.doRequestNoBody, thread(1) call Info: GET http://dataone.ornith.cornell.edu/metacat/d1/mn/v2/monitor/ping [org.dataone.client.rest.RestClient]
20170503-06:12:36: [INFO]: MN included in test: http://dataone.ornith.cornell.edu/metacat/d1/mn [org.dataone.integration.ContextAwareTestCaseDataone]
20170503-06:12:36: [INFO]: created client for certificate file: cnStageUNM1 with subject: CN=urn:node:cnStageUNM1,DC=dataone,DC=org [org.dataone.integration.ContextAwareTestCaseDataone]
20170503-06:12:37: [INFO]: RestClient.doRequestNoBody, thread(1) call Info: GET https://dataone-test.researchworkspace.com/mn/v2/monitor/ping [org.dataone.client.rest.RestClient]
20170503-06:12:37: [INFO]: MN included in test: https://dataone-test.researchworkspace.com/mn [org.dataone.integration.ContextAwareTestCaseDataone]
20170503-06:12:37: [INFO]: created client for certificate file: cnStageUNM1 with subject: CN=urn:node:cnStageUNM1,DC=dataone,DC=org [org.dataone.integration.ContextAwareTestCaseDataone]
20170503-06:12:37: [INFO]: RestClient.doRequestNoBody, thread(1) call Info: GET https://dataone.lib.uic.edu/metacat/d1/mn/v2/monitor/ping [org.dataone.client.rest.RestClient]
20170503-06:12:37: [INFO]: MN excluded from test: https://dataone.lib.uic.edu/metacat/d1/mn [org.dataone.integration.ContextAwareTestCaseDataone]
20170503-06:12:37: [INFO]: created client for certificate file: cnStageUNM1 with subject: CN=urn:node:cnStageUNM1,DC=dataone,DC=org [org.dataone.integration.ContextAwareTestCaseDataone]
20170503-06:12:37: [INFO]: RestClient.doRequestNoBody, thread(1) call Info: GET https://gmn-s.edirepository.org/mn/v2/monitor/ping [org.dataone.client.rest.RestClient]
20170503-06:12:37: [INFO]: MN included in test: https://gmn-s.edirepository.org/mn [org.dataone.integration.ContextAwareTestCaseDataone]
20170503-06:12:37: [INFO]: created client for certificate file: cnStageUNM1 with subject: CN=urn:node:cnStageUNM1,DC=dataone,DC=org [org.dataone.integration.ContextAwareTestCaseDataone]
20170503-06:12:37: [INFO]: RestClient.doRequestNoBody, thread(1) call Info: GET https://ncei.nceas.ucsb.edu/mn/v2/monitor/ping [org.dataone.client.rest.RestClient]
20170503-06:12:37: [INFO]: MN included in test: https://ncei.nceas.ucsb.edu/mn [org.dataone.integration.ContextAwareTestCaseDataone]
20170503-06:12:37: [INFO]: created client for certificate file: cnStageUNM1 with subject: CN=urn:node:cnStageUNM1,DC=dataone,DC=org [org.dataone.integration.ContextAwareTestCaseDataone]
20170503-06:12:37: [INFO]: CREATING test object... pid: P1_2017122231237918 with a sid: S1_2017122231237920 obsoletes: null obsoletedBy: null [org.dataone.integration.ContextAwareTestCaseDataone]
20170503-06:12:37: [INFO]: created client for certificate file: testRightsHolder with subject: CN=testRightsHolder,DC=dataone,DC=org [org.dataone.integration.ContextAwareTestCaseDataone]
20170503-06:12:37: [INFO]: certificate directory: /etc/dataone/client/testClientCerts/ [org.dataone.integration.ContextAwareTestCaseDataone]
20170503-06:12:37: [INFO]: certificate filename: cnStageUNM1 [org.dataone.integration.ContextAwareTestCaseDataone]
20170503-06:12:37: [WARN]: registering ConnectionManager... [org.dataone.client.utils.HttpConnectionMonitorService]
20170503-06:12:37: [INFO]: client setup as Subject: CN=urn:node:cnStageUNM1,DC=dataone,DC=org [org.dataone.integration.ContextAwareTestCaseDataone]
20170503-06:12:37: [WARN]: Unable to find a valid authoritative MN to use for the object: P1_2017122231237918 [org.dataone.integration.ContextAwareTestCaseDataone]
20170503-06:12:37: [INFO]: creating a test object.  pid = P1_2017122231237918 on https://mn-stage-ucsb-2.test.dataone.org/knb/d1/mn/v2 [org.dataone.integration.ContextAwareTestCaseDataone]
20170503-06:12:37: [INFO]: SystemMetadata for pid: P1_2017122231237918
<?xml version="1.0" encoding="UTF-8" standalone="yes"?>
<ns3:systemMetadata xmlns:ns2="http://ns.dataone.org/service/types/v1" xmlns:ns3="http://ns.dataone.org/service/types/v2.0">
    <serialVersion>1</serialVersion>
    <identifier>P1_2017122231237918</identifier>
    <formatId>eml://ecoinformatics.org/eml-2.0.1</formatId>
    <size>17181</size>
    <checksum algorithm="MD5">03ce09c6b4c3efc1681f3023402998a2</checksum>
    <submitter>CN=urn:node:cnStageUNM1,DC=dataone,DC=org</submitter>
    <rightsHolder>CN=testRightsHolder,DC=dataone,DC=org</rightsHolder>
    <accessPolicy>
        <allow>
            <subject>public</subject>
            <permission>read</permission>
        </allow>
    </accessPolicy>
    <dateUploaded>2017-05-03T06:12:37.930+00:00</dateUploaded>
    <dateSysMetadataModified>2017-05-03T06:12:37.930+00:00</dateSysMetadataModified>
    <originMemberNode>bogusAuthoritativeNode</originMemberNode>
    <authoritativeMemberNode>bogusAuthoritativeNode</authoritativeMemberNode>
    <seriesId>S1_2017122231237920</seriesId>
</ns3:systemMetadata>
 [org.dataone.integration.ContextAwareTestCaseDataone]
20170503-06:12:39: [INFO]: RestClient.doRequestMMPBody, thread(1) call Info: POST https://mn-stage-ucsb-2.test.dataone.org/knb/d1/mn/v2/object; MMP message has: ParamPart:pid = P1_2017122231237918; FilePart:object = /tmp/mmp.output.3740883028106698145.tmp (17181 bytes); FilePart:sysmeta = /tmp/mmp.output.5167373708274861245.tmp (1073 bytes);  [org.dataone.client.rest.RestClient]
20170503-06:12:39: [INFO]: object created.  pid = P1_2017122231237918 [org.dataone.integration.ContextAwareTestCaseDataone]
20170503-06:12:39: [WARN]: registering ConnectionManager... [org.dataone.client.utils.HttpConnectionMonitorService]
20170503-06:12:49: [INFO]: Created SID (S1_2017122231237920) and head PID (P1_2017122231237918) pair. [org.dataone.integration.ContextAwareTestCaseDataone]
20170503-06:12:50: [INFO]: RestClient.doRequestNoBody, thread(1) call Info: GET https://mn-stage-ucsb-2.test.dataone.org/knb/d1/mn/v2/views/default/S1_2017122231237920 [org.dataone.client.rest.RestClient]
20170503-06:12:52: [INFO]: RestClient.doRequestNoBody, thread(1) call Info: GET https://mn-stage-ucsb-2.test.dataone.org/knb/d1/mn/v2/views/default/P1_2017122231237918 [org.dataone.client.rest.RestClient]
20170503-06:12:52: [INFO]: created client for certificate file: cnStageUNM1 with subject: CN=urn:node:cnStageUNM1,DC=dataone,DC=org [org.dataone.integration.ContextAwareTestCaseDataone]
20170503-06:12:52: [INFO]: CREATING test object... pid: P1_201712223125232 with a sid: S1_201712223125234 obsoletes: null obsoletedBy: null [org.dataone.integration.ContextAwareTestCaseDataone]
20170503-06:12:52: [INFO]: created client for certificate file: testRightsHolder with subject: CN=testRightsHolder,DC=dataone,DC=org [org.dataone.integration.ContextAwareTestCaseDataone]
20170503-06:12:52: [INFO]: certificate directory: /etc/dataone/client/testClientCerts/ [org.dataone.integration.ContextAwareTestCaseDataone]
20170503-06:12:52: [INFO]: certificate filename: cnStageUNM1 [org.dataone.integration.ContextAwareTestCaseDataone]
20170503-06:12:52: [WARN]: registering ConnectionManager... [org.dataone.client.utils.HttpConnectionMonitorService]
20170503-06:12:52: [INFO]: client setup as Subject: CN=urn:node:cnStageUNM1,DC=dataone,DC=org [org.dataone.integration.ContextAwareTestCaseDataone]
20170503-06:12:52: [WARN]: Unable to find a valid authoritative MN to use for the object: P1_201712223125232 [org.dataone.integration.ContextAwareTestCaseDataone]
20170503-06:12:52: [INFO]: creating a test object.  pid = P1_201712223125232 on https://mn-demo-11.test.dataone.org/knb/d1/mn/v2 [org.dataone.integration.ContextAwareTestCaseDataone]
20170503-06:12:52: [INFO]: SystemMetadata for pid: P1_201712223125232
<?xml version="1.0" encoding="UTF-8" standalone="yes"?>
<ns3:systemMetadata xmlns:ns2="http://ns.dataone.org/service/types/v1" xmlns:ns3="http://ns.dataone.org/service/types/v2.0">
    <serialVersion>1</serialVersion>
    <identifier>P1_201712223125232</identifier>
    <formatId>eml://ecoinformatics.org/eml-2.0.1</formatId>
    <size>17181</size>
    <checksum algorithm="MD5">03ce09c6b4c3efc1681f3023402998a2</checksum>
    <submitter>CN=urn:node:cnStageUNM1,DC=dataone,DC=org</submitter>
    <rightsHolder>CN=testRightsHolder,DC=dataone,DC=org</rightsHolder>
    <accessPolicy>
        <allow>
            <subject>public</subject>
            <permission>read</permission>
        </allow>
    </accessPolicy>
    <dateUploaded>2017-05-03T06:12:52.044+00:00</dateUploaded>
    <dateSysMetadataModified>2017-05-03T06:12:52.044+00:00</dateSysMetadataModified>
    <originMemberNode>bogusAuthoritativeNode</originMemberNode>
    <authoritativeMemberNode>bogusAuthoritativeNode</authoritativeMemberNode>
    <seriesId>S1_201712223125234</seriesId>
</ns3:systemMetadata>
 [org.dataone.integration.ContextAwareTestCaseDataone]
20170503-06:12:53: [INFO]: RestClient.doRequestMMPBody, thread(1) call Info: POST https://mn-demo-11.test.dataone.org/knb/d1/mn/v2/object; MMP message has: ParamPart:pid = P1_201712223125232; FilePart:object = /tmp/mmp.output.1495452821485060958.tmp (17181 bytes); FilePart:sysmeta = /tmp/mmp.output.8664096046699410182.tmp (1071 bytes);  [org.dataone.client.rest.RestClient]
20170503-06:12:53: [INFO]: object created.  pid = P1_201712223125232 [org.dataone.integration.ContextAwareTestCaseDataone]
20170503-06:12:53: [WARN]: registering ConnectionManager... [org.dataone.client.utils.HttpConnectionMonitorService]
20170503-06:13:03: [INFO]: Created SID (S1_201712223125234) and head PID (P1_201712223125232) pair. [org.dataone.integration.ContextAwareTestCaseDataone]
20170503-06:13:03: [INFO]: RestClient.doRequestNoBody, thread(1) call Info: GET https://mn-demo-11.test.dataone.org/knb/d1/mn/v2/views/default/S1_201712223125234 [org.dataone.client.rest.RestClient]
20170503-06:13:04: [INFO]: RestClient.doRequestNoBody, thread(1) call Info: GET https://mn-demo-11.test.dataone.org/knb/d1/mn/v2/views/default/P1_201712223125232 [org.dataone.client.rest.RestClient]
20170503-06:13:04: [INFO]: created client for certificate file: cnStageUNM1 with subject: CN=urn:node:cnStageUNM1,DC=dataone,DC=org [org.dataone.integration.ContextAwareTestCaseDataone]
20170503-06:13:04: [INFO]: CREATING test object... pid: P1_20171222313446 with a sid: S1_20171222313448 obsoletes: null obsoletedBy: null [org.dataone.integration.ContextAwareTestCaseDataone]
20170503-06:13:04: [INFO]: created client for certificate file: testRightsHolder with subject: CN=testRightsHolder,DC=dataone,DC=org [org.dataone.integration.ContextAwareTestCaseDataone]
20170503-06:13:04: [INFO]: certificate directory: /etc/dataone/client/testClientCerts/ [org.dataone.integration.ContextAwareTestCaseDataone]
20170503-06:13:04: [INFO]: certificate filename: cnStageUNM1 [org.dataone.integration.ContextAwareTestCaseDataone]
20170503-06:13:04: [WARN]: registering ConnectionManager... [org.dataone.client.utils.HttpConnectionMonitorService]
20170503-06:13:04: [INFO]: client setup as Subject: CN=urn:node:cnStageUNM1,DC=dataone,DC=org [org.dataone.integration.ContextAwareTestCaseDataone]
20170503-06:13:04: [WARN]: Unable to find a valid authoritative MN to use for the object: P1_20171222313446 [org.dataone.integration.ContextAwareTestCaseDataone]
20170503-06:13:04: [INFO]: creating a test object.  pid = P1_20171222313446 on https://gmn-s.lternet.edu/mn/v2 [org.dataone.integration.ContextAwareTestCaseDataone]
20170503-06:13:04: [INFO]: SystemMetadata for pid: P1_20171222313446
<?xml version="1.0" encoding="UTF-8" standalone="yes"?>
<ns3:systemMetadata xmlns:ns2="http://ns.dataone.org/service/types/v1" xmlns:ns3="http://ns.dataone.org/service/types/v2.0">
    <serialVersion>1</serialVersion>
    <identifier>P1_20171222313446</identifier>
    <formatId>eml://ecoinformatics.org/eml-2.0.1</formatId>
    <size>17181</size>
    <checksum algorithm="MD5">03ce09c6b4c3efc1681f3023402998a2</checksum>
    <submitter>CN=urn:node:cnStageUNM1,DC=dataone,DC=org</submitter>
    <rightsHolder>CN=testRightsHolder,DC=dataone,DC=org</rightsHolder>
    <accessPolicy>
        <allow>
            <subject>public</subject>
            <permission>read</permission>
        </allow>
    </accessPolicy>
    <dateUploaded>2017-05-03T06:13:04.058+00:00</dateUploaded>
    <dateSysMetadataModified>2017-05-03T06:13:04.058+00:00</dateSysMetadataModified>
    <originMemberNode>bogusAuthoritativeNode</originMemberNode>
    <authoritativeMemberNode>bogusAuthoritativeNode</authoritativeMemberNode>
    <seriesId>S1_20171222313448</seriesId>
</ns3:systemMetadata>
 [org.dataone.integration.ContextAwareTestCaseDataone]
20170503-06:13:04: [INFO]: RestClient.doRequestMMPBody, thread(1) call Info: POST https://gmn-s.lternet.edu/mn/v2/object; MMP message has: ParamPart:pid = P1_20171222313446; FilePart:object = /tmp/mmp.output.6045287209381780456.tmp (17181 bytes); FilePart:sysmeta = /tmp/mmp.output.5853362097390188739.tmp (1069 bytes);  [org.dataone.client.rest.RestClient]
20170503-06:13:04: [INFO]: object created.  pid = P1_20171222313446 [org.dataone.integration.ContextAwareTestCaseDataone]
20170503-06:13:04: [WARN]: registering ConnectionManager... [org.dataone.client.utils.HttpConnectionMonitorService]
20170503-06:13:14: [INFO]: Created SID (S1_20171222313448) and head PID (P1_20171222313446) pair. [org.dataone.integration.ContextAwareTestCaseDataone]
20170503-06:13:14: [INFO]: RestClient.doRequestNoBody, thread(1) call Info: GET https://gmn-s.lternet.edu/mn/v2/views/default/S1_20171222313448 [org.dataone.client.rest.RestClient]
org.dataone.service.exceptions.ServiceFailure: 404: Not Found: parser for deserializing HTML not written yet.  Providing message body:

<!DOCTYPE html>
<html lang="en">
<head>
  <meta http-equiv="content-type" content="text/html; charset=utf-8">
  <title>Page not found at /v2/views/default/S1_20171222313448</title>
  <meta name="robots" content="NONE,NOARCHIVE">
  <style type="text/css">
    html * { padding:0; margin:0; }
    body * { padding:10px 20px; }
    body * * { padding:0; }
    body { font:small sans-serif; background:#eee; }
    body>div { border-bottom:1px solid #ddd; }
    h1 { font-weight:normal; margin-bottom:.4em; }
    h1 span { font-size:60%; color:#666; font-weight:normal; }
    table { border:none; border-collapse: collapse; width:100%; }
    td, th { vertical-align:top; padding:2px 3px; }
    th { width:12em; text-align:right; color:#666; padding-right:.5em; }
    #info { background:#f6f6f6; }
    #info ol { margin: 0.5em 4em; }
    #info ol li { font-family: monospace; }
    #summary { background: #ffc; }
    #explanation { background:#eee; border-bottom: 0px none; }
  </style>
</head>
<body>
  <div id="summary">
    <h1>Page not found <span>(404)</span></h1>
    <table class="meta">
      <tr>
        <th>Request Method:</th>
        <td>GET</td>
      </tr>
      <tr>
        <th>Request URL:</th>
        <td>https://gmn-s.lternet.edu/mn/v2/views/default/S1_20171222313448</td>
      </tr>
      
    </table>
  </div>
  <div id="info">
    
      <p>
      Using the URLconf defined in <code>app.urls</code>,
      Django tried these URL patterns, in this order:
      </p>
      <ol>
        
          <li>
            
                ^v[12]/monitor/ping/?$
                
            
          </li>
        
          <li>
            
                ^v[12]/log/?$
                
            
          </li>
        
          <li>
            
                ^v[12]/?$
                
            
          </li>
        
          <li>
            
                ^v[12]/node/?$
                
            
          </li>
        
          <li>
            
                ^v[12]/object/(.+)$
                
            
          </li>
        
          <li>
            
                ^v[12]/meta/(.+)$
                
            
          </li>
        
          <li>
            
                ^v2/meta$
                
            
          </li>
        
          <li>
            
                ^v[12]/checksum/(.+)$
                
            
          </li>
        
          <li>
            
                ^v[12]/object/?$
                
            
          </li>
        
          <li>
            
                ^v[12]/error/?$
                
            
          </li>
        
          <li>
            
                ^v[12]/replica/(.+)/?$
                
            
          </li>
        
          <li>
            
                ^v[12]/isAuthorized/(.+)/?$
                
            
          </li>
        
          <li>
            
                ^v[12]/dirtySystemMetadata/?$
                
            
          </li>
        
          <li>
            
                ^v[12]/generate/?$
                
            
          </li>
        
          <li>
            
                ^v[12]/archive/(.+)/?$
                
            
          </li>
        
          <li>
            
                ^v[12]/replicate/?$
                
            
          </li>
        
          <li>
            
                ^home/?$
                
            
          </li>
        
          <li>
            
                ^diag/get_replication_queue/?$
                
            
          </li>
        
          <li>
            
                ^diag/echo_session/?$
                
            
          </li>
        
          <li>
            
                ^diag/echo_request_object/?$
                
            
          </li>
        
          <li>
            
                ^diag/echo_raw_post_data/?$
                
            
          </li>
        
          <li>
            
                ^diag$
                
            
          </li>
        
          <li>
            
                ^diag/get_replication_queue$
                
            
          </li>
        
          <li>
            
                ^diag/clear_replication_queue$
                
            
          </li>
        
          <li>
            
                ^diag/set_access_policy/(.+?)$
                
            
          </li>
        
          <li>
            
                ^diag/delete_all_access_policies$
                
            
          </li>
        
          <li>
            
                ^diag/create/(.+)$
                
            
          </li>
        
          <li>
            
                ^diag/slash/(.+?)/(.+?)/(.+?)$
                
            
          </li>
        
          <li>
            
                ^diag/exception/(.+?)$
                
            
          </li>
        
          <li>
            
                ^diag/delete_all_objects$
                
            
          </li>
        
          <li>
            
                ^diag/delete_single_object/(.+?)$
                
            
          </li>
        
          <li>
            
                ^diag/trusted_subjects$
                
            
          </li>
        
          <li>
            
                ^diag/whitelist_subject$
                
            
          </li>
        
          <li>
            
                ^diag/permissions_for_object/(.+?)$
                
            
          </li>
        
          <li>
            
                ^diag/get_setting/(.+)$
                
            
          </li>
        
          <li>
            
                ^diag/delete_event_log$
                
            
          </li>
        
          <li>
            
                ^diag/inject_fictional_event_log$
                
            
          </li>
        
      </ol>
      <p>The current URL, <code>v2/views/default/S1_20171222313448</code>, didn't match any of these.</p>
    
  </div>

  <div id="explanation">
    <p>
      You're seeing this error because you have <code>DEBUG = True</code> in
      your Django settings file. Change that to <code>False</code>, and Django
      will display a standard 404 page.
    </p>
  </div>
</body>
</html>

	at org.dataone.service.util.ExceptionHandler.deserializeHtmlAndThrowException(ExceptionHandler.java:423)
	at org.dataone.service.util.ExceptionHandler.deserializeAndThrowException(ExceptionHandler.java:372)
	at org.dataone.service.util.ExceptionHandler.deserializeAndThrowException(ExceptionHandler.java:313)
	at org.dataone.service.util.ExceptionHandler.filterErrors(ExceptionHandler.java:107)
	at org.dataone.client.rest.HttpMultipartRestClient.doGetRequest(HttpMultipartRestClient.java:343)
	at org.dataone.client.rest.HttpMultipartRestClient.doGetRequest(HttpMultipartRestClient.java:328)
	at org.dataone.client.rest.MultipartD1Node.view(MultipartD1Node.java:902)
	at org.dataone.client.v2.impl.MultipartMNode.view(MultipartMNode.java:709)
	at org.dataone.integration.adapters.CommonCallAdapter.view(CommonCallAdapter.java:596)
	at org.dataone.integration.it.testImplementations.SidCommonTestImplementations.testView(SidCommonTestImplementations.java:722)
	at sun.reflect.NativeMethodAccessorImpl.invoke0(Native Method)
	at sun.reflect.NativeMethodAccessorImpl.invoke(NativeMethodAccessorImpl.java:57)
	at sun.reflect.DelegatingMethodAccessorImpl.invoke(DelegatingMethodAccessorImpl.java:43)
	at java.lang.reflect.Method.invoke(Method.java:606)
	at org.junit.runners.model.FrameworkMethod$1.runReflectiveCall(FrameworkMethod.java:44)
	at org.junit.internal.runners.model.ReflectiveCallable.run(ReflectiveCallable.java:15)
	at org.junit.runners.model.FrameworkMethod.invokeExplosively(FrameworkMethod.java:41)
	at org.junit.internal.runners.statements.InvokeMethod.evaluate(InvokeMethod.java:20)
	at org.junit.rules.Verifier$1.evaluate(Verifier.java:34)
	at org.junit.internal.runners.statements.RunBefores.evaluate(RunBefores.java:28)
	at org.junit.runners.BlockJUnit4ClassRunner.runChild(BlockJUnit4ClassRunner.java:76)
	at org.junit.runners.BlockJUnit4ClassRunner.runChild(BlockJUnit4ClassRunner.java:50)
	at org.junit.runners.ParentRunner$3.run(ParentRunner.java:193)
	at org.junit.runners.ParentRunner$1.schedule(ParentRunner.java:52)
	at org.junit.runners.ParentRunner.runChildren(ParentRunner.java:191)
	at org.junit.runners.ParentRunner.access$000(ParentRunner.java:42)
	at org.junit.runners.ParentRunner$2.evaluate(ParentRunner.java:184)
	at org.junit.runners.ParentRunner.run(ParentRunner.java:236)
	at org.apache.maven.surefire.junit4.JUnit4TestSet.execute(JUnit4TestSet.java:53)
	at org.apache.maven.surefire.junit4.JUnit4Provider.executeTestSet(JUnit4Provider.java:119)
	at org.apache.maven.surefire.junit4.JUnit4Provider.invoke(JUnit4Provider.java:101)
	at sun.reflect.NativeMethodAccessorImpl.invoke0(Native Method)
	at sun.reflect.NativeMethodAccessorImpl.invoke(NativeMethodAccessorImpl.java:57)
	at sun.reflect.DelegatingMethodAccessorImpl.invoke(DelegatingMethodAccessorImpl.java:43)
	at java.lang.reflect.Method.invoke(Method.java:606)
	at org.apache.maven.surefire.booter.ProviderFactory$ClassLoaderProxy.invoke(ProviderFactory.java:103)
	at com.sun.proxy.$Proxy0.invoke(Unknown Source)
	at org.apache.maven.surefire.booter.SurefireStarter.invokeProvider(SurefireStarter.java:150)
	at org.apache.maven.surefire.booter.SurefireStarter.runSuitesInProcess(SurefireStarter.java:91)
	at org.apache.maven.surefire.booter.ForkedBooter.main(ForkedBooter.java:69)
20170503-06:13:14: [INFO]: created client for certificate file: cnStageUNM1 with subject: CN=urn:node:cnStageUNM1,DC=dataone,DC=org [org.dataone.integration.ContextAwareTestCaseDataone]
20170503-06:13:14: [INFO]: CREATING test object... pid: P1_2017122231314547 with a sid: S1_2017122231314549 obsoletes: null obsoletedBy: null [org.dataone.integration.ContextAwareTestCaseDataone]
20170503-06:13:14: [INFO]: created client for certificate file: testRightsHolder with subject: CN=testRightsHolder,DC=dataone,DC=org [org.dataone.integration.ContextAwareTestCaseDataone]
20170503-06:13:14: [INFO]: certificate directory: /etc/dataone/client/testClientCerts/ [org.dataone.integration.ContextAwareTestCaseDataone]
20170503-06:13:14: [INFO]: certificate filename: cnStageUNM1 [org.dataone.integration.ContextAwareTestCaseDataone]
20170503-06:13:14: [WARN]: registering ConnectionManager... [org.dataone.client.utils.HttpConnectionMonitorService]
20170503-06:13:14: [INFO]: client setup as Subject: CN=urn:node:cnStageUNM1,DC=dataone,DC=org [org.dataone.integration.ContextAwareTestCaseDataone]
20170503-06:13:14: [WARN]: Unable to find a valid authoritative MN to use for the object: P1_2017122231314547 [org.dataone.integration.ContextAwareTestCaseDataone]
20170503-06:13:14: [INFO]: creating a test object.  pid = P1_2017122231314547 on http://dataone.neonscience.org/metacat/d1/mn/v2 [org.dataone.integration.ContextAwareTestCaseDataone]
20170503-06:13:14: [INFO]: SystemMetadata for pid: P1_2017122231314547
<?xml version="1.0" encoding="UTF-8" standalone="yes"?>
<ns3:systemMetadata xmlns:ns2="http://ns.dataone.org/service/types/v1" xmlns:ns3="http://ns.dataone.org/service/types/v2.0">
    <serialVersion>1</serialVersion>
    <identifier>P1_2017122231314547</identifier>
    <formatId>eml://ecoinformatics.org/eml-2.0.1</formatId>
    <size>17181</size>
    <checksum algorithm="MD5">03ce09c6b4c3efc1681f3023402998a2</checksum>
    <submitter>CN=urn:node:cnStageUNM1,DC=dataone,DC=org</submitter>
    <rightsHolder>CN=testRightsHolder,DC=dataone,DC=org</rightsHolder>
    <accessPolicy>
        <allow>
            <subject>public</subject>
            <permission>read</permission>
        </allow>
    </accessPolicy>
    <dateUploaded>2017-05-03T06:13:14.559+00:00</dateUploaded>
    <dateSysMetadataModified>2017-05-03T06:13:14.559+00:00</dateSysMetadataModified>
    <originMemberNode>bogusAuthoritativeNode</originMemberNode>
    <authoritativeMemberNode>bogusAuthoritativeNode</authoritativeMemberNode>
    <seriesId>S1_2017122231314549</seriesId>
</ns3:systemMetadata>
 [org.dataone.integration.ContextAwareTestCaseDataone]
20170503-06:13:15: [INFO]: RestClient.doRequestMMPBody, thread(1) call Info: POST http://dataone.neonscience.org/metacat/d1/mn/v2/object; MMP message has: ParamPart:pid = P1_2017122231314547; FilePart:object = /tmp/mmp.output.8248334398200597088.tmp (17181 bytes); FilePart:sysmeta = /tmp/mmp.output.7824476740861878046.tmp (1073 bytes);  [org.dataone.client.rest.RestClient]
20170503-06:13:15: [WARN]: registering ConnectionManager... [org.dataone.client.utils.HttpConnectionMonitorService]
java.lang.reflect.InvocationTargetException
	at sun.reflect.GeneratedMethodAccessor48.invoke(Unknown Source)
	at sun.reflect.DelegatingMethodAccessorImpl.invoke(DelegatingMethodAccessorImpl.java:43)
	at java.lang.reflect.Method.invoke(Method.java:606)
	at org.dataone.integration.it.testImplementations.SidCommonTestImplementations.testView(SidCommonTestImplementations.java:718)
	at sun.reflect.NativeMethodAccessorImpl.invoke0(Native Method)
	at sun.reflect.NativeMethodAccessorImpl.invoke(NativeMethodAccessorImpl.java:57)
	at sun.reflect.DelegatingMethodAccessorImpl.invoke(DelegatingMethodAccessorImpl.java:43)
	at java.lang.reflect.Method.invoke(Method.java:606)
	at org.junit.runners.model.FrameworkMethod$1.runReflectiveCall(FrameworkMethod.java:44)
	at org.junit.internal.runners.model.ReflectiveCallable.run(ReflectiveCallable.java:15)
	at org.junit.runners.model.FrameworkMethod.invokeExplosively(FrameworkMethod.java:41)
	at org.junit.internal.runners.statements.InvokeMethod.evaluate(InvokeMethod.java:20)
	at org.junit.rules.Verifier$1.evaluate(Verifier.java:34)
	at org.junit.internal.runners.statements.RunBefores.evaluate(RunBefores.java:28)
	at org.junit.runners.BlockJUnit4ClassRunner.runChild(BlockJUnit4ClassRunner.java:76)
	at org.junit.runners.BlockJUnit4ClassRunner.runChild(BlockJUnit4ClassRunner.java:50)
	at org.junit.runners.ParentRunner$3.run(ParentRunner.java:193)
	at org.junit.runners.ParentRunner$1.schedule(ParentRunner.java:52)
	at org.junit.runners.ParentRunner.runChildren(ParentRunner.java:191)
	at org.junit.runners.ParentRunner.access$000(ParentRunner.java:42)
	at org.junit.runners.ParentRunner$2.evaluate(ParentRunner.java:184)
	at org.junit.runners.ParentRunner.run(ParentRunner.java:236)
	at org.apache.maven.surefire.junit4.JUnit4TestSet.execute(JUnit4TestSet.java:53)
	at org.apache.maven.surefire.junit4.JUnit4Provider.executeTestSet(JUnit4Provider.java:119)
	at org.apache.maven.surefire.junit4.JUnit4Provider.invoke(JUnit4Provider.java:101)
	at sun.reflect.NativeMethodAccessorImpl.invoke0(Native Method)
	at sun.reflect.NativeMethodAccessorImpl.invoke(NativeMethodAccessorImpl.java:57)
	at sun.reflect.DelegatingMethodAccessorImpl.invoke(DelegatingMethodAccessorImpl.java:43)
	at java.lang.reflect.Method.invoke(Method.java:606)
	at org.apache.maven.surefire.booter.ProviderFactory$ClassLoaderProxy.invoke(ProviderFactory.java:103)
	at com.sun.proxy.$Proxy0.invoke(Unknown Source)
	at org.apache.maven.surefire.booter.SurefireStarter.invokeProvider(SurefireStarter.java:150)
	at org.apache.maven.surefire.booter.SurefireStarter.runSuitesInProcess(SurefireStarter.java:91)
	at org.apache.maven.surefire.booter.ForkedBooter.main(ForkedBooter.java:69)
Caused by: org.dataone.client.exception.ClientSideException: Unable to create test object!/Session is required to WRITE to the Node.
	at org.dataone.integration.ContextAwareTestCaseDataone.createTestObject(ContextAwareTestCaseDataone.java:1609)
	at org.dataone.integration.ContextAwareTestCaseDataone.createTestObject(ContextAwareTestCaseDataone.java:1441)
	at org.dataone.integration.it.testImplementations.SidCommonTestImplementations.createTestObject(SidCommonTestImplementations.java:209)
	at org.dataone.integration.it.testImplementations.SidMNTestImplementations.setupMNCase1(SidMNTestImplementations.java:92)
	... 34 more
Caused by: org.dataone.service.exceptions.InvalidToken: Session is required to WRITE to the Node.
	at org.dataone.service.util.ExceptionHandler.deserializeXml(ExceptionHandler.java:628)
	at org.dataone.service.util.ExceptionHandler.deserializeXmlAndThrowException(ExceptionHandler.java:517)
	at org.dataone.service.util.ExceptionHandler.deserializeAndThrowException(ExceptionHandler.java:363)
	at org.dataone.service.util.ExceptionHandler.deserializeAndThrowException(ExceptionHandler.java:313)
	at org.dataone.service.util.ExceptionHandler.filterErrors(ExceptionHandler.java:107)
	at org.dataone.service.util.ExceptionHandler.filterErrors(ExceptionHandler.java:82)
	at org.dataone.client.rest.HttpMultipartRestClient.doPostRequest(HttpMultipartRestClient.java:463)
	at org.dataone.client.v2.impl.MultipartMNode.create(MultipartMNode.java:495)
	at org.dataone.integration.adapters.CommonCallAdapter.create(CommonCallAdapter.java:505)
	at org.dataone.integration.ContextAwareTestCaseDataone.createTestObject(ContextAwareTestCaseDataone.java:1600)
	... 37 more
20170503-06:13:15: [INFO]: created client for certificate file: cnStageUNM1 with subject: CN=urn:node:cnStageUNM1,DC=dataone,DC=org [org.dataone.integration.ContextAwareTestCaseDataone]
20170503-06:13:15: [INFO]: CREATING test object... pid: P1_201712223131556 with a sid: S1_201712223131558 obsoletes: null obsoletedBy: null [org.dataone.integration.ContextAwareTestCaseDataone]
20170503-06:13:15: [INFO]: created client for certificate file: testRightsHolder with subject: CN=testRightsHolder,DC=dataone,DC=org [org.dataone.integration.ContextAwareTestCaseDataone]
20170503-06:13:15: [INFO]: certificate directory: /etc/dataone/client/testClientCerts/ [org.dataone.integration.ContextAwareTestCaseDataone]
20170503-06:13:15: [INFO]: certificate filename: cnStageUNM1 [org.dataone.integration.ContextAwareTestCaseDataone]
20170503-06:13:15: [WARN]: registering ConnectionManager... [org.dataone.client.utils.HttpConnectionMonitorService]
20170503-06:13:15: [INFO]: client setup as Subject: CN=urn:node:cnStageUNM1,DC=dataone,DC=org [org.dataone.integration.ContextAwareTestCaseDataone]
20170503-06:13:15: [WARN]: Unable to find a valid authoritative MN to use for the object: P1_201712223131556 [org.dataone.integration.ContextAwareTestCaseDataone]
20170503-06:13:15: [INFO]: creating a test object.  pid = P1_201712223131556 on https://test.arcticdata.io/metacat/d1/mn/v2 [org.dataone.integration.ContextAwareTestCaseDataone]
20170503-06:13:15: [INFO]: SystemMetadata for pid: P1_201712223131556
<?xml version="1.0" encoding="UTF-8" standalone="yes"?>
<ns3:systemMetadata xmlns:ns2="http://ns.dataone.org/service/types/v1" xmlns:ns3="http://ns.dataone.org/service/types/v2.0">
    <serialVersion>1</serialVersion>
    <identifier>P1_201712223131556</identifier>
    <formatId>eml://ecoinformatics.org/eml-2.0.1</formatId>
    <size>17181</size>
    <checksum algorithm="MD5">03ce09c6b4c3efc1681f3023402998a2</checksum>
    <submitter>CN=urn:node:cnStageUNM1,DC=dataone,DC=org</submitter>
    <rightsHolder>CN=testRightsHolder,DC=dataone,DC=org</rightsHolder>
    <accessPolicy>
        <allow>
            <subject>public</subject>
            <permission>read</permission>
        </allow>
    </accessPolicy>
    <dateUploaded>2017-05-03T06:13:15.067+00:00</dateUploaded>
    <dateSysMetadataModified>2017-05-03T06:13:15.067+00:00</dateSysMetadataModified>
    <originMemberNode>bogusAuthoritativeNode</originMemberNode>
    <authoritativeMemberNode>bogusAuthoritativeNode</authoritativeMemberNode>
    <seriesId>S1_201712223131558</seriesId>
</ns3:systemMetadata>
 [org.dataone.integration.ContextAwareTestCaseDataone]
20170503-06:13:16: [INFO]: RestClient.doRequestMMPBody, thread(1) call Info: POST https://test.arcticdata.io/metacat/d1/mn/v2/object; MMP message has: ParamPart:pid = P1_201712223131556; FilePart:object = /tmp/mmp.output.6027813430286534662.tmp (17181 bytes); FilePart:sysmeta = /tmp/mmp.output.4644594328305394477.tmp (1071 bytes);  [org.dataone.client.rest.RestClient]
20170503-06:13:16: [INFO]: object created.  pid = P1_201712223131556 [org.dataone.integration.ContextAwareTestCaseDataone]
20170503-06:13:16: [WARN]: registering ConnectionManager... [org.dataone.client.utils.HttpConnectionMonitorService]
20170503-06:13:26: [INFO]: Created SID (S1_201712223131558) and head PID (P1_201712223131556) pair. [org.dataone.integration.ContextAwareTestCaseDataone]
20170503-06:13:28: [INFO]: RestClient.doRequestNoBody, thread(1) call Info: GET https://test.arcticdata.io/metacat/d1/mn/v2/views/default/S1_201712223131558 [org.dataone.client.rest.RestClient]
20170503-06:13:30: [INFO]: RestClient.doRequestNoBody, thread(1) call Info: GET https://test.arcticdata.io/metacat/d1/mn/v2/views/default/P1_201712223131556 [org.dataone.client.rest.RestClient]
20170503-06:13:30: [INFO]: created client for certificate file: cnStageUNM1 with subject: CN=urn:node:cnStageUNM1,DC=dataone,DC=org [org.dataone.integration.ContextAwareTestCaseDataone]
20170503-06:13:30: [INFO]: CREATING test object... pid: P1_2017122231330323 with a sid: S1_2017122231330325 obsoletes: null obsoletedBy: null [org.dataone.integration.ContextAwareTestCaseDataone]
20170503-06:13:30: [INFO]: created client for certificate file: testRightsHolder with subject: CN=testRightsHolder,DC=dataone,DC=org [org.dataone.integration.ContextAwareTestCaseDataone]
20170503-06:13:30: [INFO]: certificate directory: /etc/dataone/client/testClientCerts/ [org.dataone.integration.ContextAwareTestCaseDataone]
20170503-06:13:30: [INFO]: certificate filename: cnStageUNM1 [org.dataone.integration.ContextAwareTestCaseDataone]
20170503-06:13:30: [WARN]: registering ConnectionManager... [org.dataone.client.utils.HttpConnectionMonitorService]
20170503-06:13:30: [INFO]: client setup as Subject: CN=urn:node:cnStageUNM1,DC=dataone,DC=org [org.dataone.integration.ContextAwareTestCaseDataone]
20170503-06:13:30: [WARN]: Unable to find a valid authoritative MN to use for the object: P1_2017122231330323 [org.dataone.integration.ContextAwareTestCaseDataone]
20170503-06:13:30: [INFO]: creating a test object.  pid = P1_2017122231330323 on http://dataone.ornith.cornell.edu/metacat/d1/mn/v2 [org.dataone.integration.ContextAwareTestCaseDataone]
20170503-06:13:30: [INFO]: SystemMetadata for pid: P1_2017122231330323
<?xml version="1.0" encoding="UTF-8" standalone="yes"?>
<ns3:systemMetadata xmlns:ns2="http://ns.dataone.org/service/types/v1" xmlns:ns3="http://ns.dataone.org/service/types/v2.0">
    <serialVersion>1</serialVersion>
    <identifier>P1_2017122231330323</identifier>
    <formatId>eml://ecoinformatics.org/eml-2.0.1</formatId>
    <size>17181</size>
    <checksum algorithm="MD5">03ce09c6b4c3efc1681f3023402998a2</checksum>
    <submitter>CN=urn:node:cnStageUNM1,DC=dataone,DC=org</submitter>
    <rightsHolder>CN=testRightsHolder,DC=dataone,DC=org</rightsHolder>
    <accessPolicy>
        <allow>
            <subject>public</subject>
            <permission>read</permission>
        </allow>
    </accessPolicy>
    <dateUploaded>2017-05-03T06:13:30.335+00:00</dateUploaded>
    <dateSysMetadataModified>2017-05-03T06:13:30.335+00:00</dateSysMetadataModified>
    <originMemberNode>bogusAuthoritativeNode</originMemberNode>
    <authoritativeMemberNode>bogusAuthoritativeNode</authoritativeMemberNode>
    <seriesId>S1_2017122231330325</seriesId>
</ns3:systemMetadata>
 [org.dataone.integration.ContextAwareTestCaseDataone]
20170503-06:13:31: [INFO]: RestClient.doRequestMMPBody, thread(1) call Info: POST http://dataone.ornith.cornell.edu/metacat/d1/mn/v2/object; MMP message has: ParamPart:pid = P1_2017122231330323; FilePart:object = /tmp/mmp.output.8793933720267570632.tmp (17181 bytes); FilePart:sysmeta = /tmp/mmp.output.3649218551223736986.tmp (1073 bytes);  [org.dataone.client.rest.RestClient]
20170503-06:13:31: [WARN]: registering ConnectionManager... [org.dataone.client.utils.HttpConnectionMonitorService]
java.lang.reflect.InvocationTargetException
	at sun.reflect.GeneratedMethodAccessor48.invoke(Unknown Source)
	at sun.reflect.DelegatingMethodAccessorImpl.invoke(DelegatingMethodAccessorImpl.java:43)
	at java.lang.reflect.Method.invoke(Method.java:606)
	at org.dataone.integration.it.testImplementations.SidCommonTestImplementations.testView(SidCommonTestImplementations.java:718)
	at sun.reflect.NativeMethodAccessorImpl.invoke0(Native Method)
	at sun.reflect.NativeMethodAccessorImpl.invoke(NativeMethodAccessorImpl.java:57)
	at sun.reflect.DelegatingMethodAccessorImpl.invoke(DelegatingMethodAccessorImpl.java:43)
	at java.lang.reflect.Method.invoke(Method.java:606)
	at org.junit.runners.model.FrameworkMethod$1.runReflectiveCall(FrameworkMethod.java:44)
	at org.junit.internal.runners.model.ReflectiveCallable.run(ReflectiveCallable.java:15)
	at org.junit.runners.model.FrameworkMethod.invokeExplosively(FrameworkMethod.java:41)
	at org.junit.internal.runners.statements.InvokeMethod.evaluate(InvokeMethod.java:20)
	at org.junit.rules.Verifier$1.evaluate(Verifier.java:34)
	at org.junit.internal.runners.statements.RunBefores.evaluate(RunBefores.java:28)
	at org.junit.runners.BlockJUnit4ClassRunner.runChild(BlockJUnit4ClassRunner.java:76)
	at org.junit.runners.BlockJUnit4ClassRunner.runChild(BlockJUnit4ClassRunner.java:50)
	at org.junit.runners.ParentRunner$3.run(ParentRunner.java:193)
	at org.junit.runners.ParentRunner$1.schedule(ParentRunner.java:52)
	at org.junit.runners.ParentRunner.runChildren(ParentRunner.java:191)
	at org.junit.runners.ParentRunner.access$000(ParentRunner.java:42)
	at org.junit.runners.ParentRunner$2.evaluate(ParentRunner.java:184)
	at org.junit.runners.ParentRunner.run(ParentRunner.java:236)
	at org.apache.maven.surefire.junit4.JUnit4TestSet.execute(JUnit4TestSet.java:53)
	at org.apache.maven.surefire.junit4.JUnit4Provider.executeTestSet(JUnit4Provider.java:119)
	at org.apache.maven.surefire.junit4.JUnit4Provider.invoke(JUnit4Provider.java:101)
	at sun.reflect.NativeMethodAccessorImpl.invoke0(Native Method)
	at sun.reflect.NativeMethodAccessorImpl.invoke(NativeMethodAccessorImpl.java:57)
	at sun.reflect.DelegatingMethodAccessorImpl.invoke(DelegatingMethodAccessorImpl.java:43)
	at java.lang.reflect.Method.invoke(Method.java:606)
	at org.apache.maven.surefire.booter.ProviderFactory$ClassLoaderProxy.invoke(ProviderFactory.java:103)
	at com.sun.proxy.$Proxy0.invoke(Unknown Source)
	at org.apache.maven.surefire.booter.SurefireStarter.invokeProvider(SurefireStarter.java:150)
	at org.apache.maven.surefire.booter.SurefireStarter.runSuitesInProcess(SurefireStarter.java:91)
	at org.apache.maven.surefire.booter.ForkedBooter.main(ForkedBooter.java:69)
Caused by: org.dataone.client.exception.ClientSideException: Unable to create test object!/Session is required to WRITE to the Node.
	at org.dataone.integration.ContextAwareTestCaseDataone.createTestObject(ContextAwareTestCaseDataone.java:1609)
	at org.dataone.integration.ContextAwareTestCaseDataone.createTestObject(ContextAwareTestCaseDataone.java:1441)
	at org.dataone.integration.it.testImplementations.SidCommonTestImplementations.createTestObject(SidCommonTestImplementations.java:209)
	at org.dataone.integration.it.testImplementations.SidMNTestImplementations.setupMNCase1(SidMNTestImplementations.java:92)
	... 34 more
Caused by: org.dataone.service.exceptions.InvalidToken: Session is required to WRITE to the Node.
	at org.dataone.service.util.ExceptionHandler.deserializeXml(ExceptionHandler.java:628)
	at org.dataone.service.util.ExceptionHandler.deserializeXmlAndThrowException(ExceptionHandler.java:517)
	at org.dataone.service.util.ExceptionHandler.deserializeAndThrowException(ExceptionHandler.java:363)
	at org.dataone.service.util.ExceptionHandler.deserializeAndThrowException(ExceptionHandler.java:313)
	at org.dataone.service.util.ExceptionHandler.filterErrors(ExceptionHandler.java:107)
	at org.dataone.service.util.ExceptionHandler.filterErrors(ExceptionHandler.java:82)
	at org.dataone.client.rest.HttpMultipartRestClient.doPostRequest(HttpMultipartRestClient.java:463)
	at org.dataone.client.v2.impl.MultipartMNode.create(MultipartMNode.java:495)
	at org.dataone.integration.adapters.CommonCallAdapter.create(CommonCallAdapter.java:505)
	at org.dataone.integration.ContextAwareTestCaseDataone.createTestObject(ContextAwareTestCaseDataone.java:1600)
	... 37 more
20170503-06:13:31: [INFO]: created client for certificate file: cnStageUNM1 with subject: CN=urn:node:cnStageUNM1,DC=dataone,DC=org [org.dataone.integration.ContextAwareTestCaseDataone]
20170503-06:13:31: [INFO]: CREATING test object... pid: P1_201712223133156 with a sid: S1_201712223133158 obsoletes: null obsoletedBy: null [org.dataone.integration.ContextAwareTestCaseDataone]
20170503-06:13:31: [INFO]: created client for certificate file: testRightsHolder with subject: CN=testRightsHolder,DC=dataone,DC=org [org.dataone.integration.ContextAwareTestCaseDataone]
20170503-06:13:31: [INFO]: certificate directory: /etc/dataone/client/testClientCerts/ [org.dataone.integration.ContextAwareTestCaseDataone]
20170503-06:13:31: [INFO]: certificate filename: cnStageUNM1 [org.dataone.integration.ContextAwareTestCaseDataone]
20170503-06:13:31: [WARN]: registering ConnectionManager... [org.dataone.client.utils.HttpConnectionMonitorService]
20170503-06:13:31: [INFO]: client setup as Subject: CN=urn:node:cnStageUNM1,DC=dataone,DC=org [org.dataone.integration.ContextAwareTestCaseDataone]
20170503-06:13:31: [WARN]: Unable to find a valid authoritative MN to use for the object: P1_201712223133156 [org.dataone.integration.ContextAwareTestCaseDataone]
20170503-06:13:31: [INFO]: creating a test object.  pid = P1_201712223133156 on https://dataone-test.researchworkspace.com/mn/v2 [org.dataone.integration.ContextAwareTestCaseDataone]
20170503-06:13:31: [INFO]: SystemMetadata for pid: P1_201712223133156
<?xml version="1.0" encoding="UTF-8" standalone="yes"?>
<ns3:systemMetadata xmlns:ns2="http://ns.dataone.org/service/types/v1" xmlns:ns3="http://ns.dataone.org/service/types/v2.0">
    <serialVersion>1</serialVersion>
    <identifier>P1_201712223133156</identifier>
    <formatId>eml://ecoinformatics.org/eml-2.0.1</formatId>
    <size>17181</size>
    <checksum algorithm="MD5">03ce09c6b4c3efc1681f3023402998a2</checksum>
    <submitter>CN=urn:node:cnStageUNM1,DC=dataone,DC=org</submitter>
    <rightsHolder>CN=testRightsHolder,DC=dataone,DC=org</rightsHolder>
    <accessPolicy>
        <allow>
            <subject>public</subject>
            <permission>read</permission>
        </allow>
    </accessPolicy>
    <dateUploaded>2017-05-03T06:13:31.068+00:00</dateUploaded>
    <dateSysMetadataModified>2017-05-03T06:13:31.068+00:00</dateSysMetadataModified>
    <originMemberNode>bogusAuthoritativeNode</originMemberNode>
    <authoritativeMemberNode>bogusAuthoritativeNode</authoritativeMemberNode>
    <seriesId>S1_201712223133158</seriesId>
</ns3:systemMetadata>
 [org.dataone.integration.ContextAwareTestCaseDataone]
20170503-06:13:31: [INFO]: RestClient.doRequestMMPBody, thread(1) call Info: POST https://dataone-test.researchworkspace.com/mn/v2/object; MMP message has: ParamPart:pid = P1_201712223133156; FilePart:object = /tmp/mmp.output.887992904638045839.tmp (17181 bytes); FilePart:sysmeta = /tmp/mmp.output.5343306007311209445.tmp (1071 bytes);  [org.dataone.client.rest.RestClient]
20170503-06:13:31: [INFO]: object created.  pid = P1_201712223133156 [org.dataone.integration.ContextAwareTestCaseDataone]
20170503-06:13:31: [WARN]: registering ConnectionManager... [org.dataone.client.utils.HttpConnectionMonitorService]
20170503-06:13:41: [INFO]: Created SID (S1_201712223133158) and head PID (P1_201712223133156) pair. [org.dataone.integration.ContextAwareTestCaseDataone]
20170503-06:13:41: [INFO]: RestClient.doRequestNoBody, thread(1) call Info: GET https://dataone-test.researchworkspace.com/mn/v2/views/default/S1_201712223133158 [org.dataone.client.rest.RestClient]
org.dataone.service.exceptions.ServiceFailure: 500: Internal Server Error: parser for deserializing HTML not written yet.  Providing message body:
<?xml version="1.0" encoding="UTF-8"?>
<!DOCTYPE html
     PUBLIC "-//W3C//DTD XHTML 1.0 Strict//EN"
    "http://www.w3.org/TR/xhtml1/DTD/xhtml1-strict.dtd">
<html xmlns="http://www.w3.org/1999/xhtml" xml:lang="en" lang="en">
  <head>
    <title>500 Internal server error</title>
  </head>
  <body>
    <p>
      <h3 style="color:red;">500 Internal server error</h3>
    </p>
    <p>
      Please notify the administrator.
    </p>
    <p>
      <a href="/">Home</a>
    </p>
  </body>
</html>

	at org.dataone.service.util.ExceptionHandler.deserializeHtmlAndThrowException(ExceptionHandler.java:423)
	at org.dataone.service.util.ExceptionHandler.deserializeAndThrowException(ExceptionHandler.java:372)
	at org.dataone.service.util.ExceptionHandler.deserializeAndThrowException(ExceptionHandler.java:313)
	at org.dataone.service.util.ExceptionHandler.filterErrors(ExceptionHandler.java:107)
	at org.dataone.client.rest.HttpMultipartRestClient.doGetRequest(HttpMultipartRestClient.java:343)
	at org.dataone.client.rest.HttpMultipartRestClient.doGetRequest(HttpMultipartRestClient.java:328)
	at org.dataone.client.rest.MultipartD1Node.view(MultipartD1Node.java:902)
	at org.dataone.client.v2.impl.MultipartMNode.view(MultipartMNode.java:709)
	at org.dataone.integration.adapters.CommonCallAdapter.view(CommonCallAdapter.java:596)
	at org.dataone.integration.it.testImplementations.SidCommonTestImplementations.testView(SidCommonTestImplementations.java:722)
	at sun.reflect.NativeMethodAccessorImpl.invoke0(Native Method)
	at sun.reflect.NativeMethodAccessorImpl.invoke(NativeMethodAccessorImpl.java:57)
	at sun.reflect.DelegatingMethodAccessorImpl.invoke(DelegatingMethodAccessorImpl.java:43)
	at java.lang.reflect.Method.invoke(Method.java:606)
	at org.junit.runners.model.FrameworkMethod$1.runReflectiveCall(FrameworkMethod.java:44)
	at org.junit.internal.runners.model.ReflectiveCallable.run(ReflectiveCallable.java:15)
	at org.junit.runners.model.FrameworkMethod.invokeExplosively(FrameworkMethod.java:41)
	at org.junit.internal.runners.statements.InvokeMethod.evaluate(InvokeMethod.java:20)
	at org.junit.rules.Verifier$1.evaluate(Verifier.java:34)
	at org.junit.internal.runners.statements.RunBefores.evaluate(RunBefores.java:28)
	at org.junit.runners.BlockJUnit4ClassRunner.runChild(BlockJUnit4ClassRunner.java:76)
	at org.junit.runners.BlockJUnit4ClassRunner.runChild(BlockJUnit4ClassRunner.java:50)
	at org.junit.runners.ParentRunner$3.run(ParentRunner.java:193)
	at org.junit.runners.ParentRunner$1.schedule(ParentRunner.java:52)
	at org.junit.runners.ParentRunner.runChildren(ParentRunner.java:191)
	at org.junit.runners.ParentRunner.access$000(ParentRunner.java:42)
	at org.junit.runners.ParentRunner$2.evaluate(ParentRunner.java:184)
	at org.junit.runners.ParentRunner.run(ParentRunner.java:236)
	at org.apache.maven.surefire.junit4.JUnit4TestSet.execute(JUnit4TestSet.java:53)
	at org.apache.maven.surefire.junit4.JUnit4Provider.executeTestSet(JUnit4Provider.java:119)
	at org.apache.maven.surefire.junit4.JUnit4Provider.invoke(JUnit4Provider.java:101)
	at sun.reflect.NativeMethodAccessorImpl.invoke0(Native Method)
	at sun.reflect.NativeMethodAccessorImpl.invoke(NativeMethodAccessorImpl.java:57)
	at sun.reflect.DelegatingMethodAccessorImpl.invoke(DelegatingMethodAccessorImpl.java:43)
	at java.lang.reflect.Method.invoke(Method.java:606)
	at org.apache.maven.surefire.booter.ProviderFactory$ClassLoaderProxy.invoke(ProviderFactory.java:103)
	at com.sun.proxy.$Proxy0.invoke(Unknown Source)
	at org.apache.maven.surefire.booter.SurefireStarter.invokeProvider(SurefireStarter.java:150)
	at org.apache.maven.surefire.booter.SurefireStarter.runSuitesInProcess(SurefireStarter.java:91)
	at org.apache.maven.surefire.booter.ForkedBooter.main(ForkedBooter.java:69)
20170503-06:13:41: [INFO]: created client for certificate file: cnStageUNM1 with subject: CN=urn:node:cnStageUNM1,DC=dataone,DC=org [org.dataone.integration.ContextAwareTestCaseDataone]
20170503-06:13:41: [INFO]: CREATING test object... pid: P1_2017122231341808 with a sid: S1_2017122231341810 obsoletes: null obsoletedBy: null [org.dataone.integration.ContextAwareTestCaseDataone]
20170503-06:13:41: [INFO]: created client for certificate file: testRightsHolder with subject: CN=testRightsHolder,DC=dataone,DC=org [org.dataone.integration.ContextAwareTestCaseDataone]
20170503-06:13:41: [INFO]: certificate directory: /etc/dataone/client/testClientCerts/ [org.dataone.integration.ContextAwareTestCaseDataone]
20170503-06:13:41: [INFO]: certificate filename: cnStageUNM1 [org.dataone.integration.ContextAwareTestCaseDataone]
20170503-06:13:41: [WARN]: registering ConnectionManager... [org.dataone.client.utils.HttpConnectionMonitorService]
20170503-06:13:41: [INFO]: client setup as Subject: CN=urn:node:cnStageUNM1,DC=dataone,DC=org [org.dataone.integration.ContextAwareTestCaseDataone]
20170503-06:13:41: [WARN]: Unable to find a valid authoritative MN to use for the object: P1_2017122231341808 [org.dataone.integration.ContextAwareTestCaseDataone]
20170503-06:13:41: [INFO]: creating a test object.  pid = P1_2017122231341808 on https://gmn-s.edirepository.org/mn/v2 [org.dataone.integration.ContextAwareTestCaseDataone]
20170503-06:13:41: [INFO]: SystemMetadata for pid: P1_2017122231341808
<?xml version="1.0" encoding="UTF-8" standalone="yes"?>
<ns3:systemMetadata xmlns:ns2="http://ns.dataone.org/service/types/v1" xmlns:ns3="http://ns.dataone.org/service/types/v2.0">
    <serialVersion>1</serialVersion>
    <identifier>P1_2017122231341808</identifier>
    <formatId>eml://ecoinformatics.org/eml-2.0.1</formatId>
    <size>17181</size>
    <checksum algorithm="MD5">03ce09c6b4c3efc1681f3023402998a2</checksum>
    <submitter>CN=urn:node:cnStageUNM1,DC=dataone,DC=org</submitter>
    <rightsHolder>CN=testRightsHolder,DC=dataone,DC=org</rightsHolder>
    <accessPolicy>
        <allow>
            <subject>public</subject>
            <permission>read</permission>
        </allow>
    </accessPolicy>
    <dateUploaded>2017-05-03T06:13:41.821+00:00</dateUploaded>
    <dateSysMetadataModified>2017-05-03T06:13:41.821+00:00</dateSysMetadataModified>
    <originMemberNode>bogusAuthoritativeNode</originMemberNode>
    <authoritativeMemberNode>bogusAuthoritativeNode</authoritativeMemberNode>
    <seriesId>S1_2017122231341810</seriesId>
</ns3:systemMetadata>
 [org.dataone.integration.ContextAwareTestCaseDataone]
20170503-06:13:42: [INFO]: RestClient.doRequestMMPBody, thread(1) call Info: POST https://gmn-s.edirepository.org/mn/v2/object; MMP message has: ParamPart:pid = P1_2017122231341808; FilePart:object = /tmp/mmp.output.566173422124462426.tmp (17181 bytes); FilePart:sysmeta = /tmp/mmp.output.5359838802822569494.tmp (1073 bytes);  [org.dataone.client.rest.RestClient]
20170503-06:13:42: [INFO]: object created.  pid = P1_2017122231341808 [org.dataone.integration.ContextAwareTestCaseDataone]
20170503-06:13:42: [WARN]: registering ConnectionManager... [org.dataone.client.utils.HttpConnectionMonitorService]
20170503-06:13:52: [INFO]: Created SID (S1_2017122231341810) and head PID (P1_2017122231341808) pair. [org.dataone.integration.ContextAwareTestCaseDataone]
20170503-06:13:52: [INFO]: RestClient.doRequestNoBody, thread(1) call Info: GET https://gmn-s.edirepository.org/mn/v2/views/default/S1_2017122231341810 [org.dataone.client.rest.RestClient]
org.dataone.service.exceptions.ServiceFailure: 404: Not Found: parser for deserializing HTML not written yet.  Providing message body:

<!DOCTYPE html>
<html lang="en">
<head>
  <meta http-equiv="content-type" content="text/html; charset=utf-8">
  <title>Page not found at /v2/views/default/S1_2017122231341810</title>
  <meta name="robots" content="NONE,NOARCHIVE">
  <style type="text/css">
    html * { padding:0; margin:0; }
    body * { padding:10px 20px; }
    body * * { padding:0; }
    body { font:small sans-serif; background:#eee; }
    body>div { border-bottom:1px solid #ddd; }
    h1 { font-weight:normal; margin-bottom:.4em; }
    h1 span { font-size:60%; color:#666; font-weight:normal; }
    table { border:none; border-collapse: collapse; width:100%; }
    td, th { vertical-align:top; padding:2px 3px; }
    th { width:12em; text-align:right; color:#666; padding-right:.5em; }
    #info { background:#f6f6f6; }
    #info ol { margin: 0.5em 4em; }
    #info ol li { font-family: monospace; }
    #summary { background: #ffc; }
    #explanation { background:#eee; border-bottom: 0px none; }
  </style>
</head>
<body>
  <div id="summary">
    <h1>Page not found <span>(404)</span></h1>
    <table class="meta">
      <tr>
        <th>Request Method:</th>
        <td>GET</td>
      </tr>
      <tr>
        <th>Request URL:</th>
        <td>https://gmn-s.edirepository.org/mn/v2/views/default/S1_2017122231341810</td>
      </tr>
      
    </table>
  </div>
  <div id="info">
    
      <p>
      Using the URLconf defined in <code>app.urls</code>,
      Django tried these URL patterns, in this order:
      </p>
      <ol>
        
          <li>
            
                ^v[12]/monitor/ping/?$
                [name='get_monitor_ping']
            
          </li>
        
          <li>
            
                ^v[12]/log/?$
                [name='get_log']
            
          </li>
        
          <li>
            
                ^v[12]/?$
                [name='get_node']
            
          </li>
        
          <li>
            
                ^v[12]/node/?$
                
            
          </li>
        
          <li>
            
                ^v[12]/object/(.+)$
                [name='dispatch_object']
            
          </li>
        
          <li>
            
                ^v[12]/meta/(.+)$
                [name='get_meta']
            
          </li>
        
          <li>
            
                ^v2/meta$
                [name='put_meta']
            
          </li>
        
          <li>
            
                ^v[12]/checksum/(.+)$
                [name='get_checksum']
            
          </li>
        
          <li>
            
                ^v[12]/object/?$
                [name='dispatch_object_list']
            
          </li>
        
          <li>
            
                ^v[12]/error/?$
                [name='post_error']
            
          </li>
        
          <li>
            
                ^v[12]/replica/(.+)/?$
                [name='get_replica']
            
          </li>
        
          <li>
            
                ^v[12]/isAuthorized/(.+)/?$
                [name='get_is_authorized']
            
          </li>
        
          <li>
            
                ^v[12]/dirtySystemMetadata/?$
                [name='post_refresh_system_metadata']
            
          </li>
        
          <li>
            
                ^v[12]/generate/?$
                [name='post_generate_identifier']
            
          </li>
        
          <li>
            
                ^v[12]/archive/(.+)/?$
                [name='put_archive']
            
          </li>
        
          <li>
            
                ^v[12]/replicate/?$
                [name='post_replicate']
            
          </li>
        
          <li>
            
                ^home/?$
                [name='home']
            
          </li>
        
          <li>
            
                ^diag/get_replication_queue/?$
                [name='get_replication_queue']
            
          </li>
        
          <li>
            
                ^diag/echo_session/?$
                [name='echo_session']
            
          </li>
        
          <li>
            
                ^diag/echo_request_object/?$
                [name='echo_request_object']
            
          </li>
        
          <li>
            
                ^diag/echo_raw_post_data/?$
                [name='echo_raw_post_data']
            
          </li>
        
          <li>
            
                ^diag$
                [name='diag']
            
          </li>
        
          <li>
            
                ^diag/get_replication_queue$
                [name='get_replication_queue']
            
          </li>
        
          <li>
            
                ^diag/clear_replication_queue$
                [name='clear_replication_queue']
            
          </li>
        
          <li>
            
                ^diag/delete_all_access_policies$
                [name='delete_all_access_policies']
            
          </li>
        
          <li>
            
                ^diag/create/(.+)$
                [name='create']
            
          </li>
        
          <li>
            
                ^diag/slash/(.+?)/(.+?)/(.+?)$
                [name='slash']
            
          </li>
        
          <li>
            
                ^diag/exception/(.+?)$
                [name='exception']
            
          </li>
        
          <li>
            
                ^diag/delete_all_objects$
                [name='delete_all_objects_view']
            
          </li>
        
          <li>
            
                ^diag/trusted_subjects$
                [name='trusted_subjects']
            
          </li>
        
          <li>
            
                ^diag/whitelist_subject$
                [name='whitelist_subject']
            
          </li>
        
          <li>
            
                ^diag/permissions_for_object/(.+?)$
                [name='permissions_for_object']
            
          </li>
        
          <li>
            
                ^diag/get_setting/(.+)$
                [name='get_setting']
            
          </li>
        
          <li>
            
                ^diag/delete_event_log$
                [name='delete_event_log']
            
          </li>
        
          <li>
            
                ^diag/inject_fictional_event_log$
                [name='inject_fictional_event_log']
            
          </li>
        
      </ol>
      <p>The current URL, <code>v2/views/default/S1_2017122231341810</code>, didn't match any of these.</p>
    
  </div>

  <div id="explanation">
    <p>
      You're seeing this error because you have <code>DEBUG = True</code> in
      your Django settings file. Change that to <code>False</code>, and Django
      will display a standard 404 page.
    </p>
  </div>
</body>
</html>

	at org.dataone.service.util.ExceptionHandler.deserializeHtmlAndThrowException(ExceptionHandler.java:423)
	at org.dataone.service.util.ExceptionHandler.deserializeAndThrowException(ExceptionHandler.java:372)
	at org.dataone.service.util.ExceptionHandler.deserializeAndThrowException(ExceptionHandler.java:313)
	at org.dataone.service.util.ExceptionHandler.filterErrors(ExceptionHandler.java:107)
	at org.dataone.client.rest.HttpMultipartRestClient.doGetRequest(HttpMultipartRestClient.java:343)
	at org.dataone.client.rest.HttpMultipartRestClient.doGetRequest(HttpMultipartRestClient.java:328)
	at org.dataone.client.rest.MultipartD1Node.view(MultipartD1Node.java:902)
	at org.dataone.client.v2.impl.MultipartMNode.view(MultipartMNode.java:709)
	at org.dataone.integration.adapters.CommonCallAdapter.view(CommonCallAdapter.java:596)
	at org.dataone.integration.it.testImplementations.SidCommonTestImplementations.testView(SidCommonTestImplementations.java:722)
	at sun.reflect.NativeMethodAccessorImpl.invoke0(Native Method)
	at sun.reflect.NativeMethodAccessorImpl.invoke(NativeMethodAccessorImpl.java:57)
	at sun.reflect.DelegatingMethodAccessorImpl.invoke(DelegatingMethodAccessorImpl.java:43)
	at java.lang.reflect.Method.invoke(Method.java:606)
	at org.junit.runners.model.FrameworkMethod$1.runReflectiveCall(FrameworkMethod.java:44)
	at org.junit.internal.runners.model.ReflectiveCallable.run(ReflectiveCallable.java:15)
	at org.junit.runners.model.FrameworkMethod.invokeExplosively(FrameworkMethod.java:41)
	at org.junit.internal.runners.statements.InvokeMethod.evaluate(InvokeMethod.java:20)
	at org.junit.rules.Verifier$1.evaluate(Verifier.java:34)
	at org.junit.internal.runners.statements.RunBefores.evaluate(RunBefores.java:28)
	at org.junit.runners.BlockJUnit4ClassRunner.runChild(BlockJUnit4ClassRunner.java:76)
	at org.junit.runners.BlockJUnit4ClassRunner.runChild(BlockJUnit4ClassRunner.java:50)
	at org.junit.runners.ParentRunner$3.run(ParentRunner.java:193)
	at org.junit.runners.ParentRunner$1.schedule(ParentRunner.java:52)
	at org.junit.runners.ParentRunner.runChildren(ParentRunner.java:191)
	at org.junit.runners.ParentRunner.access$000(ParentRunner.java:42)
	at org.junit.runners.ParentRunner$2.evaluate(ParentRunner.java:184)
	at org.junit.runners.ParentRunner.run(ParentRunner.java:236)
	at org.apache.maven.surefire.junit4.JUnit4TestSet.execute(JUnit4TestSet.java:53)
	at org.apache.maven.surefire.junit4.JUnit4Provider.executeTestSet(JUnit4Provider.java:119)
	at org.apache.maven.surefire.junit4.JUnit4Provider.invoke(JUnit4Provider.java:101)
	at sun.reflect.NativeMethodAccessorImpl.invoke0(Native Method)
	at sun.reflect.NativeMethodAccessorImpl.invoke(NativeMethodAccessorImpl.java:57)
	at sun.reflect.DelegatingMethodAccessorImpl.invoke(DelegatingMethodAccessorImpl.java:43)
	at java.lang.reflect.Method.invoke(Method.java:606)
	at org.apache.maven.surefire.booter.ProviderFactory$ClassLoaderProxy.invoke(ProviderFactory.java:103)
	at com.sun.proxy.$Proxy0.invoke(Unknown Source)
	at org.apache.maven.surefire.booter.SurefireStarter.invokeProvider(SurefireStarter.java:150)
	at org.apache.maven.surefire.booter.SurefireStarter.runSuitesInProcess(SurefireStarter.java:91)
	at org.apache.maven.surefire.booter.ForkedBooter.main(ForkedBooter.java:69)
20170503-06:13:52: [INFO]: created client for certificate file: cnStageUNM1 with subject: CN=urn:node:cnStageUNM1,DC=dataone,DC=org [org.dataone.integration.ContextAwareTestCaseDataone]
20170503-06:13:52: [INFO]: CREATING test object... pid: P1_2017122231352156 with a sid: S1_2017122231352158 obsoletes: null obsoletedBy: null [org.dataone.integration.ContextAwareTestCaseDataone]
20170503-06:13:52: [INFO]: created client for certificate file: testRightsHolder with subject: CN=testRightsHolder,DC=dataone,DC=org [org.dataone.integration.ContextAwareTestCaseDataone]
20170503-06:13:52: [INFO]: certificate directory: /etc/dataone/client/testClientCerts/ [org.dataone.integration.ContextAwareTestCaseDataone]
20170503-06:13:52: [INFO]: certificate filename: cnStageUNM1 [org.dataone.integration.ContextAwareTestCaseDataone]
20170503-06:13:52: [WARN]: registering ConnectionManager... [org.dataone.client.utils.HttpConnectionMonitorService]
20170503-06:13:52: [INFO]: client setup as Subject: CN=urn:node:cnStageUNM1,DC=dataone,DC=org [org.dataone.integration.ContextAwareTestCaseDataone]
20170503-06:13:52: [WARN]: Unable to find a valid authoritative MN to use for the object: P1_2017122231352156 [org.dataone.integration.ContextAwareTestCaseDataone]
20170503-06:13:52: [INFO]: creating a test object.  pid = P1_2017122231352156 on https://ncei.nceas.ucsb.edu/mn/v2 [org.dataone.integration.ContextAwareTestCaseDataone]
20170503-06:13:52: [INFO]: SystemMetadata for pid: P1_2017122231352156
<?xml version="1.0" encoding="UTF-8" standalone="yes"?>
<ns3:systemMetadata xmlns:ns2="http://ns.dataone.org/service/types/v1" xmlns:ns3="http://ns.dataone.org/service/types/v2.0">
    <serialVersion>1</serialVersion>
    <identifier>P1_2017122231352156</identifier>
    <formatId>eml://ecoinformatics.org/eml-2.0.1</formatId>
    <size>17181</size>
    <checksum algorithm="MD5">03ce09c6b4c3efc1681f3023402998a2</checksum>
    <submitter>CN=urn:node:cnStageUNM1,DC=dataone,DC=org</submitter>
    <rightsHolder>CN=testRightsHolder,DC=dataone,DC=org</rightsHolder>
    <accessPolicy>
        <allow>
            <subject>public</subject>
            <permission>read</permission>
        </allow>
    </accessPolicy>
    <dateUploaded>2017-05-03T06:13:52.168+00:00</dateUploaded>
    <dateSysMetadataModified>2017-05-03T06:13:52.168+00:00</dateSysMetadataModified>
    <originMemberNode>bogusAuthoritativeNode</originMemberNode>
    <authoritativeMemberNode>bogusAuthoritativeNode</authoritativeMemberNode>
    <seriesId>S1_2017122231352158</seriesId>
</ns3:systemMetadata>
 [org.dataone.integration.ContextAwareTestCaseDataone]
20170503-06:13:52: [INFO]: RestClient.doRequestMMPBody, thread(1) call Info: POST https://ncei.nceas.ucsb.edu/mn/v2/object; MMP message has: ParamPart:pid = P1_2017122231352156; FilePart:object = /tmp/mmp.output.4948487108390618542.tmp (17181 bytes); FilePart:sysmeta = /tmp/mmp.output.8119972775376856859.tmp (1073 bytes);  [org.dataone.client.rest.RestClient]
20170503-06:13:52: [INFO]: object created.  pid = P1_2017122231352156 [org.dataone.integration.ContextAwareTestCaseDataone]
20170503-06:13:52: [WARN]: registering ConnectionManager... [org.dataone.client.utils.HttpConnectionMonitorService]
20170503-06:14:02: [INFO]: Created SID (S1_2017122231352158) and head PID (P1_2017122231352156) pair. [org.dataone.integration.ContextAwareTestCaseDataone]
20170503-06:14:02: [INFO]: RestClient.doRequestNoBody, thread(1) call Info: GET https://ncei.nceas.ucsb.edu/mn/v2/views/default/S1_2017122231352158 [org.dataone.client.rest.RestClient]
org.dataone.service.exceptions.ServiceFailure: 500: Internal Server Error: parser for deserializing HTML not written yet.  Providing message body:
<?xml version="1.0" encoding="UTF-8"?>
<!DOCTYPE html
     PUBLIC "-//W3C//DTD XHTML 1.0 Strict//EN"
    "http://www.w3.org/TR/xhtml1/DTD/xhtml1-strict.dtd">
<html xmlns="http://www.w3.org/1999/xhtml" xml:lang="en" lang="en">
  <head>
    <title>500 Internal server error</title>
  </head>
  <body>
    <p>
      <h3 style="color:red;">500 Internal server error</h3>
    </p>
    <p>
      Please notify the administrator.
    </p>
    <p>
      <a href="/">Home</a>
    </p>
  </body>
</html>

	at org.dataone.service.util.ExceptionHandler.deserializeHtmlAndThrowException(ExceptionHandler.java:423)
	at org.dataone.service.util.ExceptionHandler.deserializeAndThrowException(ExceptionHandler.java:372)
	at org.dataone.service.util.ExceptionHandler.deserializeAndThrowException(ExceptionHandler.java:313)
	at org.dataone.service.util.ExceptionHandler.filterErrors(ExceptionHandler.java:107)
	at org.dataone.client.rest.HttpMultipartRestClient.doGetRequest(HttpMultipartRestClient.java:343)
	at org.dataone.client.rest.HttpMultipartRestClient.doGetRequest(HttpMultipartRestClient.java:328)
	at org.dataone.client.rest.MultipartD1Node.view(MultipartD1Node.java:902)
	at org.dataone.client.v2.impl.MultipartMNode.view(MultipartMNode.java:709)
	at org.dataone.integration.adapters.CommonCallAdapter.view(CommonCallAdapter.java:596)
	at org.dataone.integration.it.testImplementations.SidCommonTestImplementations.testView(SidCommonTestImplementations.java:722)
	at sun.reflect.NativeMethodAccessorImpl.invoke0(Native Method)
	at sun.reflect.NativeMethodAccessorImpl.invoke(NativeMethodAccessorImpl.java:57)
	at sun.reflect.DelegatingMethodAccessorImpl.invoke(DelegatingMethodAccessorImpl.java:43)
	at java.lang.reflect.Method.invoke(Method.java:606)
	at org.junit.runners.model.FrameworkMethod$1.runReflectiveCall(FrameworkMethod.java:44)
	at org.junit.internal.runners.model.ReflectiveCallable.run(ReflectiveCallable.java:15)
	at org.junit.runners.model.FrameworkMethod.invokeExplosively(FrameworkMethod.java:41)
	at org.junit.internal.runners.statements.InvokeMethod.evaluate(InvokeMethod.java:20)
	at org.junit.rules.Verifier$1.evaluate(Verifier.java:34)
	at org.junit.internal.runners.statements.RunBefores.evaluate(RunBefores.java:28)
	at org.junit.runners.BlockJUnit4ClassRunner.runChild(BlockJUnit4ClassRunner.java:76)
	at org.junit.runners.BlockJUnit4ClassRunner.runChild(BlockJUnit4ClassRunner.java:50)
	at org.junit.runners.ParentRunner$3.run(ParentRunner.java:193)
	at org.junit.runners.ParentRunner$1.schedule(ParentRunner.java:52)
	at org.junit.runners.ParentRunner.runChildren(ParentRunner.java:191)
	at org.junit.runners.ParentRunner.access$000(ParentRunner.java:42)
	at org.junit.runners.ParentRunner$2.evaluate(ParentRunner.java:184)
	at org.junit.runners.ParentRunner.run(ParentRunner.java:236)
	at org.apache.maven.surefire.junit4.JUnit4TestSet.execute(JUnit4TestSet.java:53)
	at org.apache.maven.surefire.junit4.JUnit4Provider.executeTestSet(JUnit4Provider.java:119)
	at org.apache.maven.surefire.junit4.JUnit4Provider.invoke(JUnit4Provider.java:101)
	at sun.reflect.NativeMethodAccessorImpl.invoke0(Native Method)
	at sun.reflect.NativeMethodAccessorImpl.invoke(NativeMethodAccessorImpl.java:57)
	at sun.reflect.DelegatingMethodAccessorImpl.invoke(DelegatingMethodAccessorImpl.java:43)
	at java.lang.reflect.Method.invoke(Method.java:606)
	at org.apache.maven.surefire.booter.ProviderFactory$ClassLoaderProxy.invoke(ProviderFactory.java:103)
	at com.sun.proxy.$Proxy0.invoke(Unknown Source)
	at org.apache.maven.surefire.booter.SurefireStarter.invokeProvider(SurefireStarter.java:150)
	at org.apache.maven.surefire.booter.SurefireStarter.runSuitesInProcess(SurefireStarter.java:91)
	at org.apache.maven.surefire.booter.ForkedBooter.main(ForkedBooter.java:69)
Tests run: 24, Failures: 23, Errors: 0, Skipped: 1, Time elapsed: 995.189 sec <<< FAILURE!

Results :

Failed tests: 
  testGetPackage(org.dataone.integration.it.testImplementations.SidMNTestImplementations): https://gmn-s.lternet.edu/mn/v2 Case: 1 : ServiceFailure : -1 : 404: Not Found: parser for deserializing HTML not written yet.  Providing message body:
  testUpdate(org.dataone.integration.it.testImplementations.SidMNTestImplementations): testUpdate unable to set up : https://gmn-s.lternet.edu/mn/v2 : InvocationTargetException : null
  testSidReuse(org.dataone.integration.it.testImplementations.SidMNTestImplementations): testSidReuse() : unable to set up test! : InvalidRequest : A different SID is already assigned to the obsolescence chain to which the object being created or updated belongs. A SID cannot be changed once it has been has been assigned to a chain. existing_sid="S1_2017122230815", new_sid="S2_2017122230818", pid="P1_201712223088"
  testSidReuseDiffChain(org.dataone.integration.it.testImplementations.SidMNTestImplementations): testSidReuseDiffChain() : unable to set up test! : InvalidRequest : A different SID is already assigned to the obsolescence chain to which the object being created or updated belongs. A SID cannot be changed once it has been has been assigned to a chain. existing_sid="S1_201712223131888", new_sid="S2_201712223131890", pid="P1_201712223131879"
  testGetSystemMetadata(org.dataone.integration.it.testImplementations.SidMNTestImplementations): Case: 0 : nullUnable to create test object!/Session is required to WRITE to the Node.  [for host http://dataone.neonscience.org/metacat/d1/mn/v2 ]
  testGetSystemMetadata(org.dataone.integration.it.testImplementations.SidMNTestImplementations): Case: 0 : nullUnable to create test object!/Session is required to WRITE to the Node.  [for host http://dataone.ornith.cornell.edu/metacat/d1/mn/v2 ]
  testGet(org.dataone.integration.it.testImplementations.SidMNTestImplementations): Case: 0 : nullUnable to create test object!/Session is required to WRITE to the Node.  [for host http://dataone.neonscience.org/metacat/d1/mn/v2 ]
  testGet(org.dataone.integration.it.testImplementations.SidMNTestImplementations): Case: 0 : nullUnable to create test object!/Session is required to WRITE to the Node.  [for host http://dataone.ornith.cornell.edu/metacat/d1/mn/v2 ]
  testDescribe(org.dataone.integration.it.testImplementations.SidMNTestImplementations): Case: 0 : nullUnable to create test object!/Session is required to WRITE to the Node.  [for host http://dataone.neonscience.org/metacat/d1/mn/v2 ]
  testDescribe(org.dataone.integration.it.testImplementations.SidMNTestImplementations): Case: 0 : nullUnable to create test object!/Session is required to WRITE to the Node.  [for host http://dataone.ornith.cornell.edu/metacat/d1/mn/v2 ]
  testCreate(org.dataone.integration.it.testImplementations.SidMNTestImplementations): Session is required to WRITE to the Node.  [for host http://dataone.neonscience.org/metacat/d1/mn/v2 ]
  testCreate(org.dataone.integration.it.testImplementations.SidMNTestImplementations): Session is required to WRITE to the Node.  [for host http://dataone.ornith.cornell.edu/metacat/d1/mn/v2 ]
  testDelete(org.dataone.integration.it.testImplementations.SidMNTestImplementations): Case: 0 : nullUnable to create test object!/Session is required to WRITE to the Node.  [for host POST http://dataone.neonscience.org/metacat/d1/mn/v2/object; MMP message has: ParamPart:pid = P1_20171222382384; FilePart:object = /tmp/mmp.output.3541505371878870419.tmp (17181 bytes); FilePart:sysmeta = /tmp/mmp.output.4241787767582628410.tmp (1069 bytes);  ]
  testDelete(org.dataone.integration.it.testImplementations.SidMNTestImplementations): Case: 0 : nullUnable to create test object!/Session is required to WRITE to the Node.  [for host POST http://dataone.ornith.cornell.edu/metacat/d1/mn/v2/object; MMP message has: ParamPart:pid = P1_20171222384723; FilePart:object = /tmp/mmp.output.173755388439730593.tmp (17181 bytes); FilePart:sysmeta = /tmp/mmp.output.3153072971444034907.tmp (1069 bytes);  ]
  testListObjects(org.dataone.integration.it.testImplementations.SidMNTestImplementations): listObjects() Case 1, filter down to 1 pid expected:<1> but was:<1000>
  testIsAuthorized(org.dataone.integration.it.testImplementations.SidMNTestImplementations): Case: 0 : nullUnable to create test object!/Session is required to WRITE to the Node.  [for host http://dataone.neonscience.org/metacat/d1/mn/v2 ]
  testIsAuthorized(org.dataone.integration.it.testImplementations.SidMNTestImplementations): Case: 0 : nullUnable to create test object!/Session is required to WRITE to the Node.  [for host http://dataone.ornith.cornell.edu/metacat/d1/mn/v2 ]
  testView(org.dataone.integration.it.testImplementations.SidMNTestImplementations): 404: Not Found: parser for deserializing HTML not written yet.  Providing message body:
  testView(org.dataone.integration.it.testImplementations.SidMNTestImplementations): nullUnable to create test object!/Session is required to WRITE to the Node.  [for host http://dataone.neonscience.org/metacat/d1/mn/v2 ]
  testView(org.dataone.integration.it.testImplementations.SidMNTestImplementations): nullUnable to create test object!/Session is required to WRITE to the Node.  [for host http://dataone.ornith.cornell.edu/metacat/d1/mn/v2 ]
  testView(org.dataone.integration.it.testImplementations.SidMNTestImplementations): 500: Internal Server Error: parser for deserializing HTML not written yet.  Providing message body:
  testView(org.dataone.integration.it.testImplementations.SidMNTestImplementations): 404: Not Found: parser for deserializing HTML not written yet.  Providing message body:
  testView(org.dataone.integration.it.testImplementations.SidMNTestImplementations): 500: Internal Server Error: parser for deserializing HTML not written yet.  Providing message body:

Tests run: 24, Failures: 23, Errors: 0, Skipped: 1

[WARNING] File encoding has not been set, using platform encoding UTF-8, i.e. build is platform dependent!
[JENKINS] Recording test results
[INFO] 
[INFO] --- maven-failsafe-plugin:2.8.1:verify (verify) @ d1_integration ---
[INFO] Failsafe report directory: /var/lib/jenkins/jobs/d1_integration_Stage_MN_sid_functional/workspace/target/failsafe-reports
[WARNING] File encoding has not been set, using platform encoding UTF-8, i.e. build is platform dependent!
[ERROR] There are test failures.

Please refer to /var/lib/jenkins/jobs/d1_integration_Stage_MN_sid_functional/workspace/target/failsafe-reports for the individual test results.
[JENKINS] Recording test results
Notifying upstream projects of job completion
Join notifier requires a CauseAction
[INFO] ------------------------------------------------------------------------
[INFO] BUILD SUCCESS
[INFO] ------------------------------------------------------------------------
[INFO] Total time: 17:06.085s
[INFO] Finished at: Wed May 03 06:14:03 UTC 2017
[INFO] Final Memory: 56M/762M
[INFO] ------------------------------------------------------------------------
Waiting for Jenkins to finish collecting data
[JENKINS] Archiving /var/lib/jenkins/jobs/d1_integration_Stage_MN_sid_functional/workspace/pom.xml to org.dataone/d1_integration/2.4-SNAPSHOT/d1_integration-2.4-SNAPSHOT.pom
channel stopped
Notifying upstream projects of job completion
Warning: you have no plugins providing access control for builds, so falling back to legacy behavior of permitting any downstream builds to be triggered
Finished: UNSTABLE